{"text_format":"1","workbook":"xlsx","n_sheets":7,"sheets":["1. INFORMACION ACUMULADA","BOGDATA VS FORMATO R3","BOGDATA VS FORMATO VOL.2","BOGDATA VS FORMATO","WP REVISION ","Proposito_programa","Tipo"],"not_rendered":{"charts":0,"images":1,"macros":1,"external_links":2,"defined_names":24,"comments":0,"pivot_tables":0},"unopened":[],"bounds":{"document_bytes":16777216,"sheet_cells":100000,"rows_first":2000,"rows_last":500,"rows_between":2000,"halvings":0,"cell_chars":16384,"cell_head_chars":4096},"cells_cut":0,"cells_raw":0,"read":"whole","date_system":"1900"}

{"sheet":"1. INFORMACION ACUMULADA","index":0,"n_rows":417,"n_cols":40,"rows_kept":417,"cut":false,"hidden":false,"merged":[[7,36,7,39],[8,36,8,39],[9,36,9,39],[10,36,10,39],[1,0,1,38],[2,0,2,38],[4,0,4,3],[6,0,6,3],[6,34,6,35],[6,36,6,39],[7,0,7,3],[7,34,7,35],[8,34,8,35],[6,17,6,18],[5,0,5,3],[7,17,7,18],[12,2,12,3],[12,8,12,12],[12,15,12,20],[11,0,11,20],[9,34,9,35],[10,34,10,35],[11,28,11,33],[11,34,11,37],[11,21,11,27],[5,8,5,9],[4,8,4,9],[6,8,6,9],[7,8,7,9],[4,28,4,30],[7,20,7,21],[7,22,7,23],[4,37,4,38],[5,37,5,38],[4,17,4,18],[5,17,5,18],[6,20,6,21],[4,20,4,21],[5,20,5,21],[4,22,4,23],[5,22,5,23],[6,22,6,23]]}
[]
["VEEDURIA DISTRITAL - INFORMACIÓN GESTION CONTRACTUAL"]
["DEL 1 DE ENERO AL 31 DE DICIEMBRE DE 2022"]
[]
["1. Entidad",null,null,null,"FONDO DE DESARROLLO LOCAL DE CHAPINERO FDLCH",null,null,"1. Entidad","FONDO DE DESARROLLO LOCAL DE CHAPINERO FDLCH"]
["2. Sector",null,null,null,"SECRETARIA DE GOBIERNO",null,null,"2. Sector","SECRETARIA DE GOBIERNO"]
["3. Presupuesto Disponible Inversión Directa PREDIS (BOGDATA)",null,null,null,24421953191,null,null,"5. Presupuesto Disponible Funcionamiento PREDIS (BOGDATA)",2296264000,null,null,null,null,null,null,null,null,null,null,null,null,null,null,null,null,null,null,null,null,null,null,null,null,null,"7. Nombre de quien diligencia el formato",null,"JIMENA MARIA CARDONA DÍAZ"]
["4. Presupuesto Comprometido de Inversión Directa según PREDIS (BOGDATA)",null,null,null,24296914848,null,null,"6. Presupuesto Comprometido Funcionamiento según PREDIS (BOGDATA)",2292232163,null,null,null,null,null,null,null,null,null,null,null,null,null,null,null,null,null,null,null,null,null,null,null,null,null,"Cargo",null,"PROFESIONAL UNIVERSITARIO"]
[null,null,null,null,null,null,null,null,null,null,null,null,null,null,null,null,null,null,null,null,null,null,null,null,null,null,null,null,null,null,null,null,null,null,"Dependencia",null,"CONTRATACIÓN"]
[null,null,null,null,null,null,null,null,null,null,null,null,null,null,null,null,null,null,null,null,null,null,null,null,null,null,null,null,null,null,null,null,null,null,"Teléfono",null,"601-3820660 Ext. 1017"]
[null,null,null,null,null,null,null,null,null,null,null,null,null,null,null,null,null,null,null,null,null,null,null,null,null,null,null,null,null,null,null,null,null,null,"Correo Electrónico",null,"jimena.cardona@gobiernobogota.gov.co"]
["1- INFORMACION GENERAL",null,null,null,null,null,null,null,null,null,null,null,null,null,null,null,null,null,null,null,null,"2- INFORMACION FINANCIERA",null,null,null,null,null,null,"3 - PLAZOS ",null,null,null,null,null,"4. CESION",null,null,null,"5. ESTADO","6. %  Avance y/o cumplimiento"]
[1,2,3,null,4,5,6,7,8,null,null,null,null,9,10,11,null,null,null,null,null,12,13,14,15,16,17,18,19,20,21,22,23,24,25,26,27,28,29,30]
["Número Contrato","Año","Número de proceso contractual \nSECOP","Link proceso SECOP","Tipo de contrato ","Modalidad de Selección","Procedimiento o causal","Objeto","Afectación","1. Plan de Desarrollo Distrital","Número Programa","3. Equivalencia número de programa","2. Propósito","4. Número Proyecto","Número de proponentes","Número  de Identificación del contratista\n(Cédula o NIT sin puntos, comas ni caracteres especiales y sin digito de verificación)","Nombre del contratista\n  (según el caso: nombres y apellidos o Razón social y Tipo societario)","Naturaleza Jurídica","Número  de Identificación del integrante del Consorcio o U.T.\n(Cédula o NIT sin puntos, comas ni caracteres especiales y sin digito de verificación)","Nombre del Integrante del Consorcio o U.T. y Tipo societario\n (Según el caso: nombres y apellidos o razón social y tipo societario)","% Participación (indicar solo el numero del porcentaje, sin caracteres especiales)","Vigencias futuras","Valor Inicial del contrato","Valor total reducciones \n(En valor negativo)","Número de adiciones","Valor total de adiciones ","Valor Final ","Giros (Valor en pesos)","Fecha de suscripción (DD/MM/AAAA)","Fecha de inicio (DD/MM/AAAA)","Fecha de terminación (DD/MM/AAAA)","Plazo en días","Número de prórrogas","Prorroga en días","Número  de Identificación del cesionario\n(NIT sin digito de verificación)","Nombre cesionario","Fecha cesión\n(DD/MM/AAAA)","Valor cesión","Estado","% Avance y/o Cumplimiento"]
[1,2022,"FDLCH-CPS-001-2022-a","https://community.secop.gov.co/Public/Tendering/OpportunityDetail/Index?noticeUID=CO1.NTC.2595420&isFromPublicArea=True&isModal=true&asPopupView=true","Contratos de prestación de servicios profesionales y de apoyo a la gestión","Contratación directa","Prestación de servicios profesionales y de apoyo a la gestión, o para la ejecución de trabajos artísticos que sólo puedan encomendarse a determinadas personas naturales","Prestar sevicios profesionales especializados para apoyar la organización y estructuracion de la gestión precontractual, contractual y postcontractual que adelante el Fondo de Desarrollo Local de Chapinero.","Inversión","Un nuevo contrato social y ambiental para la Bogotá del Siglo XXI",57,{"$f":"IF(ISERROR(VLOOKUP(K15,[2]Proposito_programa!$C$2:$E$59,2,FALSE)),\" \",VLOOKUP(K15,[2]Proposito_programa!$C$2:$E$59,2,FALSE))","v":"Gestión pública local"},{"$f":"IF(ISERROR(VLOOKUP(K15,[2]Proposito_programa!$C$2:$E$59,3,FALSE)),\" \",VLOOKUP(K15,[2]Proposito_programa!$C$2:$E$59,3,FALSE))","v":"Propósito 5: Construir Bogotá - Región con gobierno abierto, transparente y ciudadanía consciente"},1741,null,79580307,"CESAR FRUTO CORREDOR GOMEZ","Persona Natural",null,null,null,null,60000000,0,1,28750000,{"$f":"+W15+X15+Z15","v":88750000},78000000,"2022-01-18","2022-01-19","2023-01-13",240,1,115,null,null,null,null,"En ejecución",0.9]
{"$rows_left_out":403}
{"sheet":"BOGDATA VS FORMATO R3","index":1,"n_rows":116,"n_cols":6,"rows_kept":116,"cut":false,"hidden":false,"merged":[[10,0,35,0],[11,2,11,3],[11,4,11,5],[13,2,13,3],[13,4,13,5],[15,2,15,3],[0,0,0,5],[1,0,1,1],[3,2,3,3],[3,4,3,5],[5,2,5,3],[5,4,5,5],[15,4,15,5],[17,2,17,3],[17,4,17,5],[19,2,19,3],[19,4,19,5],[21,2,21,3],[21,4,21,5],[7,2,7,3],[7,4,7,5],[9,2,9,3],[9,4,9,5],[29,2,29,3],[29,4,29,5],[31,2,31,3],[31,4,31,5],[33,2,33,3],[33,4,33,5],[23,2,23,3],[23,4,23,5],[25,2,25,3],[25,4,25,5],[27,2,27,3],[27,4,27,5],[41,2,41,3],[41,4,41,5],[43,2,43,3],[43,4,43,5],[45,2,45,3],[45,4,45,5],[35,2,35,3],[35,4,35,5],[37,2,37,3],[37,4,37,5],[39,2,39,3],[39,4,39,5],[53,2,53,3],[53,4,53,5],[55,2,55,3],[55,4,55,5],[57,2,57,3],[57,4,57,5],[47,2,47,3],[47,4,47,5],[49,2,49,3],[49,4,49,5],[51,2,51,3],[51,4,51,5],[65,2,65,3],[65,4,65,5],[67,2,67,3],[67,4,67,5],[69,2,69,3],[69,4,69,5],[59,2,59,3],[59,4,59,5],[61,2,61,3],[61,4,61,5],[63,2,63,3],[63,4,63,5],[77,2,77,3],[77,4,77,5],[79,2,79,3],[79,4,79,5],[81,2,81,3],[81,4,81,5],[71,2,71,3],[71,4,71,5],[73,2,73,3],[73,4,73,5],[75,2,75,3],[75,4,75,5],[89,2,89,3],[89,4,89,5],[91,2,91,3],[91,4,91,5],[93,2,93,3],[93,4,93,5],[83,2,83,3],[83,4,83,5],[85,2,85,3],[85,4,85,5],[87,2,87,3],[87,4,87,5],[101,2,101,3],[101,4,101,5],[103,2,103,3],[103,4,103,5],[105,2,105,3],[105,4,105,5],[95,2,95,3],[95,4,95,5],[97,2,97,3],[97,4,97,5],[99,2,99,3],[99,4,99,5],[113,2,113,3],[113,4,113,5],[115,2,115,3],[115,4,115,5],[107,2,107,3],[107,4,107,5],[109,2,109,3],[109,4,109,5],[111,2,111,3],[111,4,111,5]]}
["BOGDATA- CUADRO ANALISIS- CHAPINERO "]
[null,null,"COMPROMISOS ACUMULADOS BOGDATA","VALOR FINAL","ACUMULADO GIROS BOGDATA","GIROS"]
[null,"FUNCIONAMIENTO",2967215043,2292232163,2245441934,1616461666]
[null,"DIFERENCIAS",{"$f":"C3-D3","v":674982880},null,{"$f":"E3-F3","v":628980268}]
[null,"INVERSION (Comprometido)",24296914848,24296914848,12625638325,12625638325]
[null,"DIFERENCIAS",{"$f":"C5-D5","v":0},null,{"$f":"E5-F5","v":0}]
[null,"Un nuevo contrato social y ambiental para la Bogotá del Siglo XXI",24296914848,24296914848,12625638325,12625638325]
[null,"DIFERENCIAS",{"$f":"C7-D7","v":0},null,{"$f":"E7-F7","v":0}]
[null,"Propósito 1 - Hacer un nuevo contrato social con igualdad de oportunidades para la inclusión social, productiva y política",10947044204,11374611204,7750383775,7750383775]
[null,"DIFERENCIAS",{"$f":"C9-D9","v":-427567000},null,{"$f":"E9-F9","v":0}]
[null,"Subsidios y transferencias para la equidad- Programa 1",4219260970,4219260970,4149404127,4149404127]
[null,"DIFERENCIAS",{"$f":"C11-D11","v":0},null,{"$f":"E11-F11","v":0}]
[null,"Proyecto 1815 ",4219260970,4219260970,4149404127,4149404127]
[null,"DIFERENCIAS",{"$f":"C13-D13","v":0},null,{"$f":"E13-F13","v":0}]
[null,"Sistema Distrital de Cuidado - Programa 6 ",2754038219,2754038219,982662438,982662438]
{"$rows_left_out":102}
{"sheet":"BOGDATA VS FORMATO VOL.2","index":2,"n_rows":116,"n_cols":6,"rows_kept":116,"cut":false,"hidden":false,"merged":[[10,0,35,0],[11,2,11,3],[11,4,11,5],[13,2,13,3],[13,4,13,5],[15,2,15,3],[0,0,0,5],[1,0,1,1],[3,2,3,3],[3,4,3,5],[5,2,5,3],[5,4,5,5],[15,4,15,5],[17,2,17,3],[17,4,17,5],[19,2,19,3],[19,4,19,5],[21,2,21,3],[21,4,21,5],[7,2,7,3],[7,4,7,5],[9,2,9,3],[9,4,9,5],[29,2,29,3],[29,4,29,5],[31,2,31,3],[31,4,31,5],[33,2,33,3],[33,4,33,5],[23,2,23,3],[23,4,23,5],[25,2,25,3],[25,4,25,5],[27,2,27,3],[27,4,27,5],[41,2,41,3],[41,4,41,5],[43,2,43,3],[43,4,43,5],[45,2,45,3],[45,4,45,5],[35,2,35,3],[35,4,35,5],[37,2,37,3],[37,4,37,5],[39,2,39,3],[39,4,39,5],[53,2,53,3],[53,4,53,5],[55,2,55,3],[55,4,55,5],[57,2,57,3],[57,4,57,5],[47,2,47,3],[47,4,47,5],[49,2,49,3],[49,4,49,5],[51,2,51,3],[51,4,51,5],[65,2,65,3],[65,4,65,5],[67,2,67,3],[67,4,67,5],[69,2,69,3],[69,4,69,5],[59,2,59,3],[59,4,59,5],[61,2,61,3],[61,4,61,5],[63,2,63,3],[63,4,63,5],[77,2,77,3],[77,4,77,5],[79,2,79,3],[79,4,79,5],[81,2,81,3],[81,4,81,5],[71,2,71,3],[71,4,71,5],[73,2,73,3],[73,4,73,5],[75,2,75,3],[75,4,75,5],[89,2,89,3],[89,4,89,5],[91,2,91,3],[91,4,91,5],[93,2,93,3],[93,4,93,5],[83,2,83,3],[83,4,83,5],[85,2,85,3],[85,4,85,5],[87,2,87,3],[87,4,87,5],[101,2,101,3],[101,4,101,5],[103,2,103,3],[103,4,103,5],[105,2,105,3],[105,4,105,5],[95,2,95,3],[95,4,95,5],[97,2,97,3],[97,4,97,5],[99,2,99,3],[99,4,99,5],[113,2,113,3],[113,4,113,5],[115,2,115,3],[115,4,115,5],[107,2,107,3],[107,4,107,5],[109,2,109,3],[109,4,109,5],[111,2,111,3],[111,4,111,5]]}
["BOGDATA- CUADRO ANALISIS- CHAPINERO "]
[null,null,"COMPROMISOS ACUMULADOS BOGDATA","VALOR FINAL","ACUMULADO GIROS BOGDATA","GIROS"]
[null,"FUNCIONAMIENTO",2967215043,2292232163,2245441934,1637631580]
[null,"DIFERENCIAS",{"$f":"C3-D3","v":674982880},null,{"$f":"E3-F3","v":607810354}]
[null,"INVERSION (Comprometido)",24296914848,24296914848,12625638325,11888812485]
[null,"DIFERENCIAS",{"$f":"C5-D5","v":0},null,{"$f":"E5-F5","v":736825840}]
[null,"Un nuevo contrato social y ambiental para la Bogotá del Siglo XXI",24296914848,24296914848,12625638325,11888812485]
[null,"DIFERENCIAS",{"$f":"C7-D7","v":0},null,{"$f":"E7-F7","v":736825840}]
[null,"Propósito 1 - Hacer un nuevo contrato social con igualdad de oportunidades para la inclusión social, productiva y política",10947044204,11374611204,7750383775,5352252062]
[null,"DIFERENCIAS",{"$f":"C9-D9","v":-427567000},null,{"$f":"E9-F9","v":2398131713}]
[null,"Subsidios y transferencias para la equidad- Programa 1",4219260970,4219260970,4149404127,3955350970]
[null,"DIFERENCIAS",{"$f":"C11-D11","v":0},null,{"$f":"E11-F11","v":194053157}]
[null,"Proyecto 1815 ",4219260970,4219260970,4149404127,3955350970]
[null,"DIFERENCIAS",{"$f":"C13-D13","v":0},null,{"$f":"E13-F13","v":194053157}]
[null,"Sistema Distrital de Cuidado - Programa 6 ",2754038219,3181605219,982662438,494057956]
{"$rows_left_out":102}
{"sheet":"BOGDATA VS FORMATO","index":3,"n_rows":114,"n_cols":6,"rows_kept":114,"cut":false,"hidden":true,"merged":[[113,2,113,3],[113,4,113,5],[107,2,107,3],[107,4,107,5],[109,2,109,3],[109,4,109,5],[111,2,111,3],[111,4,111,5],[101,2,101,3],[101,4,101,5],[103,2,103,3],[103,4,103,5],[105,2,105,3],[105,4,105,5],[97,2,97,3],[97,4,97,5],[99,2,99,3],[99,4,99,5],[91,2,91,3],[91,4,91,5],[93,2,93,3],[93,4,93,5],[95,2,95,3],[95,4,95,5],[85,2,85,3],[85,4,85,5],[87,2,87,3],[87,4,87,5],[89,2,89,3],[89,4,89,5],[79,2,79,3],[79,4,79,5],[81,2,81,3],[81,4,81,5],[83,2,83,3],[83,4,83,5],[73,2,73,3],[73,4,73,5],[75,2,75,3],[75,4,75,5],[77,2,77,3],[77,4,77,5],[67,2,67,3],[67,4,67,5],[69,2,69,3],[69,4,69,5],[71,2,71,3],[71,4,71,5],[61,2,61,3],[61,4,61,5],[63,2,63,3],[63,4,63,5],[65,2,65,3],[65,4,65,5],[55,2,55,3],[55,4,55,5],[57,2,57,3],[57,4,57,5],[59,2,59,3],[59,4,59,5],[47,2,47,3],[47,4,47,5],[35,2,35,3],[35,4,35,5],[37,2,37,3],[37,4,37,5],[49,2,49,3],[49,4,49,5],[53,2,53,3],[53,4,53,5],[51,2,51,3],[51,4,51,5],[41,2,41,3],[41,4,41,5],[43,2,43,3],[43,4,43,5],[45,2,45,3],[45,4,45,5],[39,2,39,3],[39,4,39,5],[31,2,31,3],[31,4,31,5],[33,2,33,3],[33,4,33,5],[11,2,11,3],[23,2,23,3],[23,4,23,5],[25,2,25,3],[25,4,25,5],[27,2,27,3],[27,4,27,5],[0,0,0,5],[1,0,1,1],[3,2,3,3],[3,4,3,5],[5,2,5,3],[5,4,5,5],[10,0,33,0],[13,2,13,3],[13,4,13,5],[15,2,15,3],[15,4,15,5],[11,4,11,5],[17,2,17,3],[17,4,17,5],[19,2,19,3],[19,4,19,5],[21,2,21,3],[21,4,21,5],[7,2,7,3],[7,4,7,5],[9,2,9,3],[9,4,9,5],[29,2,29,3],[29,4,29,5]]}
["BOGDATA- CUADRO ANALISIS- DASC"]
[null,null,"COMPROMISOS ACUMULADOS BOGDATA","VALOR FINAL","ACUMULADO GIROS BOGDATA","GIROS"]
[null,"FUNCIONAMIENTO",2967215043,2292232163,2245441934,1637631580]
[null,"DIFERENCIAS",{"$f":"C3-D3","v":674982880},null,{"$f":"E3-F3","v":607810354}]
[null,"INVERSION (Comprometido)",24296914848,24296914848,12625638325,11888812485]
[null,"DIFERENCIAS",{"$f":"C5-D5","v":0},null,{"$f":"E5-F5","v":736825840}]
[null,"Un nuevo contrato social y ambiental para la Bogotá del Siglo XXI",24296914848,24296914848,12625638325,11888812485]
[null,"DIFERENCIAS",{"$f":"C7-D7","v":0},null,{"$f":"E7-F7","v":736825840}]
[null,"Propósito 1 - Hacer un nuevo contrato social con igualdad de oportunidades para la inclusión social, productiva y política",10947044204,11374611204,7750383775,5352252062]
[null,"DIFERENCIAS",{"$f":"C9-D9","v":-427567000},null,{"$f":"E9-F9","v":2398131713}]
[null,"Subsidios y transferencias para la equidad- Programa 1",4219260970,104440000,4149404127,84120000]
[null,"DIFERENCIAS",{"$f":"C11-D11","v":4114820970},null,{"$f":"+E11-F11","v":4065284127}]
[null,"Sistema Distrital de Cuidado - Programa 6 ",2754038219,1685955443,982662438,595743101]
[null,"DIFERENCIAS",{"$f":"+C13-D13","v":1068082776},null,{"$f":"+E13-F13","v":386919337}]
[null,"Proyecto 1671 ",1400924332,831046875,665495105,145802599]
{"$rows_left_out":100}
{"sheet":"WP REVISION ","index":4,"n_rows":6,"n_cols":5,"rows_kept":6,"cut":false,"hidden":true,"merged":[[0,0,0,4]]}
[" "]
["Parte","Sección","Ítem ","Pruebas a realizar","Incluir el nombre de la entidad"]
["B",10,"Número de proponentes ","Con un filtro en la columna de la SECCIÓN 5 Modalidad de selección escoja las modalidades de Licitación Pública, Selección Abreviada o Concurso de Méritos y verifique no haya celdas en blanco en la columna de la SECCIÓN 10 Número de proponentes.","No se ha diligenciado las filas 255, 293, 353 "]
["C",15,"Número de adiciones","Verifique que el número de adicciones se haya diligenciado tanto para los contratos como para los contratos de otras vigencias pasadas que tengan adiciones en 2022.","No se ha diligenciado el numero de adiciones de la celda 360, 361, 362, 363, 364, 265, 366, 367,369,370, y 371"]
["D",21,"Fecha de terminación (DD/MM/AAAA)","Verifique que la fecha de suscripción se encuentre consignada para todos los contratos y el formato de la fecha sea (DD/MM/AAAA)","No se encuentran diligenciadas las fechas de  las celdas 360, 361, 362, 363, 364, 365, 366,367, 369, 370, 371 "]
["D",22,"Plazo en días","Verifique que no haya celdas en blanco, excepto para la fila de OTROS GASTOS.","No se encuentran diligenciadas las fechas de  las celdas 167, 168, 172, 173, 360, 361, 362, 363, 364, 365, 366, 367, 369, 370, 371. "]

{"sheet":"Proposito_programa","index":5,"n_rows":59,"n_cols":5,"rows_kept":59,"cut":false,"hidden":false,"merged":[]}
[]
[null,"PDD","No. Programa","Programa","Propósito"]
["Acuerdo 761 2020","Un Nuevo Contrato Social y Ambiental para la Bogotá del Siglo XXI",1,"Subsidios y transferencias para la equidad","Propósito 1: Hacer un nuevo contrato social para incrementar la inclusión social, productiva y política"]
["Pag. 51","Un Nuevo Contrato Social y Ambiental para la Bogotá del Siglo XXI",{"$f":"+C3+1","v":2},"Igualdad de oportunidades y desarrollo de capacidades para las mujeres","Propósito 1: Hacer un nuevo contrato social para incrementar la inclusión social, productiva y política"]
[null,"Un Nuevo Contrato Social y Ambiental para la Bogotá del Siglo XXI",{"$f":"+C4+1","v":3},"Movilidad social integral","Propósito 1: Hacer un nuevo contrato social para incrementar la inclusión social, productiva y política"]
[null,"Un Nuevo Contrato Social y Ambiental para la Bogotá del Siglo XXI",4,"Prevención de la exclusión por razones étnicas, religiosas, sociales, políticas y de orientación sexual","Propósito 1: Hacer un nuevo contrato social para incrementar la inclusión social, productiva y política"]
[null,"Un Nuevo Contrato Social y Ambiental para la Bogotá del Siglo XXI",5,"Promoción de la igualdad, el desarrollo de capacidades y el reconocimiento de las mujeres","Propósito 1: Hacer un nuevo contrato social para incrementar la inclusión social, productiva y política"]
[null,"Un Nuevo Contrato Social y Ambiental para la Bogotá del Siglo XXI",6,"Sistema Distrital de Cuidado","Propósito 1: Hacer un nuevo contrato social para incrementar la inclusión social, productiva y política"]
[null,"Un Nuevo Contrato Social y Ambiental para la Bogotá del Siglo XXI",7,"Mejora de la gestión de instituciones de salud","Propósito 1: Hacer un nuevo contrato social para incrementar la inclusión social, productiva y política"]
[null,"Un Nuevo Contrato Social y Ambiental para la Bogotá del Siglo XXI",8,"Prevención y atención de maternidad temprana","Propósito 1: Hacer un nuevo contrato social para incrementar la inclusión social, productiva y política"]
[null,"Un Nuevo Contrato Social y Ambiental para la Bogotá del Siglo XXI",9,"Prevención y cambios para mejorar la salud de la población","Propósito 1: Hacer un nuevo contrato social para incrementar la inclusión social, productiva y política"]
[null,"Un Nuevo Contrato Social y Ambiental para la Bogotá del Siglo XXI",10,"Salud para la vida y el bienestar","Propósito 1: Hacer un nuevo contrato social para incrementar la inclusión social, productiva y política"]
[null,"Un Nuevo Contrato Social y Ambiental para la Bogotá del Siglo XXI",11,"Salud y bienestar para niñas y niños","Propósito 1: Hacer un nuevo contrato social para incrementar la inclusión social, productiva y política"]
[null,"Un Nuevo Contrato Social y Ambiental para la Bogotá del Siglo XXI",12,"Educación inicial: Bases sólidas para la vida.","Propósito 1: Hacer un nuevo contrato social para incrementar la inclusión social, productiva y política"]
[null,"Un Nuevo Contrato Social y Ambiental para la Bogotá del Siglo XXI",13,"Educación para todos y todas: acceso y permanencia con equidad y énfasis en educación rural","Propósito 1: Hacer un nuevo contrato social para incrementar la inclusión social, productiva y política"]
{"$rows_left_out":45}
{"sheet":"Tipo","index":6,"n_rows":67,"n_cols":5,"rows_kept":67,"cut":false,"hidden":true,"merged":[]}
[null,null,"Modalidad de Selección","afectacion","Naturaleza Jurídica"]
[1,null,"Concurso de méritos","Funcionamiento","Persona Natural"]
[2,null,"Contratación directa","Inversión","Persona Jurídica"]
[3,null,"Contratación mínima cuantia","Operación","Unión Temporal"]
[4,null,"Selección abreviada",null,"Consorcio"]
[5,null,"Licitación pública",null,"Sociedad con objeto único"]
[6,null,"Otros",null,"Persona jurídica extranjera"]
[7,null,"Régimen especial",null,"Sin ánimo de lucro"]
[8,null,null,null,"Cabildo indígena"]
[9,null,null,null,"Consejo comunitario de las comunidades negras"]
[10,null,"Selección abreviada",null,"Organizaciones de segundo nivel"]
[11,null,"Subasta inversa ",null,"Formas o expresiones organizativas, afrocolombianas, raizales y palenqueras"]
[12,null,"Bolsas de productos",null,"Organizaciones de base de comunidades negras "]
[13,null,"Acuerdo marco de precios ",null,"Asociaciones de autoridades tradicionales indígenas"]
[14,null,"Selección abreviada por menor cuantía "]
{"$rows_left_out":52}