{"text_format":"1","workbook":"xlsx","n_sheets":7,"sheets":["1. INFORMACION ACUMULADA","BOGDATA VS FORMATO R3","BOGDATA VS FORMATO VOL.2","BOGDATA VS FORMATO","WP REVISION ","Proposito_programa","Tipo"],"not_rendered":{"charts":0,"images":1,"macros":1,"external_links":2,"defined_names":24,"comments":0,"pivot_tables":0},"unopened":[],"bounds":{"document_bytes":16777216,"sheet_cells":100000,"rows_first":2000,"rows_last":500,"rows_between":2000,"halvings":0,"cell_chars":16384,"cell_head_chars":4096},"cells_cut":0,"cells_raw":0,"read":"whole","date_system":"1900"}

{"sheet":"1. INFORMACION ACUMULADA","index":0,"n_rows":417,"n_cols":40,"rows_kept":417,"cut":false,"hidden":false,"merged":[[7,36,7,39],[8,36,8,39],[9,36,9,39],[10,36,10,39],[1,0,1,38],[2,0,2,38],[4,0,4,3],[6,0,6,3],[6,34,6,35],[6,36,6,39],[7,0,7,3],[7,34,7,35],[8,34,8,35],[6,17,6,18],[5,0,5,3],[7,17,7,18],[12,2,12,3],[12,8,12,12],[12,15,12,20],[11,0,11,20],[9,34,9,35],[10,34,10,35],[11,28,11,33],[11,34,11,37],[11,21,11,27],[5,8,5,9],[4,8,4,9],[6,8,6,9],[7,8,7,9],[4,28,4,30],[7,20,7,21],[7,22,7,23],[4,37,4,38],[5,37,5,38],[4,17,4,18],[5,17,5,18],[6,20,6,21],[4,20,4,21],[5,20,5,21],[4,22,4,23],[5,22,5,23],[6,22,6,23]]}
[]
["VEEDURIA DISTRITAL - INFORMACIÓN GESTION CONTRACTUAL"]
["DEL 1 DE ENERO AL 31 DE DICIEMBRE DE 2022"]
[]
["1. Entidad",null,null,null,"FONDO DE DESARROLLO LOCAL DE CHAPINERO FDLCH",null,null,"1. Entidad","FONDO DE DESARROLLO LOCAL DE CHAPINERO FDLCH"]
["2. Sector",null,null,null,"SECRETARIA DE GOBIERNO",null,null,"2. Sector","SECRETARIA DE GOBIERNO"]
["3. Presupuesto Disponible Inversión Directa PREDIS (BOGDATA)",null,null,null,24421953191,null,null,"5. Presupuesto Disponible Funcionamiento PREDIS (BOGDATA)",2296264000,null,null,null,null,null,null,null,null,null,null,null,null,null,null,null,null,null,null,null,null,null,null,null,null,null,"7. Nombre de quien diligencia el formato",null,"JIMENA MARIA CARDONA DÍAZ"]
["4. Presupuesto Comprometido de Inversión Directa según PREDIS (BOGDATA)",null,null,null,24296914848,null,null,"6. Presupuesto Comprometido Funcionamiento según PREDIS (BOGDATA)",2292232163,null,null,null,null,null,null,null,null,null,null,null,null,null,null,null,null,null,null,null,null,null,null,null,null,null,"Cargo",null,"PROFESIONAL UNIVERSITARIO"]
[null,null,null,null,null,null,null,null,null,null,null,null,null,null,null,null,null,null,null,null,null,null,null,null,null,null,null,null,null,null,null,null,null,null,"Dependencia",null,"CONTRATACIÓN"]
[null,null,null,null,null,null,null,null,null,null,null,null,null,null,null,null,null,null,null,null,null,null,null,null,null,null,null,null,null,null,null,null,null,null,"Teléfono",null,"601-3820660 Ext. 1017"]
[null,null,null,null,null,null,null,null,null,null,null,null,null,null,null,null,null,null,null,null,null,null,null,null,null,null,null,null,null,null,null,null,null,null,"Correo Electrónico",null,"jimena.cardona@gobiernobogota.gov.co"]
["1- INFORMACION GENERAL",null,null,null,null,null,null,null,null,null,null,null,null,null,null,null,null,null,null,null,null,"2- INFORMACION FINANCIERA",null,null,null,null,null,null,"3 - PLAZOS ",null,null,null,null,null,"4. CESION",null,null,null,"5. ESTADO","6. %  Avance y/o cumplimiento"]
[1,2,3,null,4,5,6,7,8,null,null,null,null,9,10,11,null,null,null,null,null,12,13,14,15,16,17,18,19,20,21,22,23,24,25,26,27,28,29,30]
["Número Contrato","Año","Número de proceso contractual \nSECOP","Link proceso SECOP","Tipo de contrato ","Modalidad de Selección","Procedimiento o causal","Objeto","Afectación","1. Plan de Desarrollo Distrital","Número Programa","3. Equivalencia número de programa","2. Propósito","4. Número Proyecto","Número de proponentes","Número  de Identificación del contratista\n(Cédula o NIT sin puntos, comas ni caracteres especiales y sin digito de verificación)","Nombre del contratista\n  (según el caso: nombres y apellidos o Razón social y Tipo societario)","Naturaleza Jurídica","Número  de Identificación del integrante del Consorcio o U.T.\n(Cédula o NIT sin puntos, comas ni caracteres especiales y sin digito de verificación)","Nombre del Integrante del Consorcio o U.T. y Tipo societario\n (Según el caso: nombres y apellidos o razón social y tipo societario)","% Participación (indicar solo el numero del porcentaje, sin caracteres especiales)","Vigencias futuras","Valor Inicial del contrato","Valor total reducciones \n(En valor negativo)","Número de adiciones","Valor total de adiciones ","Valor Final ","Giros (Valor en pesos)","Fecha de suscripción (DD/MM/AAAA)","Fecha de inicio (DD/MM/AAAA)","Fecha de terminación (DD/MM/AAAA)","Plazo en días","Número de prórrogas","Prorroga en días","Número  de Identificación del cesionario\n(NIT sin digito de verificación)","Nombre cesionario","Fecha cesión\n(DD/MM/AAAA)","Valor cesión","Estado","% Avance y/o Cumplimiento"]
[1,2022,"FDLCH-CPS-001-2022-a","https://community.secop.gov.co/Public/Tendering/OpportunityDetail/Index?noticeUID=CO1.NTC.2595420&isFromPublicArea=True&isModal=true&asPopupView=true","Contratos de prestación de servicios profesionales y de apoyo a la gestión","Contratación directa","Prestación de servicios profesionales y de apoyo a la gestión, o para la ejecución de trabajos artísticos que sólo puedan encomendarse a determinadas personas naturales","Prestar sevicios profesionales especializados para apoyar la organización y estructuracion de la gestión precontractual, contractual y postcontractual que adelante el Fondo de Desarrollo Local de Chapinero.","Inversión","Un nuevo contrato social y ambiental para la Bogotá del Siglo XXI",57,{"$f":"IF(ISERROR(VLOOKUP(K15,[2]Proposito_programa!$C$2:$E$59,2,FALSE)),\" \",VLOOKUP(K15,[2]Proposito_programa!$C$2:$E$59,2,FALSE))","v":"Gestión pública local"},{"$f":"IF(ISERROR(VLOOKUP(K15,[2]Proposito_programa!$C$2:$E$59,3,FALSE)),\" \",VLOOKUP(K15,[2]Proposito_programa!$C$2:$E$59,3,FALSE))","v":"Propósito 5: Construir Bogotá - Región con gobierno abierto, transparente y ciudadanía consciente"},1741,null,79580307,"CESAR FRUTO CORREDOR GOMEZ","Persona Natural",null,null,null,null,60000000,0,1,28750000,{"$f":"+W15+X15+Z15","v":88750000},78000000,"2022-01-18","2022-01-19","2023-01-13",240,1,115,null,null,null,null,"En ejecución",0.9]
[2,2022,"FDLCH-CPS-002-2022","https://community.secop.gov.co/Public/Tendering/OpportunityDetail/Index?noticeUID=CO1.NTC.2601263&isFromPublicArea=True&isModal=true&asPopupView=true","Contratos de prestación de servicios profesionales y de apoyo a la gestión","Contratación directa","Prestación de servicios profesionales y de apoyo a la gestión, o para la ejecución de trabajos artísticos que sólo puedan encomendarse a determinadas personas naturales","Prestar servicios profesionales para el apoyo al área de gestión del desarrollo local de la Alcaldía Local de Chapinero en la formulación gestión ejecución desarrollo y seguimiento de los procesos de formación y transformación ambiental en la Localidad, así como el apoyo a la supervisión de los contratos que le sean asignados por el Alcalde Local.","Inversión","Un nuevo contrato social y ambiental para la Bogotá del Siglo XXI",27,{"$f":"IF(ISERROR(VLOOKUP(K16,[2]Proposito_programa!$C$2:$E$59,2,FALSE)),\" \",VLOOKUP(K16,[2]Proposito_programa!$C$2:$E$59,2,FALSE))","v":"Cambio cultural para la gestión de la crisis climática"},{"$f":"IF(ISERROR(VLOOKUP(K16,[2]Proposito_programa!$C$2:$E$59,3,FALSE)),\" \",VLOOKUP(K16,[2]Proposito_programa!$C$2:$E$59,3,FALSE))","v":"Propósito 2 : Cambiar Nuestros Hábitos de Vida para Reverdecer a Bogotá y Adaptarnos y Mitigar la Crisis Climática"},1712,null,13925122,"RAUL MESA MESA","Persona Natural",null,null,null,null,36000000,null,1,18000000,54000000,38400000,"2022-01-19","2022-01-19","2022-08-01",180,1,90,null,null,null,null,"Terminado",1]
[3,2022,"FDLCH-CPS-003-2022","https://community.secop.gov.co/Public/Tendering/OpportunityDetail/Index?noticeUID=CO1.NTC.2602911&isFromPublicArea=True&isModal=true&asPopupView=true","Contratos de prestación de servicios profesionales y de apoyo a la gestión","Contratación directa","Prestación de servicios profesionales y de apoyo a la gestión, o para la ejecución de trabajos artísticos que sólo puedan encomendarse a determinadas personas naturales","Prestar los servicios profesionales para apoyar el área de gestión del desarrollo local de la alcaldía local de chapinero, en la formulación, gestión, ejecución y apoyo a la supervisión de los proyectos relacionados con la prevención, atención de la violencia intrafamiliar y sexual y la eliminación de las violencias basadas en género en el marco del programa sistema distrital de cuidado.","Inversión","Un nuevo contrato social y ambiental para la Bogotá del Siglo XXI",6,{"$f":"IF(ISERROR(VLOOKUP(K17,[2]Proposito_programa!$C$2:$E$59,2,FALSE)),\" \",VLOOKUP(K17,[2]Proposito_programa!$C$2:$E$59,2,FALSE))","v":"Sistema Distrital de Cuidado"},{"$f":"IF(ISERROR(VLOOKUP(K17,[2]Proposito_programa!$C$2:$E$59,3,FALSE)),\" \",VLOOKUP(K17,[2]Proposito_programa!$C$2:$E$59,3,FALSE))","v":"Propósito 1: Hacer un nuevo contrato social para incrementar la inclusión social, productiva y política"},1710,null,52559313,"ALICIA CUJABAN ZAZA","Persona Natural",null,null,null,null,41600000,0,3,19066666,{"$f":"+W17+X17+Z17","v":60666666},{"$f":"41600000+5200000+9706667","v":56506667},"2022-01-18","2022-01-20","2023-01-07",240,3,109,null,null,null,null,"En ejecución",0.9]
[4,2022,"FDLCH-CPS-004-2022","https://community.secop.gov.co/Public/Tendering/OpportunityDetail/Index?noticeUID=CO1.NTC.2600599&isFromPublicArea=True&isModal=true&asPopupView=true","Contratos de prestación de servicios profesionales y de apoyo a la gestión","Contratación directa","Prestación de servicios profesionales y de apoyo a la gestión, o para la ejecución de trabajos artísticos que sólo puedan encomendarse a determinadas personas naturales","Prestar los servicios de apoyo necesarios para la conducción de los vehículos que conforman el parque automotor en propiedad o custodia del fondo de desarrollo local de chapinero, y el transporte de servidores públicos para la realización de las actividades misionales de la alcaldía local de chapinero.","Inversión","Un nuevo contrato social y ambiental para la Bogotá del Siglo XXI",57,{"$f":"IF(ISERROR(VLOOKUP(K18,[2]Proposito_programa!$C$2:$E$59,2,FALSE)),\" \",VLOOKUP(K18,[2]Proposito_programa!$C$2:$E$59,2,FALSE))","v":"Gestión pública local"},{"$f":"IF(ISERROR(VLOOKUP(K18,[2]Proposito_programa!$C$2:$E$59,3,FALSE)),\" \",VLOOKUP(K18,[2]Proposito_programa!$C$2:$E$59,3,FALSE))","v":"Propósito 5: Construir Bogotá - Región con gobierno abierto, transparente y ciudadanía consciente"},1741,null,1018407451,"EMERSON HERNANDO HUERTAS FONSECA","Persona Natural",null,null,null,null,20800000,0,2,{"$f":"1473333+8926666","v":10399999},31199999,{"$f":"20800000+7540000","v":28340000},"2022-01-19","2022-01-19","17/01/2023",240,2,120,null,null,null,null,"En ejecución",0.9]
[5,2022,"FDLCH-CPS-005-2022","https://community.secop.gov.co/Public/Tendering/OpportunityDetail/Index?noticeUID=CO1.NTC.2601293&isFromPublicArea=True&isModal=true&asPopupView=true","Contratos de prestación de servicios profesionales y de apoyo a la gestión","Contratación directa","Prestación de servicios profesionales y de apoyo a la gestión, o para la ejecución de trabajos artísticos que sólo puedan encomendarse a determinadas personas naturales","Prestar servicios técnicos de apoyo a la gestión al área de Gestión del Desarrollo Local en las actividades administrativas requeridas en el proceso de planeación, así como en el seguimiento, uso y soporte de herramientas y aplicativos en cumplimiento de los objetivos del Plan de Desarrollo Local.","Inversión","Un nuevo contrato social y ambiental para la Bogotá del Siglo XXI",57,{"$f":"IF(ISERROR(VLOOKUP(K19,[2]Proposito_programa!$C$2:$E$59,2,FALSE)),\" \",VLOOKUP(K19,[2]Proposito_programa!$C$2:$E$59,2,FALSE))","v":"Gestión pública local"},{"$f":"IF(ISERROR(VLOOKUP(K19,[2]Proposito_programa!$C$2:$E$59,3,FALSE)),\" \",VLOOKUP(K19,[2]Proposito_programa!$C$2:$E$59,3,FALSE))","v":"Propósito 5: Construir Bogotá - Región con gobierno abierto, transparente y ciudadanía consciente"},1741,null,1033699910,"JULIAN ANDRES JAIME ALARCON","Persona Natural",null,null,null,null,33600000,0,1,16240000,49840000,{"$f":"33600000+12180000","v":45780000},"2022-01-18","2022-01-19","2023-01-13",240,1,116,null,null,null,null,"En ejecución",0.9]
[6,2022,"FDLCH-CPS-006-2022","https://community.secop.gov.co/Public/Tendering/OpportunityDetail/Index?noticeUID=CO1.NTC.2600047&isFromPublicArea=True&isModal=true&asPopupView=true","Contratos de prestación de servicios profesionales y de apoyo a la gestión","Contratación directa","Prestación de servicios profesionales y de apoyo a la gestión, o para la ejecución de trabajos artísticos que sólo puedan encomendarse a determinadas personas naturales","Prestar servicios de apoyo a la gestión en la ejecución de las actividades administrativas y documentales relacionadas con la gestión policiva en la alcaldía local de chapinero.","Inversión","Un nuevo contrato social y ambiental para la Bogotá del Siglo XXI",57,{"$f":"IF(ISERROR(VLOOKUP(K20,[2]Proposito_programa!$C$2:$E$59,2,FALSE)),\" \",VLOOKUP(K20,[2]Proposito_programa!$C$2:$E$59,2,FALSE))","v":"Gestión pública local"},{"$f":"IF(ISERROR(VLOOKUP(K20,[2]Proposito_programa!$C$2:$E$59,3,FALSE)),\" \",VLOOKUP(K20,[2]Proposito_programa!$C$2:$E$59,3,FALSE))","v":"Propósito 5: Construir Bogotá - Región con gobierno abierto, transparente y ciudadanía consciente"},1841,null,37626709,"LUDY MARCELA MORENO SUAREZ","Persona Natural",null,null,null,null,17600000,0,2,8799996,26399996,{"$f":"17600000+6306667","v":23906667},"2022-01-19","2022-01-20","2023-01-18",240,2,120,null,null,null,null,"En ejecución",0.9]
[7,2022,"FDLCH-CPS-007-2022","https://community.secop.gov.co/Public/Tendering/OpportunityDetail/Index?noticeUID=CO1.NTC.2601994&isFromPublicArea=True&isModal=true&asPopupView=true","Contratos de prestación de servicios profesionales y de apoyo a la gestión","Contratación directa","Prestación de servicios profesionales y de apoyo a la gestión, o para la ejecución de trabajos artísticos que sólo puedan encomendarse a determinadas personas naturales","Prestación de servicios de apoyo necesarios para apoyar la gestión y ejecución de actividades administrativas, logísticas y operativas que se adelantan en el área de gestión del desarrollo local de la alcaldía local de chapinero","Inversión","Un nuevo contrato social y ambiental para la Bogotá del Siglo XXI",57,{"$f":"IF(ISERROR(VLOOKUP(K21,[2]Proposito_programa!$C$2:$E$59,2,FALSE)),\" \",VLOOKUP(K21,[2]Proposito_programa!$C$2:$E$59,2,FALSE))","v":"Gestión pública local"},{"$f":"IF(ISERROR(VLOOKUP(K21,[2]Proposito_programa!$C$2:$E$59,3,FALSE)),\" \",VLOOKUP(K21,[2]Proposito_programa!$C$2:$E$59,3,FALSE))","v":"Propósito 5: Construir Bogotá - Región con gobierno abierto, transparente y ciudadanía consciente"},1741,null,2996195,"MEYER JAIRO GACHARNA VILLALBA","Persona Natural",null,null,null,null,20000000,0,2,{"$f":"8200+8583333+1416667","v":10008200},30008200,27250000,"2022-01-19","2022-01-19","17/01/2023",240,2,120,null,null,null,null,"En ejecución",0.9]
[8,2022,"FDLCH-CPS-008-2022","https://community.secop.gov.co/Public/Tendering/OpportunityDetail/Index?noticeUID=CO1.NTC.2598989&isFromPublicArea=True&isModal=true&asPopupView=true","Contratos de prestación de servicios profesionales y de apoyo a la gestión","Contratación directa","Prestación de servicios profesionales y de apoyo a la gestión, o para la ejecución de trabajos artísticos que sólo puedan encomendarse a determinadas personas naturales","Prestar servicios de apoyo a la gestión para desarrollar las actividades de radicación, gestión de correspondencia y de la documentación que expide, se allega y controla de la Alcaldía Local de Chapinero.","Inversión","Un nuevo contrato social y ambiental para la Bogotá del Siglo XXI",57,{"$f":"IF(ISERROR(VLOOKUP(K22,[2]Proposito_programa!$C$2:$E$59,2,FALSE)),\" \",VLOOKUP(K22,[2]Proposito_programa!$C$2:$E$59,2,FALSE))","v":"Gestión pública local"},{"$f":"IF(ISERROR(VLOOKUP(K22,[2]Proposito_programa!$C$2:$E$59,3,FALSE)),\" \",VLOOKUP(K22,[2]Proposito_programa!$C$2:$E$59,3,FALSE))","v":"Propósito 5: Construir Bogotá - Región con gobierno abierto, transparente y ciudadanía consciente"},1741,null,1031147236,"DEISY YINETH FRANCO PENAGOS","Persona Natural",null,null,null,null,20800000,0,2,{"$f":"8926667+1473333","v":10400000},31200000,28340000,"2022-01-19","2022-01-19","17/01/2023",240,2,120,null,null,null,null,"En ejecución",0.9]
[9,2022,"FDLCH-CPS-009-2022","https://community.secop.gov.co/Public/Tendering/OpportunityDetail/Index?noticeUID=CO1.NTC.2595478&isFromPublicArea=True&isModal=true&asPopupView=true","Contratos de prestación de servicios profesionales y de apoyo a la gestión","Contratación directa","Prestación de servicios profesionales y de apoyo a la gestión, o para la ejecución de trabajos artísticos que sólo puedan encomendarse a determinadas personas naturales","Prestar servicios personales para apoyar actividades operativas y administrativas de la gestión precontractual, contractual y postcontractual que adelante el fondo de desarrollo local de chapinero.","Inversión","Un nuevo contrato social y ambiental para la Bogotá del Siglo XXI",57,{"$f":"IF(ISERROR(VLOOKUP(K23,[2]Proposito_programa!$C$2:$E$59,2,FALSE)),\" \",VLOOKUP(K23,[2]Proposito_programa!$C$2:$E$59,2,FALSE))","v":"Gestión pública local"},{"$f":"IF(ISERROR(VLOOKUP(K23,[2]Proposito_programa!$C$2:$E$59,3,FALSE)),\" \",VLOOKUP(K23,[2]Proposito_programa!$C$2:$E$59,3,FALSE))","v":"Propósito 5: Construir Bogotá - Región con gobierno abierto, transparente y ciudadanía consciente"},1741,null,52733935,"PAOLA YUREXY QUIROGA CUBILLOS","Persona Natural",null,null,null,null,21600000,0,1,10800000,32400000,28080000,"2022-01-18","2022-01-19","2023-01-18",240,1,120,null,null,null,null,"En ejecución",0.9]
[10,2022,"FDLCH-CPS-010-2022","https://community.secop.gov.co/Public/Tendering/OpportunityDetail/Index?noticeUID=CO1.NTC.2596643&isFromPublicArea=True&isModal=true&asPopupView=true","Contratos de prestación de servicios profesionales y de apoyo a la gestión","Contratación directa","Prestación de servicios profesionales y de apoyo a la gestión, o para la ejecución de trabajos artísticos que sólo puedan encomendarse a determinadas personas naturales","Prestar servicios personales para apoyar actividades operativas y administrativas de la gestión precontractual, contractual y postcontractual que adelante el Fondo de Desarrollo Local de Chapinero“.","Inversión","Un nuevo contrato social y ambiental para la Bogotá del Siglo XXI",57,{"$f":"IF(ISERROR(VLOOKUP(K24,[2]Proposito_programa!$C$2:$E$59,2,FALSE)),\" \",VLOOKUP(K24,[2]Proposito_programa!$C$2:$E$59,2,FALSE))","v":"Gestión pública local"},{"$f":"IF(ISERROR(VLOOKUP(K24,[2]Proposito_programa!$C$2:$E$59,3,FALSE)),\" \",VLOOKUP(K24,[2]Proposito_programa!$C$2:$E$59,3,FALSE))","v":"Propósito 5: Construir Bogotá - Región con gobierno abierto, transparente y ciudadanía consciente"},1741,null,52119337,"MARTHA YANETH VASQUEZ FIGUEROA","Persona Natural",null,null,null,null,21600000,0,1,10800000,32400000,29430000,"2022-01-18","2022-01-19","2023-01-18",240,1,120,null,null,null,null,"En ejecución",0.9]
[11,2022,"FDLCH-CPS-011-2022","https://community.secop.gov.co/Public/Tendering/OpportunityDetail/Index?noticeUID=CO1.NTC.2598440&isFromPublicArea=True&isModal=true&asPopupView=true","Contratos de prestación de servicios profesionales y de apoyo a la gestión","Contratación directa","Prestación de servicios profesionales y de apoyo a la gestión, o para la ejecución de trabajos artísticos que sólo puedan encomendarse a determinadas personas naturales","Prestar servicios profesionale spara apoyar el área de gestión del desarrollo local de la Alcaldía Local de Chapinero, en la gestión, formulación, desarrollo, seguimiento y evaluación del proyecto de inversión \" Chapinero es primera infancia dle programa educación inicial: Bases sólidas para la vida.","Inversión","Un nuevo contrato social y ambiental para la Bogotá del Siglo XXI",12,{"$f":"IF(ISERROR(VLOOKUP(K25,[2]Proposito_programa!$C$2:$E$59,2,FALSE)),\" \",VLOOKUP(K25,[2]Proposito_programa!$C$2:$E$59,2,FALSE))","v":"Educación inicial: Bases sólidas para la vida."},{"$f":"IF(ISERROR(VLOOKUP(K25,[2]Proposito_programa!$C$2:$E$59,3,FALSE)),\" \",VLOOKUP(K25,[2]Proposito_programa!$C$2:$E$59,3,FALSE))","v":"Propósito 1: Hacer un nuevo contrato social para incrementar la inclusión social, productiva y política"},1830,null,52312234,"CLAUDIA MARCELA LOPEZ SERRATO","Persona Natural",null,null,null,null,48000000,0,1,24000000,72000000,65400000,"2022-01-18","2022-01-19","2023-01-18",240,1,120,null,null,null,null,"En ejecución",0.9]
[12,2022,"FDLCH-CPS-012-2022","https://community.secop.gov.co/Public/Tendering/OpportunityDetail/Index?noticeUID=CO1.NTC.2599596&isFromPublicArea=True&isModal=true&asPopupView=true","Contratos de prestación de servicios profesionales y de apoyo a la gestión","Contratación directa","Prestación de servicios profesionales y de apoyo a la gestión, o para la ejecución de trabajos artísticos que sólo puedan encomendarse a determinadas personas naturales","Prestación de servicios de apoyo a la gestión necesarios para el apoyo en la ejecución de actividades administrativas y operativas adelantadas en la Junta Administradora Local de Chapinero.","Inversión","Un nuevo contrato social y ambiental para la Bogotá del Siglo XXI",57,{"$f":"IF(ISERROR(VLOOKUP(K26,[2]Proposito_programa!$C$2:$E$59,2,FALSE)),\" \",VLOOKUP(K26,[2]Proposito_programa!$C$2:$E$59,2,FALSE))","v":"Gestión pública local"},{"$f":"IF(ISERROR(VLOOKUP(K26,[2]Proposito_programa!$C$2:$E$59,3,FALSE)),\" \",VLOOKUP(K26,[2]Proposito_programa!$C$2:$E$59,3,FALSE))","v":"Propósito 5: Construir Bogotá - Región con gobierno abierto, transparente y ciudadanía consciente"},1741,null,52523548,"SANDRA MILENA GOMEZ SALAZAR","Persona Natural",null,null,null,null,20000000,0,2,{"$f":"8500000+1500000","v":10000000},30000000,27250000,"2022-01-19","2022-01-19","2023-01-18",240,2,120,null,null,null,null,"En ejecución",0.9]
[13,2022,"FDLCH-CPS-013-2022","https://community.secop.gov.co/Public/Tendering/OpportunityDetail/Index?noticeUID=CO1.NTC.2602741&isFromPublicArea=True&isModal=true&asPopupView=true","Contratos de prestación de servicios profesionales y de apoyo a la gestión","Contratación directa","Prestación de servicios profesionales y de apoyo a la gestión, o para la ejecución de trabajos artísticos que sólo puedan encomendarse a determinadas personas naturales","Prestar los servicios profesionales de apoyo a la gestión para la planeación, gestión, formulación, desarrollo, seguimiento y evaluación del proyecto de inversión \"En chapinero todas contamos\", en atención al fortalecimiento de la capacidad de gestión del Fondo de Desarrollo Local.","Inversión","Un nuevo contrato social y ambiental para la Bogotá del Siglo XXI",40,{"$f":"IF(ISERROR(VLOOKUP(K27,[2]Proposito_programa!$C$2:$E$59,2,FALSE)),\" \",VLOOKUP(K27,[2]Proposito_programa!$C$2:$E$59,2,FALSE))","v":"Más mujeres viven una vida libre de violencias, se sienten seguras y acceden con confianza al sistema de justicia"},{"$f":"IF(ISERROR(VLOOKUP(K27,[2]Proposito_programa!$C$2:$E$59,3,FALSE)),\" \",VLOOKUP(K27,[2]Proposito_programa!$C$2:$E$59,3,FALSE))","v":"Propósito 3: Inspirar confianza y legitimidad para vivir sin miedo y ser epicentro de cultura ciudadana, paz y reconciliación"},2035,null,53108000,"LEIDY VIVIANA ORTIZ GUEVARA","Persona Natural",null,null,null,null,40000000,-4833334,null,null,35166666,35166666,"2022-01-20","2022-01-20","2022-08-20",240,null,null,null,null,null,null,"Terminado",1]
[14,2022,"FDLCH-CPS-014-2022","https://community.secop.gov.co/Public/Tendering/OpportunityDetail/Index?noticeUID=CO1.NTC.2597195&isFromPublicArea=True&isModal=False","Contratos de prestación de servicios profesionales y de apoyo a la gestión","Contratación directa","Prestación de servicios profesionales y de apoyo a la gestión, o para la ejecución de trabajos artísticos que sólo puedan encomendarse a determinadas personas naturales","Prestar servicios profesionales para apoyar la gestión precontractual, contractual y postcontractual que adelante el Fondo de Desarrollo Local de Chapinero.","Inversión","Un nuevo contrato social y ambiental para la Bogotá del Siglo XXI",57,{"$f":"IF(ISERROR(VLOOKUP(K28,[2]Proposito_programa!$C$2:$E$59,2,FALSE)),\" \",VLOOKUP(K28,[2]Proposito_programa!$C$2:$E$59,2,FALSE))","v":"Gestión pública local"},{"$f":"IF(ISERROR(VLOOKUP(K28,[2]Proposito_programa!$C$2:$E$59,3,FALSE)),\" \",VLOOKUP(K28,[2]Proposito_programa!$C$2:$E$59,3,FALSE))","v":"Propósito 5: Construir Bogotá - Región con gobierno abierto, transparente y ciudadanía consciente"},1741,null,1078368894,"JENNYFER PAOLA GALVIS TORRES","Persona Natural",null,null,null,null,44000000,0,1,22000000,66000000,59950000,"2022-01-18","2022-01-19","2023-01-18",240,1,120,null,null,null,null,"En ejecución",0.9]
[15,2022,"FDLCH-CPS-015-2022","https://community.secop.gov.co/Public/Tendering/OpportunityDetail/Index?noticeUID=CO1.NTC.2598515&isFromPublicArea=True&isModal=true&asPopupView=true","Contratos de prestación de servicios profesionales y de apoyo a la gestión","Contratación directa","Prestación de servicios profesionales y de apoyo a la gestión, o para la ejecución de trabajos artísticos que sólo puedan encomendarse a determinadas personas naturales","Apoyar jurídicamente la ejecución de las acciones requeridas para la depuración de las actuaciones administrativas que cursan en la Alcaldía Local.","Inversión","Un nuevo contrato social y ambiental para la Bogotá del Siglo XXI",57,{"$f":"IF(ISERROR(VLOOKUP(K29,[2]Proposito_programa!$C$2:$E$59,2,FALSE)),\" \",VLOOKUP(K29,[2]Proposito_programa!$C$2:$E$59,2,FALSE))","v":"Gestión pública local"},{"$f":"IF(ISERROR(VLOOKUP(K29,[2]Proposito_programa!$C$2:$E$59,3,FALSE)),\" \",VLOOKUP(K29,[2]Proposito_programa!$C$2:$E$59,3,FALSE))","v":"Propósito 5: Construir Bogotá - Región con gobierno abierto, transparente y ciudadanía consciente"},1841,null,1075247785,"KATHERINE RODRIGUEZ QUINTERO","Persona Natural",null,null,null,null,27600000,0,1,13800000,41400000,{"$f":"13800000+27600000","v":41400000},"2022-01-18","2022-01-20","28/10/2022",180,1,90,null,null,null,null,"Terminado",1]
[16,2022,"FDLCH-CPS-016-2022","https://community.secop.gov.co/Public/Tendering/OpportunityDetail/Index?noticeUID=CO1.NTC.2602010&isFromPublicArea=True&isModal=true&asPopupView=true","Contratos de prestación de servicios profesionales y de apoyo a la gestión","Contratación directa","Prestación de servicios profesionales y de apoyo a la gestión, o para la ejecución de trabajos artísticos que sólo puedan encomendarse a determinadas personas naturales","Prestación de servicios de apoyo a la gestión necesarios para el apoyo en la ejecución de actividades administrativas y operativas adelantadas en la Junta Administradora Local de Chapinero.","Inversión","Un nuevo contrato social y ambiental para la Bogotá del Siglo XXI",57,{"$f":"IF(ISERROR(VLOOKUP(K30,[2]Proposito_programa!$C$2:$E$59,2,FALSE)),\" \",VLOOKUP(K30,[2]Proposito_programa!$C$2:$E$59,2,FALSE))","v":"Gestión pública local"},{"$f":"IF(ISERROR(VLOOKUP(K30,[2]Proposito_programa!$C$2:$E$59,3,FALSE)),\" \",VLOOKUP(K30,[2]Proposito_programa!$C$2:$E$59,3,FALSE))","v":"Propósito 5: Construir Bogotá - Región con gobierno abierto, transparente y ciudadanía consciente"},1741,null,1018448341,"PEDRO ANGEL ZABALETA POLO","Persona Natural",null,null,null,null,20000000,0,2,{"$f":"8333333+1666667","v":10000000},30000000,27083333,"2022-01-20","2022-01-21","2023-01-20",240,2,120,null,null,null,null,"En ejecución",0.9]
[17,2022,"FDLCH-CPS-017-2022","https://community.secop.gov.co/Public/Tendering/OpportunityDetail/Index?noticeUID=CO1.NTC.2597691&isFromPublicArea=True&isModal=true&asPopupView=true","Contratos de prestación de servicios profesionales y de apoyo a la gestión","Contratación directa","Prestación de servicios profesionales y de apoyo a la gestión, o para la ejecución de trabajos artísticos que sólo puedan encomendarse a determinadas personas naturales","Prestar servicios técnicos de apoyo a la gestión en la implementación, atención, verificación, soporte y acompañamiento de los procesos y/o actuaciones administrativas de registro y seguimiento a la propiedad horizontal y protección al consumidor en los aplicativos y/o herramientas virtuales en la Localidad de Chapinero.","Inversión","Un nuevo contrato social y ambiental para la Bogotá del Siglo XXI",57,{"$f":"IF(ISERROR(VLOOKUP(K31,[2]Proposito_programa!$C$2:$E$59,2,FALSE)),\" \",VLOOKUP(K31,[2]Proposito_programa!$C$2:$E$59,2,FALSE))","v":"Gestión pública local"},{"$f":"IF(ISERROR(VLOOKUP(K31,[2]Proposito_programa!$C$2:$E$59,3,FALSE)),\" \",VLOOKUP(K31,[2]Proposito_programa!$C$2:$E$59,3,FALSE))","v":"Propósito 5: Construir Bogotá - Región con gobierno abierto, transparente y ciudadanía consciente"},1741,null,1026595076,"VALENTINA SALGADO RODRIGUEZ","Persona Natural",null,null,null,null,18000000,0,1,9000000,27000000,27000000,"2022-01-18","2022-01-19","2022-11-18",180,1,90,null,null,null,null,"Terminado",1]
[18,2022,"FDLCH-CPS-018-2022","https://community.secop.gov.co/Public/Tendering/OpportunityDetail/Index?noticeUID=CO1.NTC.2603149&isFromPublicArea=True&isModal=true&asPopupView=true","Contratos de prestación de servicios profesionales y de apoyo a la gestión","Contratación directa","Prestación de servicios profesionales y de apoyo a la gestión, o para la ejecución de trabajos artísticos que sólo puedan encomendarse a determinadas personas naturales","Prestar servicios profesionales para apoyar técnicamente las actuaciones administrativas impulso procesal y de inspección vigilancia y control de competencia de la Alcaldía Local de Chapinero.","Inversión","Un nuevo contrato social y ambiental para la Bogotá del Siglo XXI",57,{"$f":"IF(ISERROR(VLOOKUP(K32,[2]Proposito_programa!$C$2:$E$59,2,FALSE)),\" \",VLOOKUP(K32,[2]Proposito_programa!$C$2:$E$59,2,FALSE))","v":"Gestión pública local"},{"$f":"IF(ISERROR(VLOOKUP(K32,[2]Proposito_programa!$C$2:$E$59,3,FALSE)),\" \",VLOOKUP(K32,[2]Proposito_programa!$C$2:$E$59,3,FALSE))","v":"Propósito 5: Construir Bogotá - Región con gobierno abierto, transparente y ciudadanía consciente"},1841,null,80825882,"CARLOS ANDRES GIL RUEDA","Persona Natural",null,null,null,null,29400000,0,1,14700000,44100000,{"$f":"29400000+14700000","v":44100000},"2022-01-20","2022-01-20","2022-10-19",180,1,90,null,null,null,null,"Terminado",1]
[19,2022,"FDLCH-CPS-019-2022.","https://community.secop.gov.co/Public/Tendering/OpportunityDetail/Index?noticeUID=CO1.NTC.2609026&isFromPublicArea=True&isModal=true&asPopupView=true","Contratos de prestación de servicios profesionales y de apoyo a la gestión","Contratación directa","Prestación de servicios profesionales y de apoyo a la gestión, o para la ejecución de trabajos artísticos que sólo puedan encomendarse a determinadas personas naturales","Prestar servicios profesionales para la atención programación desarrollo seguimiento y aseguramiento de los planes, estrategias y actividades estratégicas desarrolladas por la Alcaldía Local de Chapinero.","Inversión","Un nuevo contrato social y ambiental para la Bogotá del Siglo XXI",57,{"$f":"IF(ISERROR(VLOOKUP(K33,[2]Proposito_programa!$C$2:$E$59,2,FALSE)),\" \",VLOOKUP(K33,[2]Proposito_programa!$C$2:$E$59,2,FALSE))","v":"Gestión pública local"},{"$f":"IF(ISERROR(VLOOKUP(K33,[2]Proposito_programa!$C$2:$E$59,3,FALSE)),\" \",VLOOKUP(K33,[2]Proposito_programa!$C$2:$E$59,3,FALSE))","v":"Propósito 5: Construir Bogotá - Región con gobierno abierto, transparente y ciudadanía consciente"},1741,null,80192226,"OSCAR FABIAN MAESTRE OLAYA","Persona Natural",null,null,null,null,27480000,0,1,13740000,41220000,{"$f":"27480000+13740000","v":41220000},"2022-01-19","2022-01-19","2022-10-18",180,1,90,null,null,null,null,"Terminado",1]
[20,2022,"FDLCH-CPS-020-2022","https://community.secop.gov.co/Public/Tendering/OpportunityDetail/Index?noticeUID=CO1.NTC.2603277&isFromPublicArea=True&isModal=true&asPopupView=true","Contratos de prestación de servicios profesionales y de apoyo a la gestión","Contratación directa","Prestación de servicios profesionales y de apoyo a la gestión, o para la ejecución de trabajos artísticos que sólo puedan encomendarse a determinadas personas naturales","Apoyar la formulación, gestión y seguimiento de actividades enfocadas a la gestión ambiental externa, encaminadas a la mitigación de los diferentes impactos ambientales y la conservación de los recursos naturales de la Localidad de Chapinero.","Inversión","Un nuevo contrato social y ambiental para la Bogotá del Siglo XXI",57,{"$f":"IF(ISERROR(VLOOKUP(K34,[2]Proposito_programa!$C$2:$E$59,2,FALSE)),\" \",VLOOKUP(K34,[2]Proposito_programa!$C$2:$E$59,2,FALSE))","v":"Gestión pública local"},{"$f":"IF(ISERROR(VLOOKUP(K34,[2]Proposito_programa!$C$2:$E$59,3,FALSE)),\" \",VLOOKUP(K34,[2]Proposito_programa!$C$2:$E$59,3,FALSE))","v":"Propósito 5: Construir Bogotá - Región con gobierno abierto, transparente y ciudadanía consciente"},1741,null,1123320414,"KAREN JOHANA CASTRO NUÑEZ","Persona Natural",null,null,null,null,32400000,0,1,16200000,48600000,48600000,"2022-01-18","2022-01-19","2022-10-18",180,1,90,null,null,null,null,"Terminado",1]
[21,2022,"FDLCH-CPS-021-2022","https://community.secop.gov.co/Public/Tendering/OpportunityDetail/Index?noticeUID=CO1.NTC.2603373&isFromPublicArea=True&isModal=true&asPopupView=true","Contratos de prestación de servicios profesionales y de apoyo a la gestión","Contratación directa","Prestación de servicios profesionales y de apoyo a la gestión, o para la ejecución de trabajos artísticos que sólo puedan encomendarse a determinadas personas naturales","Prestar servicios de apoyo técnico para apoyar la gestión y ejecución de las actividades administrativas y misionales que se adelantan en la Alcaldía Local de Chapinero para el cumplimiento de las metas y objetivos del Plan de Desarrollo Local.","Inversión","Un nuevo contrato social y ambiental para la Bogotá del Siglo XXI",57,{"$f":"IF(ISERROR(VLOOKUP(K35,[2]Proposito_programa!$C$2:$E$59,2,FALSE)),\" \",VLOOKUP(K35,[2]Proposito_programa!$C$2:$E$59,2,FALSE))","v":"Gestión pública local"},{"$f":"IF(ISERROR(VLOOKUP(K35,[2]Proposito_programa!$C$2:$E$59,3,FALSE)),\" \",VLOOKUP(K35,[2]Proposito_programa!$C$2:$E$59,3,FALSE))","v":"Propósito 5: Construir Bogotá - Región con gobierno abierto, transparente y ciudadanía consciente"},1741,null,1091663411,"JUAN PABLO SANJUAN ARIAS","Persona Natural",null,null,null,null,29600000,0,1,14800000,44400000,{"$f":"29600000+10606667","v":40206667},"2022-01-19","2022-01-20","2023-01-19",240,1,120,null,null,null,null,"En ejecución",0.9]
[22,2022,"FDLCH-CPS-022-2022","https://community.secop.gov.co/Public/Tendering/OpportunityDetail/Index?noticeUID=CO1.NTC.2603723&isFromPublicArea=True&isModal=true&asPopupView=true","Contratos de prestación de servicios profesionales y de apoyo a la gestión","Contratación directa","Prestación de servicios profesionales y de apoyo a la gestión, o para la ejecución de trabajos artísticos que sólo puedan encomendarse a determinadas personas naturales","Prestar servicios profesionales de apoyo jurídico en la ejecución de las acciones requeridas para el trámite e impulso procesal d elas actuaciones administrativas y de cobro persuasivo de competencia de la Alcaldía Local de Chapinero.","Inversión","Un nuevo contrato social y ambiental para la Bogotá del Siglo XXI",57,{"$f":"IF(ISERROR(VLOOKUP(K36,[2]Proposito_programa!$C$2:$E$59,2,FALSE)),\" \",VLOOKUP(K36,[2]Proposito_programa!$C$2:$E$59,2,FALSE))","v":"Gestión pública local"},{"$f":"IF(ISERROR(VLOOKUP(K36,[2]Proposito_programa!$C$2:$E$59,3,FALSE)),\" \",VLOOKUP(K36,[2]Proposito_programa!$C$2:$E$59,3,FALSE))","v":"Propósito 5: Construir Bogotá - Región con gobierno abierto, transparente y ciudadanía consciente"},1841,null,1010190690,"ADRIANA ANDREA ARCHILA MOSCOSO","Persona Natural",null,null,null,null,27600000,0,1,13800000,41400000,{"$f":"27600000+13800000","v":41400000},"2022-01-18","2022-01-21","2022-10-20",240,1,90,null,null,null,null,"Terminado",1]
[23,2022,"FDLCH-CPS-023-2022","https://community.secop.gov.co/Public/Tendering/OpportunityDetail/Index?noticeUID=CO1.NTC.2603683&isFromPublicArea=True&isModal=true&asPopupView=true","Contratos de prestación de servicios profesionales y de apoyo a la gestión","Contratación directa","Prestación de servicios profesionales y de apoyo a la gestión, o para la ejecución de trabajos artísticos que sólo puedan encomendarse a determinadas personas naturales","Prestar servicios de apoyo a la gestión en la ejecución de las actividades administrativas y documentales relacionadas con la gestión policiva en la Alcaldía Local de Chapinero.","Inversión","Un nuevo contrato social y ambiental para la Bogotá del Siglo XXI",57,{"$f":"IF(ISERROR(VLOOKUP(K37,[2]Proposito_programa!$C$2:$E$59,2,FALSE)),\" \",VLOOKUP(K37,[2]Proposito_programa!$C$2:$E$59,2,FALSE))","v":"Gestión pública local"},{"$f":"IF(ISERROR(VLOOKUP(K37,[2]Proposito_programa!$C$2:$E$59,3,FALSE)),\" \",VLOOKUP(K37,[2]Proposito_programa!$C$2:$E$59,3,FALSE))","v":"Propósito 5: Construir Bogotá - Región con gobierno abierto, transparente y ciudadanía consciente"},1841,null,52253361,"OLGA LUCIA OBANDO CHACA","Persona Natural",null,null,null,null,13200000,0,1,6600000,19800000,19800000,"2022-01-18","2022-01-21","2022-10-20",180,1,90,null,null,null,null,"Terminado",1]
[24,2022,"FDLCH-CPS-024-2022","https://community.secop.gov.co/Public/Tendering/OpportunityDetail/Index?noticeUID=CO1.NTC.2604040&isFromPublicArea=True&isModal=true&asPopupView=true","Contratos de prestación de servicios profesionales y de apoyo a la gestión","Contratación directa","Prestación de servicios profesionales y de apoyo a la gestión, o para la ejecución de trabajos artísticos que sólo puedan encomendarse a determinadas personas naturales","Prestar los servicios profesionales para apoyar el área gestión del desarrollo local en las actividades contables requeridas por el Fondo de Desarrollo Local de Chapinero.","Inversión","Un nuevo contrato social y ambiental para la Bogotá del Siglo XXI",57,{"$f":"IF(ISERROR(VLOOKUP(K38,[2]Proposito_programa!$C$2:$E$59,2,FALSE)),\" \",VLOOKUP(K38,[2]Proposito_programa!$C$2:$E$59,2,FALSE))","v":"Gestión pública local"},{"$f":"IF(ISERROR(VLOOKUP(K38,[2]Proposito_programa!$C$2:$E$59,3,FALSE)),\" \",VLOOKUP(K38,[2]Proposito_programa!$C$2:$E$59,3,FALSE))","v":"Propósito 5: Construir Bogotá - Región con gobierno abierto, transparente y ciudadanía consciente"},1741,null,7141790,"LEONARDO OROZCO MARTINEZ MARTINEZ","Persona Natural",null,null,null,null,40000000,0,1,20000000,60000000,54333333,"2022-01-18","2022-01-20","2023-01-19",240,1,120,null,null,null,null,"En ejecución",0.9]
[25,2022,"FDLCH-CPS-025-2022","https://community.secop.gov.co/Public/Tendering/OpportunityDetail/Index?noticeUID=CO1.NTC.2618821&isFromPublicArea=True&isModal=true&asPopupView=true","Contratos de prestación de servicios profesionales y de apoyo a la gestión","Contratación directa","Prestación de servicios profesionales y de apoyo a la gestión, o para la ejecución de trabajos artísticos que sólo puedan encomendarse a determinadas personas naturales","Prestar los servicios profesionale spara la gestión, formulación, desarrollo, seguimiento y evaluación del proyecto de inversión \"Chapinero construye tejido cultural\".","Inversión","Un nuevo contrato social y ambiental para la Bogotá del Siglo XXI",21,{"$f":"IF(ISERROR(VLOOKUP(K39,[2]Proposito_programa!$C$2:$E$59,2,FALSE)),\" \",VLOOKUP(K39,[2]Proposito_programa!$C$2:$E$59,2,FALSE))","v":"Creación y vida cotidiana: Apropiación ciudadana del arte, la cultura y el patrimonio, para la democracia cultural"},{"$f":"IF(ISERROR(VLOOKUP(K39,[2]Proposito_programa!$C$2:$E$59,3,FALSE)),\" \",VLOOKUP(K39,[2]Proposito_programa!$C$2:$E$59,3,FALSE))","v":"Propósito 1: Hacer un nuevo contrato social para incrementar la inclusión social, productiva y política"},1848,null,79728807,"HOSMAN HERNAN ARIAS GUTIERREZ","Persona Natural",null,null,null,null,48000000,0,1,21000000,69000000,65000000,"2022-01-19","2022-01-21","2023-01-04",240,1,105,null,null,null,null,"Terminado",1]
[26,2022,"FDLCH-CPS-026-2022","https://community.secop.gov.co/Public/Tendering/OpportunityDetail/Index?noticeUID=CO1.NTC.2619121&isFromPublicArea=True&isModal=true&asPopupView=true","Contratos de prestación de servicios profesionales y de apoyo a la gestión","Contratación directa","Prestación de servicios profesionales y de apoyo a la gestión, o para la ejecución de trabajos artísticos que sólo puedan encomendarse a determinadas personas naturales","Prestar servicios de apoyo a la gestión, para el desarrollo de estrategias que promuevan el uso adecuado del espacio público en la marco del proyecto \"Chapinero es espacio público incluyente y democrático\".","Inversión","Un nuevo contrato social y ambiental para la Bogotá del Siglo XXI",45,{"$f":"IF(ISERROR(VLOOKUP(K40,[2]Proposito_programa!$C$2:$E$59,2,FALSE)),\" \",VLOOKUP(K40,[2]Proposito_programa!$C$2:$E$59,2,FALSE))","v":"Espacio público más seguro y construido colectivamente"},{"$f":"IF(ISERROR(VLOOKUP(K40,[2]Proposito_programa!$C$2:$E$59,3,FALSE)),\" \",VLOOKUP(K40,[2]Proposito_programa!$C$2:$E$59,3,FALSE))","v":"Propósito 3: Inspirar confianza y legitimidad para vivir sin miedo y ser epicentro de cultura ciudadana, paz y reconciliación"},1736,null,79237228,"OMAR ORLANDO BARON VELASCO","Persona Natural",null,null,null,null,13200000,0,1,6600000,19800000,19800000,"2022-01-19","2022-01-24","2022-10-23",180,1,90,null,null,null,null,"Terminado",1]
[27,2022,"FDLCH-CPS-027-2022","https://community.secop.gov.co/Public/Tendering/OpportunityDetail/Index?noticeUID=CO1.NTC.2619268&isFromPublicArea=True&isModal=true&asPopupView=true","Contratos de prestación de servicios profesionales y de apoyo a la gestión","Contratación directa","Prestación de servicios profesionales y de apoyo a la gestión, o para la ejecución de trabajos artísticos que sólo puedan encomendarse a determinadas personas naturales","Prestar servicios técnicos de apoyo a la gestión, para el desarrollo de estrategias que promuevan el uso adecuado del espacio públigo en el marco del proyecto \"Chapinero es espacio público incluyente y democrático\".","Inversión","Un nuevo contrato social y ambiental para la Bogotá del Siglo XXI",45,{"$f":"IF(ISERROR(VLOOKUP(K41,[2]Proposito_programa!$C$2:$E$59,2,FALSE)),\" \",VLOOKUP(K41,[2]Proposito_programa!$C$2:$E$59,2,FALSE))","v":"Espacio público más seguro y construido colectivamente"},{"$f":"IF(ISERROR(VLOOKUP(K41,[2]Proposito_programa!$C$2:$E$59,3,FALSE)),\" \",VLOOKUP(K41,[2]Proposito_programa!$C$2:$E$59,3,FALSE))","v":"Propósito 3: Inspirar confianza y legitimidad para vivir sin miedo y ser epicentro de cultura ciudadana, paz y reconciliación"},1736,null,15677463,"JOSE GREGORIO BOLAÑO MARTINEZ","Persona Natural",null,null,null,null,22800000,0,1,11400000,34200000,34200000,"2022-01-19","2022-01-20","2022-10-19",180,1,90,null,null,null,null,"Terminado",1]
[28,2022,"FDLCH-CPS-028-2022","https://community.secop.gov.co/Public/Tendering/OpportunityDetail/Index?noticeUID=CO1.NTC.2619388&isFromPublicArea=True&isModal=true&asPopupView=true","Contratos de prestación de servicios profesionales y de apoyo a la gestión","Contratación directa","Prestación de servicios profesionales y de apoyo a la gestión, o para la ejecución de trabajos artísticos que sólo puedan encomendarse a determinadas personas naturales","Prestar servicios profesionales para apoyar la gestión de los asuntos relacionados con el adecuado uso del espacio público, medianteactuaciones que propendan por el bienestar de la comunidad en la Localidad de Chapinero, en el marco del proyecto de inversión \" Chapinero es espacio público incluyente y democrático\".","Inversión","Un nuevo contrato social y ambiental para la Bogotá del Siglo XXI",45,{"$f":"IF(ISERROR(VLOOKUP(K42,[2]Proposito_programa!$C$2:$E$59,2,FALSE)),\" \",VLOOKUP(K42,[2]Proposito_programa!$C$2:$E$59,2,FALSE))","v":"Espacio público más seguro y construido colectivamente"},{"$f":"IF(ISERROR(VLOOKUP(K42,[2]Proposito_programa!$C$2:$E$59,3,FALSE)),\" \",VLOOKUP(K42,[2]Proposito_programa!$C$2:$E$59,3,FALSE))","v":"Propósito 3: Inspirar confianza y legitimidad para vivir sin miedo y ser epicentro de cultura ciudadana, paz y reconciliación"},1736,null,11801497,"FELIPE CORDOBA MENDOZA","Persona Natural",null,null,null,null,28800000,0,1,9600000,38400000,38400000,"2022-01-19","2022-01-20","2022-09-19",180,1,60,null,null,null,null,"Terminado",1]
[29,2022,"FDLCH-CPS-029-2022","https://community.secop.gov.co/Public/Tendering/OpportunityDetail/Index?noticeUID=CO1.NTC.2613782&isFromPublicArea=True&isModal=true&asPopupView=true","Contratos de prestación de servicios profesionales y de apoyo a la gestión","Contratación directa","Prestación de servicios profesionales y de apoyo a la gestión, o para la ejecución de trabajos artísticos que sólo puedan encomendarse a determinadas personas naturales","Prestar servicios profesionales para apoyar el área de Gestión del Desarrollo Local de la Alcaldía Local de Chapinero, en la formulación, gestión, ejecución y apoyo a la supervisión de los proyectos relacionados con las estrategias y metas relacionadas con el programa Sistema Distrital de Cuidado y el proyecto Chapinero te cuida, en el marco de la política de fortalecimiento de las organizaciones de mujeres y de género.","Inversión","Un nuevo contrato social y ambiental para la Bogotá del Siglo XXI",6,{"$f":"IF(ISERROR(VLOOKUP(K43,[2]Proposito_programa!$C$2:$E$59,2,FALSE)),\" \",VLOOKUP(K43,[2]Proposito_programa!$C$2:$E$59,2,FALSE))","v":"Sistema Distrital de Cuidado"},{"$f":"IF(ISERROR(VLOOKUP(K43,[2]Proposito_programa!$C$2:$E$59,3,FALSE)),\" \",VLOOKUP(K43,[2]Proposito_programa!$C$2:$E$59,3,FALSE))","v":"Propósito 1: Hacer un nuevo contrato social para incrementar la inclusión social, productiva y política"},1855,null,1110505182,"MONICA LILIANA TOLEDO CHAVARRO","Persona Natural",null,null,null,null,30000000,0,1,15000000,45000000,45000000,"2022-01-20","2022-01-21","2022-10-20",180,1,90,null,null,null,null,"Terminado",1]
[30,2022,"FDLCH-CPS-030-2022","https://community.secop.gov.co/Public/Tendering/OpportunityDetail/Index?noticeUID=CO1.NTC.2619101&isFromPublicArea=True&isModal=true&asPopupView=true","Contratos de prestación de servicios profesionales y de apoyo a la gestión","Contratación directa","Prestación de servicios profesionales y de apoyo a la gestión, o para la ejecución de trabajos artísticos que sólo puedan encomendarse a determinadas personas naturales","Prestar servicios profesionales para apoyar la gestión, formulación, desarrollo, seguimiento y evaluación del proyecto de inversión chapinero promueve y genera confianza ciudadana y realizar los apoyos a la supervisión de los contratos que de él se deriven.","Inversión","Un nuevo contrato social y ambiental para la Bogotá del Siglo XXI",43,{"$f":"IF(ISERROR(VLOOKUP(K44,[2]Proposito_programa!$C$2:$E$59,2,FALSE)),\" \",VLOOKUP(K44,[2]Proposito_programa!$C$2:$E$59,2,FALSE))","v":"Cultura ciudadana para la confianza, la convivencia y la participación desde la vida cotidiana"},{"$f":"IF(ISERROR(VLOOKUP(K44,[2]Proposito_programa!$C$2:$E$59,3,FALSE)),\" \",VLOOKUP(K44,[2]Proposito_programa!$C$2:$E$59,3,FALSE))","v":"Propósito 3: Inspirar confianza y legitimidad para vivir sin miedo y ser epicentro de cultura ciudadana, paz y reconciliación"},1735,null,1026568660,"CRISTIAN ANDRES MONROY CARANTON","Persona Natural",null,null,null,null,27600000,0,1,13800000,41400000,41400000,"2022-01-21","2022-01-24","2022-10-23",180,1,90,null,null,null,null,"Terminado",1]
[31,2022,"FDLCH-CPS-031-2022","https://community.secop.gov.co/Public/Tendering/OpportunityDetail/Index?noticeUID=CO1.NTC.2604430&isFromPublicArea=True&isModal=true&asPopupView=true","Contratos de prestación de servicios profesionales y de apoyo a la gestión","Contratación directa","Prestación de servicios profesionales y de apoyo a la gestión, o para la ejecución de trabajos artísticos que sólo puedan encomendarse a determinadas personas naturales","Prestar servicios profesionales para la administración, soporte técnico y correcto funcionamiento de la infraestructura tecnológica en propiedad o custodia de la Alcaldía Local de Chapinero, así como la formulación de proyectos relacionados.","Inversión","Un nuevo contrato social y ambiental para la Bogotá del Siglo XXI",57,{"$f":"IF(ISERROR(VLOOKUP(K45,[2]Proposito_programa!$C$2:$E$59,2,FALSE)),\" \",VLOOKUP(K45,[2]Proposito_programa!$C$2:$E$59,2,FALSE))","v":"Gestión pública local"},{"$f":"IF(ISERROR(VLOOKUP(K45,[2]Proposito_programa!$C$2:$E$59,3,FALSE)),\" \",VLOOKUP(K45,[2]Proposito_programa!$C$2:$E$59,3,FALSE))","v":"Propósito 5: Construir Bogotá - Región con gobierno abierto, transparente y ciudadanía consciente"},1741,null,1032386167,"ESTEBAN GONZALEZ PORTILLA","Persona Natural",null,null,null,null,27480000,0,2,{"$f":"4580000+9160000","v":13740000},41220000,41220000,"2022-01-19","2022-01-21","2022-10-20",180,2,90,null,null,null,null,"Terminado",1]
[32,2022,"FDLCH-CPS-032-2022","https://community.secop.gov.co/Public/Tendering/OpportunityDetail/Index?noticeUID=CO1.NTC.2609517&isFromPublicArea=True&isModal=true&asPopupView=true","Contratos de prestación de servicios profesionales y de apoyo a la gestión","Contratación directa","Prestación de servicios profesionales y de apoyo a la gestión, o para la ejecución de trabajos artísticos que sólo puedan encomendarse a determinadas personas naturales","Prestar servicios de apoyo a la gestión en la ejecución de las actividades administrativas y documentales relacionadas con la gestión policiva en la alcaldía local de chapinero.","Inversión","Un nuevo contrato social y ambiental para la Bogotá del Siglo XXI",57,{"$f":"IF(ISERROR(VLOOKUP(K46,[2]Proposito_programa!$C$2:$E$59,2,FALSE)),\" \",VLOOKUP(K46,[2]Proposito_programa!$C$2:$E$59,2,FALSE))","v":"Gestión pública local"},{"$f":"IF(ISERROR(VLOOKUP(K46,[2]Proposito_programa!$C$2:$E$59,3,FALSE)),\" \",VLOOKUP(K46,[2]Proposito_programa!$C$2:$E$59,3,FALSE))","v":"Propósito 5: Construir Bogotá - Región con gobierno abierto, transparente y ciudadanía consciente"},1841,null,51765934,"MARIA DIACLIN RODRIGUEZ PULECIO","Persona Natural",null,null,null,null,17600000,0,1,7333333,24933333,18333333,"2022-01-20","2022-01-21","26/10/2022",240,1,100,null,null,null,null,"Terminado",1]
[33,2022,"FDLCH-CPS-033-2022","https://community.secop.gov.co/Public/Tendering/OpportunityDetail/Index?noticeUID=CO1.NTC.2603621&isFromPublicArea=True&isModal=true&asPopupView=true","Contratos de prestación de servicios profesionales y de apoyo a la gestión","Contratación directa","Prestación de servicios profesionales y de apoyo a la gestión, o para la ejecución de trabajos artísticos que sólo puedan encomendarse a determinadas personas naturales","Prestar servicios profesionales para apoyar tecnicamente las actuaciones administrativas, impulso procesar y de inspección, vigilancia y control de competencia de la Alcaldía Local de Chapinero.","Inversión","Un nuevo contrato social y ambiental para la Bogotá del Siglo XXI",57,{"$f":"IF(ISERROR(VLOOKUP(K47,[2]Proposito_programa!$C$2:$E$59,2,FALSE)),\" \",VLOOKUP(K47,[2]Proposito_programa!$C$2:$E$59,2,FALSE))","v":"Gestión pública local"},{"$f":"IF(ISERROR(VLOOKUP(K47,[2]Proposito_programa!$C$2:$E$59,3,FALSE)),\" \",VLOOKUP(K47,[2]Proposito_programa!$C$2:$E$59,3,FALSE))","v":"Propósito 5: Construir Bogotá - Región con gobierno abierto, transparente y ciudadanía consciente"},1841,null,52308262,"IRISAYDEE NOVOA MEDELLIN","Persona Natural",null,null,null,null,29400000,0,1,14700000,44100000,44100000,"2022-01-20","2022-01-21","2022-10-20",180,1,90,null,null,null,null,"Terminado",1]
[34,2022,"FDLCH-CPS-034-2022","https://community.secop.gov.co/Public/Tendering/OpportunityDetail/Index?noticeUID=CO1.NTC.2602410&isFromPublicArea=True&isModal=true&asPopupView=true","Contratos de prestación de servicios profesionales y de apoyo a la gestión","Contratación directa","Prestación de servicios profesionales y de apoyo a la gestión, o para la ejecución de trabajos artísticos que sólo puedan encomendarse a determinadas personas naturales","Prestar servicios de apoyo a la gestión para desarrollar las actividades de radicación, gestión de correspondencia y de la documentación que expide, se allega y controla de la Alcaldía Local de Chapinero.","Inversión","Un nuevo contrato social y ambiental para la Bogotá del Siglo XXI",57,{"$f":"IF(ISERROR(VLOOKUP(K48,[2]Proposito_programa!$C$2:$E$59,2,FALSE)),\" \",VLOOKUP(K48,[2]Proposito_programa!$C$2:$E$59,2,FALSE))","v":"Gestión pública local"},{"$f":"IF(ISERROR(VLOOKUP(K48,[2]Proposito_programa!$C$2:$E$59,3,FALSE)),\" \",VLOOKUP(K48,[2]Proposito_programa!$C$2:$E$59,3,FALSE))","v":"Propósito 5: Construir Bogotá - Región con gobierno abierto, transparente y ciudadanía consciente"},1741,null,1023007285,"JENNYFER MARIA SAUCEDO FUENTES","Persona Natural",null,null,null,null,11850000,0,1,5925000,17775000,17775000,"2022-01-20","2022-01-20","2022-10-19",180,1,90,null,null,null,null,"Terminado",1]
[35,2022,"FDLCH-CPS-035-2022","https://community.secop.gov.co/Public/Tendering/OpportunityDetail/Index?noticeUID=CO1.NTC.2615466&isFromPublicArea=True&isModal=true&asPopupView=true","Contratos de prestación de servicios profesionales y de apoyo a la gestión","Contratación directa","Prestación de servicios profesionales y de apoyo a la gestión, o para la ejecución de trabajos artísticos que sólo puedan encomendarse a determinadas personas naturales","Prestar servicios profesionales para apoyar técnicamente las actuaciones administrativas impulso procesal y de inspección vigilancia y control en las zonas de especial protección de cerros orientales de competencia de la Alcaldía Local de Chapinero\".","Inversión","Un nuevo contrato social y ambiental para la Bogotá del Siglo XXI",57,{"$f":"IF(ISERROR(VLOOKUP(K49,[2]Proposito_programa!$C$2:$E$59,2,FALSE)),\" \",VLOOKUP(K49,[2]Proposito_programa!$C$2:$E$59,2,FALSE))","v":"Gestión pública local"},{"$f":"IF(ISERROR(VLOOKUP(K49,[2]Proposito_programa!$C$2:$E$59,3,FALSE)),\" \",VLOOKUP(K49,[2]Proposito_programa!$C$2:$E$59,3,FALSE))","v":"Propósito 5: Construir Bogotá - Región con gobierno abierto, transparente y ciudadanía consciente"},1841,null,1000145771,"DIANA CAROLINA ERAZO FLOREZ","Persona Natural",null,null,null,null,29400000,0,1,14700000,44100000,44100000,"2022-01-21","2022-01-24","2022-10-23",180,1,null,null,null,null,null,"Terminado",1]
[36,2022,"FDLCH-CPS-036-2022","https://community.secop.gov.co/Public/Tendering/OpportunityDetail/Index?noticeUID=CO1.NTC.2650941&isFromPublicArea=True&isModal=true&asPopupView=true","Contratos de prestación de servicios profesionales y de apoyo a la gestión","Contratación directa","Prestación de servicios profesionales y de apoyo a la gestión, o para la ejecución de trabajos artísticos que sólo puedan encomendarse a determinadas personas naturales","Prestacion de servicios profesionales para la atencion integral del manejo de las comisiones judiciales ordenadas por las autoridades jurisdiccionales y prestar apoyo al cobro persuasivo actuaciones administrativas y policivas de competencia de la Alcaldía Local de Chapinero","Inversión","Un nuevo contrato social y ambiental para la Bogotá del Siglo XXI",57,{"$f":"IF(ISERROR(VLOOKUP(K50,[2]Proposito_programa!$C$2:$E$59,2,FALSE)),\" \",VLOOKUP(K50,[2]Proposito_programa!$C$2:$E$59,2,FALSE))","v":"Gestión pública local"},{"$f":"IF(ISERROR(VLOOKUP(K50,[2]Proposito_programa!$C$2:$E$59,3,FALSE)),\" \",VLOOKUP(K50,[2]Proposito_programa!$C$2:$E$59,3,FALSE))","v":"Propósito 5: Construir Bogotá - Región con gobierno abierto, transparente y ciudadanía consciente"},1841,null,79729789,"ALFREDO ENRIQUE CACERES MENDOZA","Persona Natural",null,null,null,null,46400000,-12373333,1,17400000,51426667,51426667,"2022-01-21","2022-01-25","2022-10-20",240,1,90,null,null,null,null,"Terminado",1]
[37,2022,"FDLCH-CPS-037-2022","https://community.secop.gov.co/Public/Tendering/OpportunityDetail/Index?noticeUID=CO1.NTC.2612087&isFromPublicArea=True&isModal=true&asPopupView=true","Contratos de prestación de servicios profesionales y de apoyo a la gestión","Contratación directa","Prestación de servicios profesionales y de apoyo a la gestión, o para la ejecución de trabajos artísticos que sólo puedan encomendarse a determinadas personas naturales","Prestar servicios profesionales especializados de apoyo al área de Gestión del Desarrollo Local, en la articulación, estructuración y seguimiento del proceso de planeación estratégica local, desarrollando actividades relacionadas con la formulación, seguimiento, terminación y cierre de proyectos de inversión, así como la estructuración, ejecución y cierre de los Planes de Desarrollo Local.","Inversión","Un nuevo contrato social y ambiental para la Bogotá del Siglo XXI",57,{"$f":"IF(ISERROR(VLOOKUP(K51,[2]Proposito_programa!$C$2:$E$59,2,FALSE)),\" \",VLOOKUP(K51,[2]Proposito_programa!$C$2:$E$59,2,FALSE))","v":"Gestión pública local"},{"$f":"IF(ISERROR(VLOOKUP(K51,[2]Proposito_programa!$C$2:$E$59,3,FALSE)),\" \",VLOOKUP(K51,[2]Proposito_programa!$C$2:$E$59,3,FALSE))","v":"Propósito 5: Construir Bogotá - Región con gobierno abierto, transparente y ciudadanía consciente"},1741,null,1022331685,"NELSON MAURICIO REY PEÑA","Persona Natural",null,null,null,null,{"$f":"64618400+30693740","v":95312140},-15885357,null,null,79426783,79426783,"2022-01-20","2022-01-21","2022-11-15",240,1,114,null,null,null,null,"Terminado",1]
[38,2022,"FDLCH-CPS-038-2022","https://community.secop.gov.co/Public/Tendering/OpportunityDetail/Index?noticeUID=CO1.NTC.2617499&isFromPublicArea=True&isModal=true&asPopupView=true","Contratos de prestación de servicios profesionales y de apoyo a la gestión","Contratación directa","Prestación de servicios profesionales y de apoyo a la gestión, o para la ejecución de trabajos artísticos que sólo puedan encomendarse a determinadas personas naturales","Prestar servicios profesionales para apoyar técnicamente las actuaciones administrativas, impulso procesal y de inspección, vigilancia y control de competencia de la Alcaldía Local de Chapinero.","Inversión","Un nuevo contrato social y ambiental para la Bogotá del Siglo XXI",57,{"$f":"IF(ISERROR(VLOOKUP(K52,[2]Proposito_programa!$C$2:$E$59,2,FALSE)),\" \",VLOOKUP(K52,[2]Proposito_programa!$C$2:$E$59,2,FALSE))","v":"Gestión pública local"},{"$f":"IF(ISERROR(VLOOKUP(K52,[2]Proposito_programa!$C$2:$E$59,3,FALSE)),\" \",VLOOKUP(K52,[2]Proposito_programa!$C$2:$E$59,3,FALSE))","v":"Propósito 5: Construir Bogotá - Región con gobierno abierto, transparente y ciudadanía consciente"},1841,null,80799927,"SALOMON RODRIGUEZ LAGUNA","Persona Natural",null,null,null,null,29400000,0,1,14700000,44100000,44100000,"2022-01-20","2022-01-20","2022-10-19",180,1,90,null,null,null,null,"Terminado",1]
[39,2022,"FDLCH-CPS-039-2022","https://community.secop.gov.co/Public/Tendering/OpportunityDetail/Index?noticeUID=CO1.NTC.2602649&isFromPublicArea=True&isModal=true&asPopupView=true","Contratos de prestación de servicios profesionales y de apoyo a la gestión","Contratación directa","Prestación de servicios profesionales y de apoyo a la gestión, o para la ejecución de trabajos artísticos que sólo puedan encomendarse a determinadas personas naturales","Prestar servicios profesionales para apoyar la gestión precontractual, contractual y postcontractual que adelante el Fondo de Desarrollo Local de Chapinero.","Inversión","Un nuevo contrato social y ambiental para la Bogotá del Siglo XXI",57,{"$f":"IF(ISERROR(VLOOKUP(K53,[2]Proposito_programa!$C$2:$E$59,2,FALSE)),\" \",VLOOKUP(K53,[2]Proposito_programa!$C$2:$E$59,2,FALSE))","v":"Gestión pública local"},{"$f":"IF(ISERROR(VLOOKUP(K53,[2]Proposito_programa!$C$2:$E$59,3,FALSE)),\" \",VLOOKUP(K53,[2]Proposito_programa!$C$2:$E$59,3,FALSE))","v":"Propósito 5: Construir Bogotá - Región con gobierno abierto, transparente y ciudadanía consciente"},1741,null,1094248111,"YEINI RAQUEL BLANCO MENDOZA","Persona Natural",null,null,null,null,33000000,0,1,16500000,49500000,49500000,"2022-01-18","2022-01-20","2022-10-19",180,1,90,null,null,null,null,"Terminado",1]
[40,2022,"FDLCH-CPS-040-2022","https://community.secop.gov.co/Public/Tendering/OpportunityDetail/Index?noticeUID=CO1.NTC.2617800&isFromPublicArea=True&isModal=true&asPopupView=true","Contratos de prestación de servicios profesionales y de apoyo a la gestión","Contratación directa","Prestación de servicios profesionales y de apoyo a la gestión, o para la ejecución de trabajos artísticos que sólo puedan encomendarse a determinadas personas naturales","Apoyar jurídicamente la ejecución de las acciones requeridas para la depuración de las actuaciones administrativas que cursan en la Alcaldía Local.","Inversión","Un nuevo contrato social y ambiental para la Bogotá del Siglo XXI",57,{"$f":"IF(ISERROR(VLOOKUP(K54,[2]Proposito_programa!$C$2:$E$59,2,FALSE)),\" \",VLOOKUP(K54,[2]Proposito_programa!$C$2:$E$59,2,FALSE))","v":"Gestión pública local"},{"$f":"IF(ISERROR(VLOOKUP(K54,[2]Proposito_programa!$C$2:$E$59,3,FALSE)),\" \",VLOOKUP(K54,[2]Proposito_programa!$C$2:$E$59,3,FALSE))","v":"Propósito 5: Construir Bogotá - Región con gobierno abierto, transparente y ciudadanía consciente"},1841,null,1073502781,"DIEGO ARMANDO PARRA CASTRO","Persona Natural",null,null,null,null,{"$f":"27600000+24073333","v":51673333},-33120000,null,null,18553333,15026666,"2022-01-19","2022-01-24","2022-08-22",180,null,null,1073502781,"FABIAN MAURICIO CHIBCHA ROMERO","2022-05-16",24073333,"Terminado",1]
[41,2022,"FDLCH-CPS-041-2022","https://community.secop.gov.co/Public/Tendering/OpportunityDetail/Index?noticeUID=CO1.NTC.2623344&isFromPublicArea=True&isModal=true&asPopupView=true","Contratos de prestación de servicios profesionales y de apoyo a la gestión","Contratación directa","Prestación de servicios profesionales y de apoyo a la gestión, o para la ejecución de trabajos artísticos que sólo puedan encomendarse a determinadas personas naturales","Brindar apoyo en la implementación de acciones del plan local de convivencia, seguridad y justicia y el desarrollo de estrategias de dialogo, mediación, convivencia y prevención de conflictividades, violencias y delitos en la localidad de chapinero, para mejorar la seguridad y convivencia.","Inversión","Un nuevo contrato social y ambiental para la Bogotá del Siglo XXI",45,{"$f":"IF(ISERROR(VLOOKUP(K55,[2]Proposito_programa!$C$2:$E$59,2,FALSE)),\" \",VLOOKUP(K55,[2]Proposito_programa!$C$2:$E$59,2,FALSE))","v":"Espacio público más seguro y construido colectivamente"},{"$f":"IF(ISERROR(VLOOKUP(K55,[2]Proposito_programa!$C$2:$E$59,3,FALSE)),\" \",VLOOKUP(K55,[2]Proposito_programa!$C$2:$E$59,3,FALSE))","v":"Propósito 3: Inspirar confianza y legitimidad para vivir sin miedo y ser epicentro de cultura ciudadana, paz y reconciliación"},1736,null,1022364268,"LUIS ALEJANDRO MARTINEZ MARTINEZ","Persona Natural",null,null,null,null,15000000,0,1,7500000,22500000,22500000,"2022-01-20","2022-01-21","2022-10-20",180,1,90,null,null,null,null,"Terminado",1]
[42,2022,"FDLCH-CPS-042-2022","https://community.secop.gov.co/Public/Tendering/OpportunityDetail/Index?noticeUID=CO1.NTC.2623729&isFromPublicArea=True&isModal=true&asPopupView=true","Contratos de prestación de servicios profesionales y de apoyo a la gestión","Contratación directa","Prestación de servicios profesionales y de apoyo a la gestión, o para la ejecución de trabajos artísticos que sólo puedan encomendarse a determinadas personas naturales","Prestar servicios profesionales para apoyar jurídicamente las respuestas a distintas instancias relaconadas con solicitudes allegadas a la Alcaldía Local de Chapinero.","Inversión","Un nuevo contrato social y ambiental para la Bogotá del Siglo XXI",57,{"$f":"IF(ISERROR(VLOOKUP(K56,[2]Proposito_programa!$C$2:$E$59,2,FALSE)),\" \",VLOOKUP(K56,[2]Proposito_programa!$C$2:$E$59,2,FALSE))","v":"Gestión pública local"},{"$f":"IF(ISERROR(VLOOKUP(K56,[2]Proposito_programa!$C$2:$E$59,3,FALSE)),\" \",VLOOKUP(K56,[2]Proposito_programa!$C$2:$E$59,3,FALSE))","v":"Propósito 5: Construir Bogotá - Región con gobierno abierto, transparente y ciudadanía consciente"},1741,null,1012402727,"NATHALY TORRES TORRES","Persona Natural",null,null,null,null,38400000,0,2,{"$f":"16160000+3040000","v":19200000},57600000,52000000,"2022-01-20","2022-01-21","2023-01-19",240,2,120,null,null,null,null,"En ejecución",0.9]
[43,2022,"FDLCH-CPS-043-2022","https://community.secop.gov.co/Public/Tendering/OpportunityDetail/Index?noticeUID=CO1.NTC.2623060&isFromPublicArea=True&isModal=true&asPopupView=true","Contratos de prestación de servicios profesionales y de apoyo a la gestión","Contratación directa","Prestación de servicios profesionales y de apoyo a la gestión, o para la ejecución de trabajos artísticos que sólo puedan encomendarse a determinadas personas naturales","Prestar servicios profesionales para coordinar liderar y asesora los planes y estrategias de comunicación interna y externa para la divualgación de los programas proyectos y actividades de la Alcaldía Local.","Inversión","Un nuevo contrato social y ambiental para la Bogotá del Siglo XXI",57,{"$f":"IF(ISERROR(VLOOKUP(K57,[2]Proposito_programa!$C$2:$E$59,2,FALSE)),\" \",VLOOKUP(K57,[2]Proposito_programa!$C$2:$E$59,2,FALSE))","v":"Gestión pública local"},{"$f":"IF(ISERROR(VLOOKUP(K57,[2]Proposito_programa!$C$2:$E$59,3,FALSE)),\" \",VLOOKUP(K57,[2]Proposito_programa!$C$2:$E$59,3,FALSE))","v":"Propósito 5: Construir Bogotá - Región con gobierno abierto, transparente y ciudadanía consciente"},1741,null,1026259433,"HAYDIBERS ARREDONDO BAUTISTA","Persona Natural",null,null,null,null,57600000,0,1,28800000,86400000,78240000,"2022-01-20","2022-01-20","2023-01-19",240,1,120,null,null,null,null,"En ejecución",0.9]
[44,2022,"FDLCH-CPS-044-2022","https://community.secop.gov.co/Public/Tendering/OpportunityDetail/Index?noticeUID=CO1.NTC.2623463&isFromPublicArea=True&isModal=true&asPopupView=true","Contratos de prestación de servicios profesionales y de apoyo a la gestión","Contratación directa","Prestación de servicios profesionales y de apoyo a la gestión, o para la ejecución de trabajos artísticos que sólo puedan encomendarse a determinadas personas naturales","Prestar servicios profesionales para la gestion formulacion desarrollo seguimiento y evaluación del Proyecto Justicia accesible y oportuna para Chapinero.","Inversión","Un nuevo contrato social y ambiental para la Bogotá del Siglo XXI",48,{"$f":"IF(ISERROR(VLOOKUP(K58,[2]Proposito_programa!$C$2:$E$59,2,FALSE)),\" \",VLOOKUP(K58,[2]Proposito_programa!$C$2:$E$59,2,FALSE))","v":"Plataforma institucional para la seguridad y justicia"},{"$f":"IF(ISERROR(VLOOKUP(K58,[2]Proposito_programa!$C$2:$E$59,3,FALSE)),\" \",VLOOKUP(K58,[2]Proposito_programa!$C$2:$E$59,3,FALSE))","v":"Propósito 3: Inspirar confianza y legitimidad para vivir sin miedo y ser epicentro de cultura ciudadana, paz y reconciliación"},1738,null,1010219432,"SANTIAGO ALEJANDRO CARDENAS CABALLERO","Persona Natural",null,null,null,null,27600000,0,1,13800000,41400000,41400000,"2022-01-21","2022-01-24","2022-10-23",180,1,90,null,null,null,null,"Terminado",1]
[45,2022,"FDLCH-CPS-045-2022","https://community.secop.gov.co/Public/Tendering/OpportunityDetail/Index?noticeUID=CO1.NTC.2623094&isFromPublicArea=True&isModal=true&asPopupView=true","Contratos de prestación de servicios profesionales y de apoyo a la gestión","Contratación directa","Prestación de servicios profesionales y de apoyo a la gestión, o para la ejecución de trabajos artísticos que sólo puedan encomendarse a determinadas personas naturales","Prestar servicios profesionales para apoyar a los responsables integrantes de los procesos en la implementación de herramientas de gestión, siguiendo los lineamientos metodológicos establecidos por la oficina asesora de planeación de la Secretaria Distrital de Gobierno.","Inversión","Un nuevo contrato social y ambiental para la Bogotá del Siglo XXI",57,{"$f":"IF(ISERROR(VLOOKUP(K59,[2]Proposito_programa!$C$2:$E$59,2,FALSE)),\" \",VLOOKUP(K59,[2]Proposito_programa!$C$2:$E$59,2,FALSE))","v":"Gestión pública local"},{"$f":"IF(ISERROR(VLOOKUP(K59,[2]Proposito_programa!$C$2:$E$59,3,FALSE)),\" \",VLOOKUP(K59,[2]Proposito_programa!$C$2:$E$59,3,FALSE))","v":"Propósito 5: Construir Bogotá - Región con gobierno abierto, transparente y ciudadanía consciente"},1741,null,1030525081,"BLANCA LEIDY NAVARRO DOMINGUEZ","Persona Natural",null,null,null,null,44000000,0,1,22000000,66000000,59583333,"2022-01-20","2022-01-21","2023-01-20",240,1,120,null,null,null,null,"En ejecución",0.9]
[46,2022,"FDLCH-CPS-046-2022","https://community.secop.gov.co/Public/Tendering/OpportunityDetail/Index?noticeUID=CO1.NTC.2623041&isFromPublicArea=True&isModal=true&asPopupView=true","Contratos de prestación de servicios profesionales y de apoyo a la gestión","Contratación directa","Prestación de servicios profesionales y de apoyo a la gestión, o para la ejecución de trabajos artísticos que sólo puedan encomendarse a determinadas personas naturales","Prestar servicios profesionales para apoyar la gestión precontractual, contractual y postcontractual que adelante el Fondo de Desarrollo Local de Chapinero.","Inversión","Un nuevo contrato social y ambiental para la Bogotá del Siglo XXI",57,{"$f":"IF(ISERROR(VLOOKUP(K60,[2]Proposito_programa!$C$2:$E$59,2,FALSE)),\" \",VLOOKUP(K60,[2]Proposito_programa!$C$2:$E$59,2,FALSE))","v":"Gestión pública local"},{"$f":"IF(ISERROR(VLOOKUP(K60,[2]Proposito_programa!$C$2:$E$59,3,FALSE)),\" \",VLOOKUP(K60,[2]Proposito_programa!$C$2:$E$59,3,FALSE))","v":"Propósito 5: Construir Bogotá - Región con gobierno abierto, transparente y ciudadanía consciente"},1741,null,1144193027,"JUAN FERNANDO VILLEGAS MOTOA","Persona Natural",null,null,null,null,27480000,0,1,13740000,41220000,41220000,"2022-01-20","2022-01-20","2022-10-19",180,1,90,null,null,null,null,"Terminado",1]
[47,2022,"FDLCH-CPS-047-2022","https://community.secop.gov.co/Public/Tendering/OpportunityDetail/Index?noticeUID=CO1.NTC.2632013&isFromPublicArea=True&isModal=true&asPopupView=true","Contratos de prestación de servicios profesionales y de apoyo a la gestión","Contratación directa","Prestación de servicios profesionales y de apoyo a la gestión, o para la ejecución de trabajos artísticos que sólo puedan encomendarse a determinadas personas naturales","Prestación de servicios profesionales para la gestión, formulación, desarrollo, seguimiento y evaluación del proyecto de inversión local “Jóvenes comprometidos por Chapinero”, así como el apoyo a la supervisión de los contrataos que le sean asignados por el Alcalde Local.","Inversión","Un nuevo contrato social y ambiental para la Bogotá del Siglo XXI",34,{"$f":"IF(ISERROR(VLOOKUP(K61,[2]Proposito_programa!$C$2:$E$59,2,FALSE)),\" \",VLOOKUP(K61,[2]Proposito_programa!$C$2:$E$59,2,FALSE))","v":"Bogotá protectora de los animales"},{"$f":"IF(ISERROR(VLOOKUP(K61,[2]Proposito_programa!$C$2:$E$59,3,FALSE)),\" \",VLOOKUP(K61,[2]Proposito_programa!$C$2:$E$59,3,FALSE))","v":"Propósito 2 : Cambiar Nuestros Hábitos de Vida para Reverdecer a Bogotá y Adaptarnos y Mitigar la Crisis Climática"},1731,null,33366680,"FRANCY PAOLA MONROY ALVAREZ","Persona Natural",null,null,null,null,30972000,0,1,15486000,46458000,46458000,"2022-01-20","2022-01-24","2022-10-23",180,1,90,null,null,null,null,"Terminado",1]
[48,2022,"FDLCH-CPS-048-2022","https://community.secop.gov.co/Public/Tendering/OpportunityDetail/Index?noticeUID=CO1.NTC.2632297&isFromPublicArea=True&isModal=true&asPopupView=true","Contratos de prestación de servicios profesionales y de apoyo a la gestión","Contratación directa","Prestación de servicios profesionales y de apoyo a la gestión, o para la ejecución de trabajos artísticos que sólo puedan encomendarse a determinadas personas naturales","Prestar servicios profesionales para la gestión, formulación, desarrollo y seguimiento del proyecto de inversión proyecto chapinero sostenible y consciente.","Inversión","Un nuevo contrato social y ambiental para la Bogotá del Siglo XXI",38,{"$f":"IF(ISERROR(VLOOKUP(K62,[2]Proposito_programa!$C$2:$E$59,2,FALSE)),\" \",VLOOKUP(K62,[2]Proposito_programa!$C$2:$E$59,2,FALSE))","v":"Ecoeficiencia, reciclaje, manejo de residuos e inclusión de la población recicladora"},{"$f":"IF(ISERROR(VLOOKUP(K62,[2]Proposito_programa!$C$2:$E$59,3,FALSE)),\" \",VLOOKUP(K62,[2]Proposito_programa!$C$2:$E$59,3,FALSE))","v":"Propósito 2 : Cambiar Nuestros Hábitos de Vida para Reverdecer a Bogotá y Adaptarnos y Mitigar la Crisis Climática"},1728,null,1019031184,"RAYMOND ALEXANDER JIMENEZ ARTEAGA","Persona Natural",null,null,null,null,30000000,0,2,15000000,45000000,45000000,"2022-01-20","2022-01-24","2022-11-02",180,2,90,null,null,null,null,"Terminado",1]
[49,2022,"FDLCH-CPS-049-2022","https://community.secop.gov.co/Public/Tendering/OpportunityDetail/Index?noticeUID=CO1.NTC.2632900&isFromPublicArea=True&isModal=true&asPopupView=true","Contratos de prestación de servicios profesionales y de apoyo a la gestión","Contratación directa","Prestación de servicios profesionales y de apoyo a la gestión, o para la ejecución de trabajos artísticos que sólo puedan encomendarse a determinadas personas naturales","Prestar los servicios profesionales para apoyar el área de Gestión del Desarrollo local de la Alcaldía Local de Chapinero, en la formulación, gestión, ejecución y apoyo a la supervisión de los proyectos relacionados con los temas de salud, en cumplimiento de las metas y objetivos del Plan de Desarrollo Local.","Inversión","Un nuevo contrato social y ambiental para la Bogotá del Siglo XXI",6,{"$f":"IF(ISERROR(VLOOKUP(K63,[2]Proposito_programa!$C$2:$E$59,2,FALSE)),\" \",VLOOKUP(K63,[2]Proposito_programa!$C$2:$E$59,2,FALSE))","v":"Sistema Distrital de Cuidado"},{"$f":"IF(ISERROR(VLOOKUP(K63,[2]Proposito_programa!$C$2:$E$59,3,FALSE)),\" \",VLOOKUP(K63,[2]Proposito_programa!$C$2:$E$59,3,FALSE))","v":"Propósito 1: Hacer un nuevo contrato social para incrementar la inclusión social, productiva y política"},2024,null,53037864,"DIANA CAROLINA MORENO RINCON","Persona Natural",null,null,null,null,30000000,0,2,15000000,45000000,45000000,"2022-01-20","2022-01-24","2022-10-23",180,2,90,null,null,null,null,"Terminado",1]
[50,2022,"FDLCH-CPS-050-2022","https://community.secop.gov.co/Public/Tendering/OpportunityDetail/Index?noticeUID=CO1.NTC.2649478&isFromPublicArea=True&isModal=true&asPopupView=true","Contratos de prestación de servicios profesionales y de apoyo a la gestión","Contratación directa","Prestación de servicios profesionales y de apoyo a la gestión, o para la ejecución de trabajos artísticos que sólo puedan encomendarse a determinadas personas naturales","Prestar servicios de apoyo a las labores de entrega y recibo de las comunicaciones emitidas o recibidas por la Alcaldía Local de Chapinero.","Inversión","Un nuevo contrato social y ambiental para la Bogotá del Siglo XXI",57,{"$f":"IF(ISERROR(VLOOKUP(K64,[2]Proposito_programa!$C$2:$E$59,2,FALSE)),\" \",VLOOKUP(K64,[2]Proposito_programa!$C$2:$E$59,2,FALSE))","v":"Gestión pública local"},{"$f":"IF(ISERROR(VLOOKUP(K64,[2]Proposito_programa!$C$2:$E$59,3,FALSE)),\" \",VLOOKUP(K64,[2]Proposito_programa!$C$2:$E$59,3,FALSE))","v":"Propósito 5: Construir Bogotá - Región con gobierno abierto, transparente y ciudadanía consciente"},1741,null,1019024025,"EFRAIN ANDRES MONROY CEPEDA","Persona Natural",null,null,null,null,20000000,0,2,{"$f":"8166666+1833333","v":9999999},29999999,26833333,"2022-01-21","2022-01-24","22/01/2023",240,2,120,null,null,null,null,"En ejecución",0.9]
[51,2022,"FDLCH-CPS-051-2022","https://community.secop.gov.co/Public/Tendering/OpportunityDetail/Index?noticeUID=CO1.NTC.2630550&isFromPublicArea=True&isModal=true&asPopupView=true","Contratos de prestación de servicios profesionales y de apoyo a la gestión","Contratación directa","Prestación de servicios profesionales y de apoyo a la gestión, o para la ejecución de trabajos artísticos que sólo puedan encomendarse a determinadas personas naturales","Prestar servicios profesionales para apoyar las liquidaciones de contratos, la gestión precontractual, contractual y postcontractual, que adelante el Fondo de Desarrollo Local de Chapinero.","Inversión","Un nuevo contrato social y ambiental para la Bogotá del Siglo XXI",57,{"$f":"IF(ISERROR(VLOOKUP(K65,[2]Proposito_programa!$C$2:$E$59,2,FALSE)),\" \",VLOOKUP(K65,[2]Proposito_programa!$C$2:$E$59,2,FALSE))","v":"Gestión pública local"},{"$f":"IF(ISERROR(VLOOKUP(K65,[2]Proposito_programa!$C$2:$E$59,3,FALSE)),\" \",VLOOKUP(K65,[2]Proposito_programa!$C$2:$E$59,3,FALSE))","v":"Propósito 5: Construir Bogotá - Región con gobierno abierto, transparente y ciudadanía consciente"},1741,null,52900762,"JENNY CAROLINA GIRON CUERVO","Persona Natural",null,null,null,null,36000000,0,1,18000000,54000000,54000000,"2022-01-21","2022-01-24","2022-10-23",180,1,90,null,null,null,null,"Terminado",1]
[52,2022,"FDLCH-CPS-052-2022","https://community.secop.gov.co/Public/Tendering/OpportunityDetail/Index?noticeUID=CO1.NTC.2649478&isFromPublicArea=True&isModal=true&asPopupView=true","Contratos de prestación de servicios profesionales y de apoyo a la gestión","Contratación directa","Prestación de servicios profesionales y de apoyo a la gestión, o para la ejecución de trabajos artísticos que sólo puedan encomendarse a determinadas personas naturales","Prestar los servicios profesionales de apoyo a la gestión, formulación, desarrollo, seguimiento y evaluación del proyecto de inversión chapinero epicentro del deporte y la recreación.","Inversión","Un nuevo contrato social y ambiental para la Bogotá del Siglo XXI",20,{"$f":"IF(ISERROR(VLOOKUP(K66,[2]Proposito_programa!$C$2:$E$59,2,FALSE)),\" \",VLOOKUP(K66,[2]Proposito_programa!$C$2:$E$59,2,FALSE))","v":"Bogotá, referente en cultura, deporte, recreación y actividad física, con parques para el desarrollo y la salud"},{"$f":"IF(ISERROR(VLOOKUP(K66,[2]Proposito_programa!$C$2:$E$59,3,FALSE)),\" \",VLOOKUP(K66,[2]Proposito_programa!$C$2:$E$59,3,FALSE))","v":"Propósito 1: Hacer un nuevo contrato social para incrementar la inclusión social, productiva y política"},1845,null,1030592221,"MIGUEL ANGEL DELGADO BARRERA","Persona Natural",null,null,null,null,40000000,-1,2,20000000,59999999,53166667,"2022-01-21","2022-01-24","22/01/2023",240,1,120,1033802617,"LAURA CAMILA RAMIREZ ","2022-11-04",11333333,"En ejecución",0.9]
[53,2022,"FDLCH-CPS-053-2022","https://community.secop.gov.co/Public/Tendering/OpportunityDetail/Index?noticeUID=CO1.NTC.2641186&isFromPublicArea=True&isModal=true&asPopupView=true","Contratos de prestación de servicios profesionales y de apoyo a la gestión","Contratación directa","Prestación de servicios profesionales y de apoyo a la gestión, o para la ejecución de trabajos artísticos que sólo puedan encomendarse a determinadas personas naturales","Prestar servicios profesionales para apoyar al area de Gestion del Desarrollo Local de la Alcaldía Local de Chapinero en la formulacion gestion ejecucion y seguimiento de los contratos derivados del proyecto de inversión Chapinero cultural y creativa y la supervision de contratos que le sean asignados.","Inversión","Un nuevo contrato social y ambiental para la Bogotá del Siglo XXI",21,{"$f":"IF(ISERROR(VLOOKUP(K67,[2]Proposito_programa!$C$2:$E$59,2,FALSE)),\" \",VLOOKUP(K67,[2]Proposito_programa!$C$2:$E$59,2,FALSE))","v":"Creación y vida cotidiana: Apropiación ciudadana del arte, la cultura y el patrimonio, para la democracia cultural"},{"$f":"IF(ISERROR(VLOOKUP(K67,[2]Proposito_programa!$C$2:$E$59,3,FALSE)),\" \",VLOOKUP(K67,[2]Proposito_programa!$C$2:$E$59,3,FALSE))","v":"Propósito 1: Hacer un nuevo contrato social para incrementar la inclusión social, productiva y política"},1848,null,55061809,"CLAUDIA YANETH FERRO DUCUARA ","Persona Natural",null,null,null,null,30000000,0,1,15000000,45000000,45000000,"2022-01-21","2022-01-24","2022-10-23",180,1,90,null,null,null,null,"Terminado",1]
[54,2022,"FDLCH-CPS-054-2022","https://community.secop.gov.co/Public/Tendering/OpportunityDetail/Index?noticeUID=CO1.NTC.2641319&isFromPublicArea=True&isModal=true&asPopupView=true","Contratos de prestación de servicios profesionales y de apoyo a la gestión","Contratación directa","Prestación de servicios profesionales y de apoyo a la gestión, o para la ejecución de trabajos artísticos que sólo puedan encomendarse a determinadas personas naturales","Prestar servicios profesionales para apoyar el area Gestion del Desarrollo Local de la Alcaldia Local de Chapinero en los aspectos económicos y financieros de las etapas pre contractuales contractuales y post contractuales de los proyectos de inversion así como la produccion consolidación y analisis de datos estadísticas e informes de impacto del Plan de Desarrollo Local.","Inversión","Un nuevo contrato social y ambiental para la Bogotá del Siglo XXI",57,{"$f":"IF(ISERROR(VLOOKUP(K68,[2]Proposito_programa!$C$2:$E$59,2,FALSE)),\" \",VLOOKUP(K68,[2]Proposito_programa!$C$2:$E$59,2,FALSE))","v":"Gestión pública local"},{"$f":"IF(ISERROR(VLOOKUP(K68,[2]Proposito_programa!$C$2:$E$59,3,FALSE)),\" \",VLOOKUP(K68,[2]Proposito_programa!$C$2:$E$59,3,FALSE))","v":"Propósito 5: Construir Bogotá - Región con gobierno abierto, transparente y ciudadanía consciente"},1741,null,1016059999,"CRISTIAN DANIEL VILLARREAL PARROQUIANO","Persona Natural",null,null,null,null,36800000,0,1,17020000,53820000,49373333,"2022-01-21","2022-01-24","2023-01-13",240,1,111,null,null,null,null,"En ejecución",0.9]
[55,2022,"FDLCH-CPS-055-2022","https://community.secop.gov.co/Public/Tendering/OpportunityDetail/Index?noticeUID=CO1.NTC.2649357&isFromPublicArea=True&isModal=true&asPopupView=true","Contratos de prestación de servicios profesionales y de apoyo a la gestión","Contratación directa","Prestación de servicios profesionales y de apoyo a la gestión, o para la ejecución de trabajos artísticos que sólo puedan encomendarse a determinadas personas naturales","Prestar los servicios profesionales para coordinar la articulación, asistencia y acompañamiento de los procesos de planeación local, para la promoción de la participación de las mujeres y de la equidad de genero, para materializar en la localidad las estrategias de territorialización y transversalización de la politica de mujeres y equidad de genero. PPMYEG.","Inversión","Un nuevo contrato social y ambiental para la Bogotá del Siglo XXI",40,{"$f":"IF(ISERROR(VLOOKUP(K69,[2]Proposito_programa!$C$2:$E$59,2,FALSE)),\" \",VLOOKUP(K69,[2]Proposito_programa!$C$2:$E$59,2,FALSE))","v":"Más mujeres viven una vida libre de violencias, se sienten seguras y acceden con confianza al sistema de justicia"},{"$f":"IF(ISERROR(VLOOKUP(K69,[2]Proposito_programa!$C$2:$E$59,3,FALSE)),\" \",VLOOKUP(K69,[2]Proposito_programa!$C$2:$E$59,3,FALSE))","v":"Propósito 3: Inspirar confianza y legitimidad para vivir sin miedo y ser epicentro de cultura ciudadana, paz y reconciliación"},2035,null,1110174525,"VIVIANA LOZANO DUCUARA","Persona Natural",null,null,null,null,49600000,-7853333,null,null,41746667,41746667,"2022-01-21","2022-01-24","2022-08-16",240,null,null,null,null,null,null,"Terminado",1]
[56,2022,"FDLCH-CPS-056-2022","https://community.secop.gov.co/Public/Tendering/OpportunityDetail/Index?noticeUID=CO1.NTC.2632824&isFromPublicArea=True&isModal=true&asPopupView=true","Contratos de prestación de servicios profesionales y de apoyo a la gestión","Contratación directa","Prestación de servicios profesionales y de apoyo a la gestión, o para la ejecución de trabajos artísticos que sólo puedan encomendarse a determinadas personas naturales","Prestar los servicios de apoyo necesarios para la conducción de los vehículos que conforman el parque automotor en propiedad o custodia del fondo de desarrollo local de chapinero, y el transporte de servidores públicos para la realización de las actividades misionales de la Alcaldía Local de Chapinero.","Inversión","Un nuevo contrato social y ambiental para la Bogotá del Siglo XXI",57,{"$f":"IF(ISERROR(VLOOKUP(K70,[2]Proposito_programa!$C$2:$E$59,2,FALSE)),\" \",VLOOKUP(K70,[2]Proposito_programa!$C$2:$E$59,2,FALSE))","v":"Gestión pública local"},{"$f":"IF(ISERROR(VLOOKUP(K70,[2]Proposito_programa!$C$2:$E$59,3,FALSE)),\" \",VLOOKUP(K70,[2]Proposito_programa!$C$2:$E$59,3,FALSE))","v":"Propósito 5: Construir Bogotá - Región con gobierno abierto, transparente y ciudadanía consciente"},1741,null,3220879,"BENEDICTO VANEGAS CASTELLANOS","Persona Natural",null,null,null,null,{"$f":"20800000+20280000","v":41080000},-20280000,2,{"$f":"8753333+1646666","v":10399999},31199999,28166667,"2022-01-20","2022-01-21","19/01/2023",240,2,120,79910420,"HAMILTON ARREDONDO BAUTISTA","2022-01-27",20280000,"En ejecución",0.9]
[57,2022,"FDLCH-CPS-057-2022","https://community.secop.gov.co/Public/Tendering/OpportunityDetail/Index?noticeUID=CO1.NTC.2641910&isFromPublicArea=True&isModal=true&asPopupView=true","Contratos de prestación de servicios profesionales y de apoyo a la gestión","Contratación directa","Prestación de servicios profesionales y de apoyo a la gestión, o para la ejecución de trabajos artísticos que sólo puedan encomendarse a determinadas personas naturales","Prestar servicios profesionales de apoyo para la gestión formulación, desarrollo y seguimiento del proyecto de inversión no. 1715 chapinero restaurador y cuidador del territorio.","Inversión","Un nuevo contrato social y ambiental para la Bogotá del Siglo XXI",28,{"$f":"IF(ISERROR(VLOOKUP(K71,[2]Proposito_programa!$C$2:$E$59,2,FALSE)),\" \",VLOOKUP(K71,[2]Proposito_programa!$C$2:$E$59,2,FALSE))","v":"Bogotá protectora de sus recursos naturales"},{"$f":"IF(ISERROR(VLOOKUP(K71,[2]Proposito_programa!$C$2:$E$59,3,FALSE)),\" \",VLOOKUP(K71,[2]Proposito_programa!$C$2:$E$59,3,FALSE))","v":"Propósito 2 : Cambiar Nuestros Hábitos de Vida para Reverdecer a Bogotá y Adaptarnos y Mitigar la Crisis Climática"},1715,null,11442710,"TITO FABIAN RUIZ BARAJAS","Persona Natural",null,null,null,null,30000000,0,1,15000000,45000000,45000000,"2022-01-21","2022-01-24","2022-10-23",180,1,90,null,null,null,null,"Terminado",1]
[58,2022,"FDLCH-CPS-058-2022","https://community.secop.gov.co/Public/Tendering/OpportunityDetail/Index?noticeUID=CO1.NTC.2633579&isFromPublicArea=True&isModal=true&asPopupView=true","Contratos de prestación de servicios profesionales y de apoyo a la gestión","Contratación directa","Prestación de servicios profesionales y de apoyo a la gestión, o para la ejecución de trabajos artísticos que sólo puedan encomendarse a determinadas personas naturales","Apoyar jurídicamente la ejecución de las acciones requeridas para la depuración de las actuaciones administrativas que cursan en la Alcaldía Local.","Inversión","Un nuevo contrato social y ambiental para la Bogotá del Siglo XXI",57,{"$f":"IF(ISERROR(VLOOKUP(K72,[2]Proposito_programa!$C$2:$E$59,2,FALSE)),\" \",VLOOKUP(K72,[2]Proposito_programa!$C$2:$E$59,2,FALSE))","v":"Gestión pública local"},{"$f":"IF(ISERROR(VLOOKUP(K72,[2]Proposito_programa!$C$2:$E$59,3,FALSE)),\" \",VLOOKUP(K72,[2]Proposito_programa!$C$2:$E$59,3,FALSE))","v":"Propósito 5: Construir Bogotá - Región con gobierno abierto, transparente y ciudadanía consciente"},1841,null,1022327851,"JUAN CAMILO RAMIREZ PINTO","Persona Natural",null,null,null,null,36800000,0,1,13800000,50600000,47073333,"2022-01-20","2022-01-24","2022-12-23",240,1,90,null,null,null,null,"Terminado",1]
[59,2022,"FDLCH-CPS-059-2022","https://community.secop.gov.co/Public/Tendering/OpportunityDetail/Index?noticeUID=CO1.NTC.2651889&isFromPublicArea=True&isModal=true&asPopupView=true","Contratos de prestación de servicios profesionales y de apoyo a la gestión","Contratación directa","Prestación de servicios profesionales y de apoyo a la gestión, o para la ejecución de trabajos artísticos que sólo puedan encomendarse a determinadas personas naturales","Prestar los servicios de apoyo necesarios para la conducción de los vehículos que conforman el parque automotor en propiedad o custodia del fondo de desarrollo local de chapinero, y el transporte de servidores públicos para la realización de las actividades misionales de la alcaldía local de chapinero","Inversión","Un nuevo contrato social y ambiental para la Bogotá del Siglo XXI",57,{"$f":"IF(ISERROR(VLOOKUP(K73,[2]Proposito_programa!$C$2:$E$59,2,FALSE)),\" \",VLOOKUP(K73,[2]Proposito_programa!$C$2:$E$59,2,FALSE))","v":"Gestión pública local"},{"$f":"IF(ISERROR(VLOOKUP(K73,[2]Proposito_programa!$C$2:$E$59,3,FALSE)),\" \",VLOOKUP(K73,[2]Proposito_programa!$C$2:$E$59,3,FALSE))","v":"Propósito 5: Construir Bogotá - Región con gobierno abierto, transparente y ciudadanía consciente"},1741,null,80012471,"LUIS GIOVANNY LOPEZ SIMIJACA","Persona Natural",null,null,null,null,15600000,0,1,7800000,23400000,23400000,"2022-01-21","2022-01-24","2022-10-23",180,1,90,null,null,null,null,"Terminado",1]
[60,2022,"FDLCH-CPS-060-2022","https://community.secop.gov.co/Public/Tendering/OpportunityDetail/Index?noticeUID=CO1.NTC.2649934&isFromPublicArea=True&isModal=true&asPopupView=true","Contratos de prestación de servicios profesionales y de apoyo a la gestión","Contratación directa","Prestación de servicios profesionales y de apoyo a la gestión, o para la ejecución de trabajos artísticos que sólo puedan encomendarse a determinadas personas naturales","Prestar servicios profesionales para el apoyo al área de gestión del desarrollo local de la Alcaldía Local de Chapinero en la formulación, gestión, ejecución, desarrollo y seguimiento de los contratos derivados del proyecto. Chapinero Liderado por la Ciudadanía así como el apoyo a la supervisión de los contratos que le sean asignados por el Alcalde Local.","Inversión","Un nuevo contrato social y ambiental para la Bogotá del Siglo XXI",55,{"$f":"IF(ISERROR(VLOOKUP(K74,[2]Proposito_programa!$C$2:$E$59,2,FALSE)),\" \",VLOOKUP(K74,[2]Proposito_programa!$C$2:$E$59,2,FALSE))","v":"Fortalecimiento de cultura ciudadana y su institucionalidad"},{"$f":"IF(ISERROR(VLOOKUP(K74,[2]Proposito_programa!$C$2:$E$59,3,FALSE)),\" \",VLOOKUP(K74,[2]Proposito_programa!$C$2:$E$59,3,FALSE))","v":"Propósito 5: Construir Bogotá - Región con gobierno abierto, transparente y ciudadanía consciente"},1739,null,1090489409,"CARLOS ARTURO BARBOSA PEREZ","Persona Natural",null,null,null,null,30000000,-15166666,null,null,14833334,14833334,"2022-01-21","2022-01-24","2022-08-12",180,null,null,null,null,null,null,"Terminado",1]
[61,2022,"FDLCH-CPS-061-2022","https://community.secop.gov.co/Public/Tendering/OpportunityDetail/Index?noticeUID=CO1.NTC.2651372&isFromPublicArea=True&isModal=true&asPopupView=true","Contratos de prestación de servicios profesionales y de apoyo a la gestión","Contratación directa","Prestación de servicios profesionales y de apoyo a la gestión, o para la ejecución de trabajos artísticos que sólo puedan encomendarse a determinadas personas naturales","Prestar servicios técnicos para apoyo a la gestión, formulación, desarrollo y seguimieno del proyecto de inversión No. 1731 \"CHAPINERO DEJANDO HUELLA POR LOS ANIMALES\"","Inversión","Un nuevo contrato social y ambiental para la Bogotá del Siglo XXI",34,{"$f":"IF(ISERROR(VLOOKUP(K75,[2]Proposito_programa!$C$2:$E$59,2,FALSE)),\" \",VLOOKUP(K75,[2]Proposito_programa!$C$2:$E$59,2,FALSE))","v":"Bogotá protectora de los animales"},{"$f":"IF(ISERROR(VLOOKUP(K75,[2]Proposito_programa!$C$2:$E$59,3,FALSE)),\" \",VLOOKUP(K75,[2]Proposito_programa!$C$2:$E$59,3,FALSE))","v":"Propósito 2 : Cambiar Nuestros Hábitos de Vida para Reverdecer a Bogotá y Adaptarnos y Mitigar la Crisis Climática"},1731,null,1022411110,"VERONICA SIMONA MARTINEZ AREVALO","Persona Natural",null,null,null,null,16800000,0,null,null,16800000,16800000,"2022-01-21","2022-01-24","2022-07-23",180,null,null,null,null,null,null,"Terminado",1]
[62,2022,"FDLCH-CPS-062-2022","https://community.secop.gov.co/Public/Tendering/OpportunityDetail/Index?noticeUID=CO1.NTC.2651867&isFromPublicArea=True&isModal=true&asPopupView=true","Contratos de prestación de servicios profesionales y de apoyo a la gestión","Contratación directa","Prestación de servicios profesionales y de apoyo a la gestión, o para la ejecución de trabajos artísticos que sólo puedan encomendarse a determinadas personas naturales","Prestar servicios profesionales para apoyar el área de gestión de desarrollo local de la Alcaldía Local de Chapinero,en formulación, gestión, ejecución y apoyo a la supervisión de los proyectos relacionados con las estrategias y metas relacionadas con el programa sistema distrital de cuidado y fortalecimiento de organizaciones sociales, comunitarias y comunales locales.","Inversión","Un nuevo contrato social y ambiental para la Bogotá del Siglo XXI",6,{"$f":"IF(ISERROR(VLOOKUP(K76,[2]Proposito_programa!$C$2:$E$59,2,FALSE)),\" \",VLOOKUP(K76,[2]Proposito_programa!$C$2:$E$59,2,FALSE))","v":"Sistema Distrital de Cuidado"},{"$f":"IF(ISERROR(VLOOKUP(K76,[2]Proposito_programa!$C$2:$E$59,3,FALSE)),\" \",VLOOKUP(K76,[2]Proposito_programa!$C$2:$E$59,3,FALSE))","v":"Propósito 1: Hacer un nuevo contrato social para incrementar la inclusión social, productiva y política"},1710,null,80092921,"FEDERICO SANTIAGO BALLESTEROS","Persona Natural",null,null,null,null,27600000,0,1,13800000,41400000,41400000,"2022-01-21","2022-01-24","2022-10-23",180,1,90,null,null,null,null,"Terminado",1]
[63,2022,"FDLCH-CPS-063-2022","https://community.secop.gov.co/Public/Tendering/OpportunityDetail/Index?noticeUID=CO1.NTC.2651516&isFromPublicArea=True&isModal=true&asPopupView=true","Contratos de prestación de servicios profesionales y de apoyo a la gestión","Contratación directa","Prestación de servicios profesionales y de apoyo a la gestión, o para la ejecución de trabajos artísticos que sólo puedan encomendarse a determinadas personas naturales","Apoyar al Alcalde Local en la promoción, acompañamiento, coordinación y atención de las instancias de coordinación interinstitucionales y las instancias de participación locales, así como los procesos comunitarios en la localidad","Inversión","Un nuevo contrato social y ambiental para la Bogotá del Siglo XXI",57,{"$f":"IF(ISERROR(VLOOKUP(K77,[2]Proposito_programa!$C$2:$E$59,2,FALSE)),\" \",VLOOKUP(K77,[2]Proposito_programa!$C$2:$E$59,2,FALSE))","v":"Gestión pública local"},{"$f":"IF(ISERROR(VLOOKUP(K77,[2]Proposito_programa!$C$2:$E$59,3,FALSE)),\" \",VLOOKUP(K77,[2]Proposito_programa!$C$2:$E$59,3,FALSE))","v":"Propósito 5: Construir Bogotá - Región con gobierno abierto, transparente y ciudadanía consciente"},1741,null,1026276743,"LAURA MALAGIGI GOMEZ","Persona Natural",null,null,null,null,31032000,0,1,15516000,46548000,42582800,"2022-01-21","2022-01-24","2022-10-23",180,1,90,null,null,null,null,"Terminado",1]
[64,2022,"FDLCH-CPS-064-2022","https://community.secop.gov.co/Public/Tendering/OpportunityDetail/Index?noticeUID=CO1.NTC.2649747&isFromPublicArea=True&isModal=true&asPopupView=true","Contratos de prestación de servicios profesionales y de apoyo a la gestión","Contratación directa","Prestación de servicios profesionales y de apoyo a la gestión, o para la ejecución de trabajos artísticos que sólo puedan encomendarse a determinadas personas naturales","Prestar servicios profesionales de apoyo a la gestión para el desarrollo de actividades relacionads con la formulación, seguimiento, terminación y ciere de proyectos de inversión relacionados con la gestión del riesgo y elcambio climático en laLocalidad de Chapinero.","Inversión","Un nuevo contrato social y ambiental para la Bogotá del Siglo XXI",30,{"$f":"IF(ISERROR(VLOOKUP(K78,[2]Proposito_programa!$C$2:$E$59,2,FALSE)),\" \",VLOOKUP(K78,[2]Proposito_programa!$C$2:$E$59,2,FALSE))","v":"Eficiencia en la atención de emergencias"},{"$f":"IF(ISERROR(VLOOKUP(K78,[2]Proposito_programa!$C$2:$E$59,3,FALSE)),\" \",VLOOKUP(K78,[2]Proposito_programa!$C$2:$E$59,3,FALSE))","v":"Propósito 2 : Cambiar Nuestros Hábitos de Vida para Reverdecer a Bogotá y Adaptarnos y Mitigar la Crisis Climática"},1719,null,1032460215,"EDWARD STIVEN BARRERA GONZALEZ","Persona Natural",null,null,null,null,27600000,0,1,13800000,41400000,41400000,"2022-01-21","2022-01-24","2022-10-23",180,1,90,null,null,null,null,"Terminado",1]
[65,2022,"FDLCH-CPS-065-2022","https://community.secop.gov.co/Public/Tendering/OpportunityDetail/Index?noticeUID=CO1.NTC.2650909&isFromPublicArea=True&isModal=true&asPopupView=true","Contratos de prestación de servicios profesionales y de apoyo a la gestión","Contratación directa","Prestación de servicios profesionales y de apoyo a la gestión, o para la ejecución de trabajos artísticos que sólo puedan encomendarse a determinadas personas naturales","Prestar los servicios de apoyo para la operación, seguimiento y cumplimiento de los procesos y procedimientos del Servicio de salud, que contribuyan a la garantía de los derechos de los diferentes grupos poblacionales en el marco de las Políticas Públicas de los proyectos relacionados con los temas de salud, en cumplimiento de las metas y objetivos del Plan de Desarrollo Local.","Inversión","Un nuevo contrato social y ambiental para la Bogotá del Siglo XXI",6,{"$f":"IF(ISERROR(VLOOKUP(K79,[2]Proposito_programa!$C$2:$E$59,2,FALSE)),\" \",VLOOKUP(K79,[2]Proposito_programa!$C$2:$E$59,2,FALSE))","v":"Sistema Distrital de Cuidado"},{"$f":"IF(ISERROR(VLOOKUP(K79,[2]Proposito_programa!$C$2:$E$59,3,FALSE)),\" \",VLOOKUP(K79,[2]Proposito_programa!$C$2:$E$59,3,FALSE))","v":"Propósito 1: Hacer un nuevo contrato social para incrementar la inclusión social, productiva y política"},2024,null,52428639,"LILIANA RUIZ JIMENEZ","Persona Natural",null,null,null,null,19420000,0,2,9630000,29050000,28890000,"2022-01-21","2022-01-24","2022-10-23",180,1,90,null,null,null,null,"Terminado",1]
[66,2022,"FDLCH-CPS-066-2022","https://community.secop.gov.co/Public/Tendering/OpportunityDetail/Index?noticeUID=CO1.NTC.2650888&isFromPublicArea=True&isModal=true&asPopupView=true","Contratos de prestación de servicios profesionales y de apoyo a la gestión","Contratación directa","Prestación de servicios profesionales y de apoyo a la gestión, o para la ejecución de trabajos artísticos que sólo puedan encomendarse a determinadas personas naturales","Prestar servicios técnicos de apoyo a la gestión al área de gestión policiva local en las actividades administrativas requeridas en el proceso de planeación, asi como en el seguimiento, uso y soporte de herramientas y aplicativos en el cumplimiento de los objetivos del plan de desarrollo local y el plan institucional de gestión.","Inversión","Un nuevo contrato social y ambiental para la Bogotá del Siglo XXI",57,{"$f":"IF(ISERROR(VLOOKUP(K80,[2]Proposito_programa!$C$2:$E$59,2,FALSE)),\" \",VLOOKUP(K80,[2]Proposito_programa!$C$2:$E$59,2,FALSE))","v":"Gestión pública local"},{"$f":"IF(ISERROR(VLOOKUP(K80,[2]Proposito_programa!$C$2:$E$59,3,FALSE)),\" \",VLOOKUP(K80,[2]Proposito_programa!$C$2:$E$59,3,FALSE))","v":"Propósito 5: Construir Bogotá - Región con gobierno abierto, transparente y ciudadanía consciente"},1841,null,1033727990,"CAROL JINETH VARGAS CLAROS","Persona Natural",null,null,null,null,21000000,0,1,10500000,{"$f":"+W80+X80+Z80","v":31500000},31500000,"2022-01-21","2022-01-26","2022-10-25",180,1,90,null,null,null,null,"Terminado",1]
[67,2022,"FDLCH-CPS-067-2022","https://community.secop.gov.co/Public/Tendering/OpportunityDetail/Index?noticeUID=CO1.NTC.2651491&isFromPublicArea=True&isModal=true&asPopupView=true","Contratos de prestación de servicios profesionales y de apoyo a la gestión","Contratación directa","Prestación de servicios profesionales y de apoyo a la gestión, o para la ejecución de trabajos artísticos que sólo puedan encomendarse a determinadas personas naturales","Prestar servicios profesionales para apoyar la gestión jurídica en la ejecución de las acciones requeridas para el trámite e impulso procesal de las actuaciones administrativas y de inspección, vigilancia y control de competencia de la alcaldía local de chapinero en cerros orientales, zona de reserva forestal protectora, polígonos de monitoreo, áreas de ocupación publica prioritaria, franja de adecuación y zonas de especial protección ambiental","Inversión","Un nuevo contrato social y ambiental para la Bogotá del Siglo XXI",57,{"$f":"IF(ISERROR(VLOOKUP(K81,[2]Proposito_programa!$C$2:$E$59,2,FALSE)),\" \",VLOOKUP(K81,[2]Proposito_programa!$C$2:$E$59,2,FALSE))","v":"Gestión pública local"},{"$f":"IF(ISERROR(VLOOKUP(K81,[2]Proposito_programa!$C$2:$E$59,3,FALSE)),\" \",VLOOKUP(K81,[2]Proposito_programa!$C$2:$E$59,3,FALSE))","v":"Propósito 5: Construir Bogotá - Región con gobierno abierto, transparente y ciudadanía consciente"},1841,null,80881353,"DIEGO FERNANDO LEON LEON","Persona Natural",null,null,null,null,29400000,0,1,14700000,44100000,44100000,"2022-01-21","2022-01-24","2022-10-23",180,1,90,null,null,null,null,"Terminado",1]
[68,2022,"FDLCH-CPS-068-2022","https://community.secop.gov.co/Public/Tendering/OpportunityDetail/Index?noticeUID=CO1.NTC.2646013&isFromPublicArea=True&isModal=true&asPopupView=true","Contratos de prestación de servicios profesionales y de apoyo a la gestión","Contratación directa","Prestación de servicios profesionales y de apoyo a la gestión, o para la ejecución de trabajos artísticos que sólo puedan encomendarse a determinadas personas naturales","Prestar los sevicios profesionales para la gestión, formulación, desarrollo, seguimiento y evaluación de inversión \"Chapinero modelo de movilidad inteligente\" y apoyo a la supervisión de contratos que le sean asignados.","Inversión","Un nuevo contrato social y ambiental para la Bogotá del Siglo XXI",49,{"$f":"IF(ISERROR(VLOOKUP(K82,[2]Proposito_programa!$C$2:$E$59,2,FALSE)),\" \",VLOOKUP(K82,[2]Proposito_programa!$C$2:$E$59,2,FALSE))","v":"Movilidad segura, sostenible y accesible"},{"$f":"IF(ISERROR(VLOOKUP(K82,[2]Proposito_programa!$C$2:$E$59,3,FALSE)),\" \",VLOOKUP(K82,[2]Proposito_programa!$C$2:$E$59,3,FALSE))","v":"Propósito 4: Hacer de Bogotá Región un modelo de movilidad multimodal, incluyente y sostenible"},1734,null,1073535479,"JAIME HERNANDO PRIETO ALVAREZ","Persona Natural",null,null,null,null,56000000,0,1,28000000,84000000,75133333,"2022-01-21","2022-01-24","2023-01-23",240,1,120,null,null,null,null,"En ejecución",0.9]
[69,2022,"FDLCH-CPS-069-2022","https://community.secop.gov.co/Public/Tendering/OpportunityDetail/Index?noticeUID=CO1.NTC.2646488&isFromPublicArea=True&isModal=true&asPopupView=true","Contratos de prestación de servicios profesionales y de apoyo a la gestión","Contratación directa","Prestación de servicios profesionales y de apoyo a la gestión, o para la ejecución de trabajos artísticos que sólo puedan encomendarse a determinadas personas naturales","Prestar los sevicios profesionales para la gestión, formulación, desarrollo, seguimiento y evaluación de inversión \"Chapinero modelo de movilidad inteligente\" y apoyo a la supervisión de contratos que le sean asignados.","Inversión","Un nuevo contrato social y ambiental para la Bogotá del Siglo XXI",49,{"$f":"IF(ISERROR(VLOOKUP(K83,[2]Proposito_programa!$C$2:$E$59,2,FALSE)),\" \",VLOOKUP(K83,[2]Proposito_programa!$C$2:$E$59,2,FALSE))","v":"Movilidad segura, sostenible y accesible"},{"$f":"IF(ISERROR(VLOOKUP(K83,[2]Proposito_programa!$C$2:$E$59,3,FALSE)),\" \",VLOOKUP(K83,[2]Proposito_programa!$C$2:$E$59,3,FALSE))","v":"Propósito 4: Hacer de Bogotá Región un modelo de movilidad multimodal, incluyente y sostenible"},1734,null,1090435721,"JORGE ENRIQUE ABREO REYES","Persona Natural",null,null,null,null,52000000,0,1,26000000,78000000,68250000,"2022-01-21","2022-01-24","2023-01-30",240,1,120,null,null,null,null,"En ejecución",0.9]
[70,2022,"FDLCH-CPS-070-2022","https://community.secop.gov.co/Public/Tendering/OpportunityDetail/Index?noticeUID=CO1.NTC.2647206&isFromPublicArea=True&isModal=true&asPopupView=true","Contratos de prestación de servicios profesionales y de apoyo a la gestión","Contratación directa","Prestación de servicios profesionales y de apoyo a la gestión, o para la ejecución de trabajos artísticos que sólo puedan encomendarse a determinadas personas naturales","Prestar los servicios profesionales de apoyo a la gestión para la formulación, desarrollo y seguimiento de las actividades derivadas del proyecto de inversión chapinero modelo de movilidad inteligente","Inversión","Un nuevo contrato social y ambiental para la Bogotá del Siglo XXI",49,{"$f":"IF(ISERROR(VLOOKUP(K84,[2]Proposito_programa!$C$2:$E$59,2,FALSE)),\" \",VLOOKUP(K84,[2]Proposito_programa!$C$2:$E$59,2,FALSE))","v":"Movilidad segura, sostenible y accesible"},{"$f":"IF(ISERROR(VLOOKUP(K84,[2]Proposito_programa!$C$2:$E$59,3,FALSE)),\" \",VLOOKUP(K84,[2]Proposito_programa!$C$2:$E$59,3,FALSE))","v":"Propósito 4: Hacer de Bogotá Región un modelo de movilidad multimodal, incluyente y sostenible"},1734,null,1015470441,"RICARDO ANDRES SANCHEZ VARGAS","Persona Natural",null,null,null,null,27600000,0,1,13800000,41400000,41400000,"2022-01-21","2022-01-24","2022-10-23",180,1,90,null,null,null,null,"Terminado",1]
[71,2022,"FDLCH-CPS-071-2022","https://community.secop.gov.co/Public/Tendering/OpportunityDetail/Index?noticeUID=CO1.NTC.2651970&isFromPublicArea=True&isModal=true&asPopupView=true","Contratos de prestación de servicios profesionales y de apoyo a la gestión","Contratación directa","Prestación de servicios profesionales y de apoyo a la gestión, o para la ejecución de trabajos artísticos que sólo puedan encomendarse a determinadas personas naturales","Prestar servicios profesionales para apoyar al equipo de prensa y comunicaciones de la Alcaldía Local en la realización de productos y piezas digitales, impresas y publicitarias de gran formato y de animación gráfica, así como apoyar la producción y montaje de eventos","Inversión","Un nuevo contrato social y ambiental para la Bogotá del Siglo XXI",57,{"$f":"IF(ISERROR(VLOOKUP(K85,[2]Proposito_programa!$C$2:$E$59,2,FALSE)),\" \",VLOOKUP(K85,[2]Proposito_programa!$C$2:$E$59,2,FALSE))","v":"Gestión pública local"},{"$f":"IF(ISERROR(VLOOKUP(K85,[2]Proposito_programa!$C$2:$E$59,3,FALSE)),\" \",VLOOKUP(K85,[2]Proposito_programa!$C$2:$E$59,3,FALSE))","v":"Propósito 5: Construir Bogotá - Región con gobierno abierto, transparente y ciudadanía consciente"},1741,null,1026269094,"EIDER EMIR HERNANDEZ POLANCO","Persona Natural",null,null,null,null,27480000,0,1,13740000,41220000,41220000,"2022-01-21","2022-01-24","2022-10-23",180,1,90,null,null,null,null,"Terminado",1]
[72,2022,"FDLCH-CPS-072-2022","https://community.secop.gov.co/Public/Tendering/OpportunityDetail/Index?noticeUID=CO1.NTC.2650530&isFromPublicArea=True&isModal=true&asPopupView=true","Contratos de prestación de servicios profesionales y de apoyo a la gestión","Contratación directa","Prestación de servicios profesionales y de apoyo a la gestión, o para la ejecución de trabajos artísticos que sólo puedan encomendarse a determinadas personas naturales","Brindar apoyo en la implementación de acciones del plan local de convivencia seguridad y justicia y el desarrollo de estrategias de dialogo mediación convivencia y prevención de conflictividades violencias y delitos en la Localidad de Chapinero para mejorar la seguridad y convivencia.","Inversión","Un nuevo contrato social y ambiental para la Bogotá del Siglo XXI",45,{"$f":"IF(ISERROR(VLOOKUP(K86,[2]Proposito_programa!$C$2:$E$59,2,FALSE)),\" \",VLOOKUP(K86,[2]Proposito_programa!$C$2:$E$59,2,FALSE))","v":"Espacio público más seguro y construido colectivamente"},{"$f":"IF(ISERROR(VLOOKUP(K86,[2]Proposito_programa!$C$2:$E$59,3,FALSE)),\" \",VLOOKUP(K86,[2]Proposito_programa!$C$2:$E$59,3,FALSE))","v":"Propósito 3: Inspirar confianza y legitimidad para vivir sin miedo y ser epicentro de cultura ciudadana, paz y reconciliación"},1736,null,1024535007,"JEAN MICHEL ALBARRACIN MERCADO","Persona Natural",null,null,null,null,15000000,null,1,7500000,22500000,22500000,"2022-01-21","2022-01-24","2022-12-11",180,1,90,1024535007,"JOAQUIN ANDRES MURILLO RAMIREZ","2022-05-23",9000000,"Terminado",1]
[73,2022,"FDLCH-CPS-073-2022","https://community.secop.gov.co/Public/Tendering/OpportunityDetail/Index?noticeUID=CO1.NTC.2650142&isFromPublicArea=True&isModal=true&asPopupView=true","Contratos de prestación de servicios profesionales y de apoyo a la gestión","Contratación directa","Prestación de servicios profesionales y de apoyo a la gestión, o para la ejecución de trabajos artísticos que sólo puedan encomendarse a determinadas personas naturales","Brindar apoyo en la implementación de acciones del plan local de convivencia seguridad y justicia y el desarrollo de estrategias de dialogo, mediación convivencia y prevención de conflictividades violencias y delitos en la localidad de chapinero, para mejorar la seguridad y convivencia","Inversión","Un nuevo contrato social y ambiental para la Bogotá del Siglo XXI",48,{"$f":"IF(ISERROR(VLOOKUP(K87,[2]Proposito_programa!$C$2:$E$59,2,FALSE)),\" \",VLOOKUP(K87,[2]Proposito_programa!$C$2:$E$59,2,FALSE))","v":"Plataforma institucional para la seguridad y justicia"},{"$f":"IF(ISERROR(VLOOKUP(K87,[2]Proposito_programa!$C$2:$E$59,3,FALSE)),\" \",VLOOKUP(K87,[2]Proposito_programa!$C$2:$E$59,3,FALSE))","v":"Propósito 3: Inspirar confianza y legitimidad para vivir sin miedo y ser epicentro de cultura ciudadana, paz y reconciliación"},1738,null,1000251989,"PAULA ANDREA BERNAL SALDAÑA","Persona Natural",null,null,null,null,15000000,0,1,7500000,22500000,22500000,"2022-01-21","2022-01-24","2022-10-23",180,1,90,null,null,null,null,"Terminado",1]
[74,2022,"FDLCH-CPS-074-2022","https://community.secop.gov.co/Public/Tendering/OpportunityDetail/Index?noticeUID=CO1.NTC.2695113&isFromPublicArea=True&isModal=true&asPopupView=true","Contratos de prestación de servicios profesionales y de apoyo a la gestión","Contratación directa","Prestación de servicios profesionales y de apoyo a la gestión, o para la ejecución de trabajos artísticos que sólo puedan encomendarse a determinadas personas naturales","Apoya el cubrmiiento de las actividades, cronogramas y agenda de la Alcaldía Local a nivel interno y externo, así como la genración de contenido speriodísticos.","Inversión","Un nuevo contrato social y ambiental para la Bogotá del Siglo XXI",57,{"$f":"IF(ISERROR(VLOOKUP(K88,[2]Proposito_programa!$C$2:$E$59,2,FALSE)),\" \",VLOOKUP(K88,[2]Proposito_programa!$C$2:$E$59,2,FALSE))","v":"Gestión pública local"},{"$f":"IF(ISERROR(VLOOKUP(K88,[2]Proposito_programa!$C$2:$E$59,3,FALSE)),\" \",VLOOKUP(K88,[2]Proposito_programa!$C$2:$E$59,3,FALSE))","v":"Propósito 5: Construir Bogotá - Región con gobierno abierto, transparente y ciudadanía consciente"},1741,null,1013589145,"JENNIFER AGUDELO SANCHEZ","Persona Natural",null,null,null,null,31032000,0,1,15516000,46548000,46548000,"2022-01-25","2022-01-26","2022-10-25",180,1,90,null,null,null,null,"Terminado",1]
[75,2022,"FDLCH-CPS-075-2022","https://community.secop.gov.co/Public/Tendering/OpportunityDetail/Index?noticeUID=CO1.NTC.2651413&isFromPublicArea=True&isModal=true&asPopupView=true","Contratos de prestación de servicios profesionales y de apoyo a la gestión","Contratación directa","Prestación de servicios profesionales y de apoyo a la gestión, o para la ejecución de trabajos artísticos que sólo puedan encomendarse a determinadas personas naturales","Prestar servicios profesionales de apoyo y jurídicamente el seguimiento, supervisión estrategica y sustanciaciónd e procesos de competnencia de la Alcaldía Local de Chapinero, anteriores a la entrada en vigencia de la Ley 1801 DE 2016","Inversión","Un nuevo contrato social y ambiental para la Bogotá del Siglo XXI",57,{"$f":"IF(ISERROR(VLOOKUP(K89,[2]Proposito_programa!$C$2:$E$59,2,FALSE)),\" \",VLOOKUP(K89,[2]Proposito_programa!$C$2:$E$59,2,FALSE))","v":"Gestión pública local"},{"$f":"IF(ISERROR(VLOOKUP(K89,[2]Proposito_programa!$C$2:$E$59,3,FALSE)),\" \",VLOOKUP(K89,[2]Proposito_programa!$C$2:$E$59,3,FALSE))","v":"Propósito 5: Construir Bogotá - Región con gobierno abierto, transparente y ciudadanía consciente"},1841,null,1032492446,"ALVARO CUBILLOS RUIZ","Persona Natural",null,null,null,null,27600000,0,1,13800000,41400000,41400000,"2022-01-21","2022-01-25","2022-10-24",180,1,90,null,null,null,null,"Terminado",1]
[76,2022,"FDLCH-CPS-076-2022","https://community.secop.gov.co/Public/Tendering/OpportunityDetail/Index?noticeUID=CO1.NTC.2650773&isFromPublicArea=True&isModal=true&asPopupView=true","Contratos de prestación de servicios profesionales y de apoyo a la gestión","Contratación directa","Prestación de servicios profesionales y de apoyo a la gestión, o para la ejecución de trabajos artísticos que sólo puedan encomendarse a determinadas personas naturales","Apoyar jurídicamente la ejecución de las acciones reuqeridas para la depuración de las actuaciones administrativas que cursan en la Alcaldía Local.","Inversión","Un nuevo contrato social y ambiental para la Bogotá del Siglo XXI",57,{"$f":"IF(ISERROR(VLOOKUP(K90,[2]Proposito_programa!$C$2:$E$59,2,FALSE)),\" \",VLOOKUP(K90,[2]Proposito_programa!$C$2:$E$59,2,FALSE))","v":"Gestión pública local"},{"$f":"IF(ISERROR(VLOOKUP(K90,[2]Proposito_programa!$C$2:$E$59,3,FALSE)),\" \",VLOOKUP(K90,[2]Proposito_programa!$C$2:$E$59,3,FALSE))","v":"Propósito 5: Construir Bogotá - Región con gobierno abierto, transparente y ciudadanía consciente"},1841,null,1070021566,"MAUREN DARLINE FORERO RONCANCIO","Persona Natural",null,null,null,null,27600000,0,1,13800000,41400000,41400000,"2022-01-21","2022-01-24","2022-10-23",180,1,90,null,null,null,null,"Terminado",1]
[77,2022,"FDLCH-CPS-077-2022","https://community.secop.gov.co/Public/Tendering/OpportunityDetail/Index?noticeUID=CO1.NTC.2651569&isFromPublicArea=True&isModal=true&asPopupView=true","Contratos de prestación de servicios profesionales y de apoyo a la gestión","Contratación directa","Prestación de servicios profesionales y de apoyo a la gestión, o para la ejecución de trabajos artísticos que sólo puedan encomendarse a determinadas personas naturales","Prestar servicios profesionales para apoyar técnicamente las actuaciones administrativas, impulso procesal y de inspección, vigilancia y control de competencia de la alcaldía local de chapinero","Inversión","Un nuevo contrato social y ambiental para la Bogotá del Siglo XXI",57,{"$f":"IF(ISERROR(VLOOKUP(K91,[2]Proposito_programa!$C$2:$E$59,2,FALSE)),\" \",VLOOKUP(K91,[2]Proposito_programa!$C$2:$E$59,2,FALSE))","v":"Gestión pública local"},{"$f":"IF(ISERROR(VLOOKUP(K91,[2]Proposito_programa!$C$2:$E$59,3,FALSE)),\" \",VLOOKUP(K91,[2]Proposito_programa!$C$2:$E$59,3,FALSE))","v":"Propósito 5: Construir Bogotá - Región con gobierno abierto, transparente y ciudadanía consciente"},1841,null,52533394,"MARICELA PALACIO RODRIGUEZ","Persona Natural",null,null,null,null,29400000,0,1,4900000,34300000,34300000,"2022-01-21","2022-01-24","2022-08-23",180,1,30,null,null,null,null,"Terminado",1]
[78,2022,"FDLCH-CPS-078-2022","https://community.secop.gov.co/Public/Tendering/OpportunityDetail/Index?noticeUID=CO1.NTC.2649418&isFromPublicArea=True&isModal=true&asPopupView=true","Contratos de prestación de servicios profesionales y de apoyo a la gestión","Contratación directa","Prestación de servicios profesionales y de apoyo a la gestión, o para la ejecución de trabajos artísticos que sólo puedan encomendarse a determinadas personas naturales","Prestar servicios profesionales de apoyo a la gestión para el desarrollo de actividades relacionadas con la formulación, seguimiento, terminación y cierre de proyectos de inversión relacionados con el desarrollo de la productividad rural en el marco del proyecto de inversión Chapinero rural y productivo.","Inversión","Un nuevo contrato social y ambiental para la Bogotá del Siglo XXI",23,{"$f":"IF(ISERROR(VLOOKUP(K92,[2]Proposito_programa!$C$2:$E$59,2,FALSE)),\" \",VLOOKUP(K92,[2]Proposito_programa!$C$2:$E$59,2,FALSE))","v":"Bogotá rural"},{"$f":"IF(ISERROR(VLOOKUP(K92,[2]Proposito_programa!$C$2:$E$59,3,FALSE)),\" \",VLOOKUP(K92,[2]Proposito_programa!$C$2:$E$59,3,FALSE))","v":"Propósito 1: Hacer un nuevo contrato social para incrementar la inclusión social, productiva y política"},1827,null,1024531062,"LIBARDO FERNANDEZ ALMANZA","Persona Natural",null,null,null,null,28800000,0,1,14400000,43200000,43200000,"2022-01-21","2022-01-24","2022-10-23",180,1,90,null,null,null,null,"Terminado",1]
[79,2022,"FDLCH-CPS-079-2022","https://community.secop.gov.co/Public/Tendering/OpportunityDetail/Index?noticeUID=CO1.NTC.2721340&isFromPublicArea=True&isModal=true&asPopupView=true","Contratos de prestación de servicios profesionales y de apoyo a la gestión","Contratación directa","Prestación de servicios profesionales y de apoyo a la gestión, o para la ejecución de trabajos artísticos que sólo puedan encomendarse a determinadas personas naturales","Prestar servicios técnicos para apoyar la jestión jurídica en la ejecución de las actividades administrativas y documentales con contenido jurídico relacionadas con los procesos de inspección, vigilancia y control que adelanta la Alcaldía Local de Chapinero.","Inversión","Un nuevo contrato social y ambiental para la Bogotá del Siglo XXI",57,{"$f":"IF(ISERROR(VLOOKUP(K93,[2]Proposito_programa!$C$2:$E$59,2,FALSE)),\" \",VLOOKUP(K93,[2]Proposito_programa!$C$2:$E$59,2,FALSE))","v":"Gestión pública local"},{"$f":"IF(ISERROR(VLOOKUP(K93,[2]Proposito_programa!$C$2:$E$59,3,FALSE)),\" \",VLOOKUP(K93,[2]Proposito_programa!$C$2:$E$59,3,FALSE))","v":"Propósito 5: Construir Bogotá - Región con gobierno abierto, transparente y ciudadanía consciente"},1841,null,81717613,"JUAN LIDER TORRES ERAZO","Persona Natural",null,null,null,null,21000000,0,null,null,21000000,6883333,"2022-01-27","2022-02-02","2022-08-01",180,null,90,null,null,null,null,"Terminado",1]
[80,2022,"FDLCH-CPS-080-2022","https://community.secop.gov.co/Public/Tendering/OpportunityDetail/Index?noticeUID=CO1.NTC.2695993&isFromPublicArea=True&isModal=true&asPopupView=true","Contratos de prestación de servicios profesionales y de apoyo a la gestión","Contratación directa","Prestación de servicios profesionales y de apoyo a la gestión, o para la ejecución de trabajos artísticos que sólo puedan encomendarse a determinadas personas naturales","Prestar servicios profesionaes para apoyar técnicamente las distintas etapas de los procesos de competencia de las inspecciones de policia de la localidad de chapinero según reparto.","Inversión","Un nuevo contrato social y ambiental para la Bogotá del Siglo XXI",57,{"$f":"IF(ISERROR(VLOOKUP(K94,[2]Proposito_programa!$C$2:$E$59,2,FALSE)),\" \",VLOOKUP(K94,[2]Proposito_programa!$C$2:$E$59,2,FALSE))","v":"Gestión pública local"},{"$f":"IF(ISERROR(VLOOKUP(K94,[2]Proposito_programa!$C$2:$E$59,3,FALSE)),\" \",VLOOKUP(K94,[2]Proposito_programa!$C$2:$E$59,3,FALSE))","v":"Propósito 5: Construir Bogotá - Región con gobierno abierto, transparente y ciudadanía consciente"},1841,null,80926066,"OMAR DAVID LAVERDE CABRERA","Persona Natural",null,null,null,null,31080000,0,1,15540000,46620000,46620000,"2022-01-25","2022-02-02","2022-11-01",180,1,90,null,null,null,null,"Terminado",1]
[81,2022,"FDLCH-CPS-081-2022","https://community.secop.gov.co/Public/Tendering/OpportunityDetail/Index?noticeUID=CO1.NTC.2694018&isFromPublicArea=True&isModal=true&asPopupView=true","Contratos de prestación de servicios profesionales y de apoyo a la gestión","Contratación directa","Prestación de servicios profesionales y de apoyo a la gestión, o para la ejecución de trabajos artísticos que sólo puedan encomendarse a determinadas personas naturales","Prestar los servicios profesionaes de apoyo jurídico en la ejecución de las acciones requeridas para el trámite e impulso procesal de las actuaciones, contravenciones y/o querellas que cursen en las inspecciones de policia de la localidad.","Inversión","Un nuevo contrato social y ambiental para la Bogotá del Siglo XXI",57,{"$f":"IF(ISERROR(VLOOKUP(K95,[2]Proposito_programa!$C$2:$E$59,2,FALSE)),\" \",VLOOKUP(K95,[2]Proposito_programa!$C$2:$E$59,2,FALSE))","v":"Gestión pública local"},{"$f":"IF(ISERROR(VLOOKUP(K95,[2]Proposito_programa!$C$2:$E$59,3,FALSE)),\" \",VLOOKUP(K95,[2]Proposito_programa!$C$2:$E$59,3,FALSE))","v":"Propósito 5: Construir Bogotá - Región con gobierno abierto, transparente y ciudadanía consciente"},1841,null,1026275441,"INGRID SORAIDA CLAVIJO CRUZ","Persona Natural",null,null,null,null,27600000,0,1,13800000,41400000,41400000,"2022-01-25","2022-02-01","2022-10-31",180,1,90,null,null,null,null,"Terminado",1]
[82,2022,"FDLCH-CPS-082-2022","https://community.secop.gov.co/Public/Tendering/OpportunityDetail/Index?noticeUID=CO1.NTC.2702730&isFromPublicArea=True&isModal=true&asPopupView=true","Contratos de prestación de servicios profesionales y de apoyo a la gestión","Contratación directa","Prestación de servicios profesionales y de apoyo a la gestión, o para la ejecución de trabajos artísticos que sólo puedan encomendarse a determinadas personas naturales","Prestar los servicios de apoyo a la gestión administrativa y asistencial a las Inspecciones de Policía de la Localidad","Inversión","Un nuevo contrato social y ambiental para la Bogotá del Siglo XXI",57,{"$f":"IF(ISERROR(VLOOKUP(K96,[2]Proposito_programa!$C$2:$E$59,2,FALSE)),\" \",VLOOKUP(K96,[2]Proposito_programa!$C$2:$E$59,2,FALSE))","v":"Gestión pública local"},{"$f":"IF(ISERROR(VLOOKUP(K96,[2]Proposito_programa!$C$2:$E$59,3,FALSE)),\" \",VLOOKUP(K96,[2]Proposito_programa!$C$2:$E$59,3,FALSE))","v":"Propósito 5: Construir Bogotá - Región con gobierno abierto, transparente y ciudadanía consciente"},1841,null,1032462820,"JENNIFER VANNESA NIÑO DIAZ","Persona Natural",null,null,null,null,13200000,0,1,6600000,19800000,19800000,"2022-01-25","2022-01-26","2022-10-25",180,1,60,null,null,null,null,"Terminado",1]
[83,2022,"FDLCH-CPS-083-2022","https://community.secop.gov.co/Public/Tendering/OpportunityDetail/Index?noticeUID=CO1.NTC.2696911&isFromPublicArea=True&isModal=true&asPopupView=true","Contratos de prestación de servicios profesionales y de apoyo a la gestión","Contratación directa","Prestación de servicios profesionales y de apoyo a la gestión, o para la ejecución de trabajos artísticos que sólo puedan encomendarse a determinadas personas naturales","Prestación de servicios de apoyo en la gestión de los asuntos relacionados con la comunicación ciudadana para la seguridad ciudadana, la convivencia y la prevención de conflictividades, violencias y delitos en la localidad de Chapinero, en el marco del proyecto \"Chapinero promueve y genera confianza ciudadana\".","Inversión","Un nuevo contrato social y ambiental para la Bogotá del Siglo XXI",43,{"$f":"IF(ISERROR(VLOOKUP(K97,[2]Proposito_programa!$C$2:$E$59,2,FALSE)),\" \",VLOOKUP(K97,[2]Proposito_programa!$C$2:$E$59,2,FALSE))","v":"Cultura ciudadana para la confianza, la convivencia y la participación desde la vida cotidiana"},{"$f":"IF(ISERROR(VLOOKUP(K97,[2]Proposito_programa!$C$2:$E$59,3,FALSE)),\" \",VLOOKUP(K97,[2]Proposito_programa!$C$2:$E$59,3,FALSE))","v":"Propósito 3: Inspirar confianza y legitimidad para vivir sin miedo y ser epicentro de cultura ciudadana, paz y reconciliación"},1735,null,51646432,"MARTHA PATRICIA MUÑOZ RUIZ","Persona Natural",null,null,null,null,10904000,0,1,5452000,16356000,16356000,"2022-01-25","2022-02-01","2022-07-31",120,1,null,null,null,null,null,"Terminado",1]
[84,2022,"FDLCH-CPS-084-2022","https://community.secop.gov.co/Public/Tendering/OpportunityDetail/Index?noticeUID=CO1.NTC.2703301&isFromPublicArea=True&isModal=true&asPopupView=true","Contratos de prestación de servicios profesionales y de apoyo a la gestión","Contratación directa","Prestación de servicios profesionales y de apoyo a la gestión, o para la ejecución de trabajos artísticos que sólo puedan encomendarse a determinadas personas naturales","Prestar los servicios profesionales de apoyo jurídico en la ejecución de las acciones requeridas pra el trámite e impulso procesal de las actuaciones, contravenciones y o querellas que cursen en las inspecciones de policia de la localidad.","Inversión","Un nuevo contrato social y ambiental para la Bogotá del Siglo XXI",57,{"$f":"IF(ISERROR(VLOOKUP(K98,[2]Proposito_programa!$C$2:$E$59,2,FALSE)),\" \",VLOOKUP(K98,[2]Proposito_programa!$C$2:$E$59,2,FALSE))","v":"Gestión pública local"},{"$f":"IF(ISERROR(VLOOKUP(K98,[2]Proposito_programa!$C$2:$E$59,3,FALSE)),\" \",VLOOKUP(K98,[2]Proposito_programa!$C$2:$E$59,3,FALSE))","v":"Propósito 5: Construir Bogotá - Región con gobierno abierto, transparente y ciudadanía consciente"},1841,null,1010161720,"LIZETH NOHELIA BALLESTEROS TORRES","Persona Natural",null,null,null,null,27600000,0,3,13799999,41399999,41399999,"2022-01-27","2022-02-01","2022-10-30",180,2,60,null,null,null,null,"Terminado",1]
[85,2022,"FDLCH-CPS-085-2022","https://community.secop.gov.co/Public/Tendering/OpportunityDetail/Index?noticeUID=CO1.NTC.2702869&isFromPublicArea=True&isModal=true&asPopupView=true","Contratos de prestación de servicios profesionales y de apoyo a la gestión","Contratación directa","Prestación de servicios profesionales y de apoyo a la gestión, o para la ejecución de trabajos artísticos que sólo puedan encomendarse a determinadas personas naturales","Prestar servicios profesionales para apoyar técnicamente las actuaciones administrativas, impulso procesal y de inspección, vigilancia y control de competencia de la Alcaldía Local de Chapinero.","Inversión","Un nuevo contrato social y ambiental para la Bogotá del Siglo XXI",57,{"$f":"IF(ISERROR(VLOOKUP(K99,[2]Proposito_programa!$C$2:$E$59,2,FALSE)),\" \",VLOOKUP(K99,[2]Proposito_programa!$C$2:$E$59,2,FALSE))","v":"Gestión pública local"},{"$f":"IF(ISERROR(VLOOKUP(K99,[2]Proposito_programa!$C$2:$E$59,3,FALSE)),\" \",VLOOKUP(K99,[2]Proposito_programa!$C$2:$E$59,3,FALSE))","v":"Propósito 5: Construir Bogotá - Región con gobierno abierto, transparente y ciudadanía consciente"},1841,null,1030625256,"ANDRES FELIPE RAMOS ARENAS","Persona Natural",null,null,null,null,29400000,0,1,14700000,44100000,44100000,"2022-01-25","2022-01-26","2022-10-25",180,1,90,null,null,null,null,"Terminado",1]
[86,2022,"FDLCH-CPS-086-2022","https://community.secop.gov.co/Public/Tendering/OpportunityDetail/Index?noticeUID=CO1.NTC.2695841&isFromPublicArea=True&isModal=true&asPopupView=true","Contratos de prestación de servicios profesionales y de apoyo a la gestión","Contratación directa","Prestación de servicios profesionales y de apoyo a la gestión, o para la ejecución de trabajos artísticos que sólo puedan encomendarse a determinadas personas naturales","Prestar servicios de apoyo a la gestión, para el desarrollo de estrategias que promuevan la prevención, atención de la violencia intrafamiliar y sexual y la eliminación de las violencias basadas en género en el marco del programa sistema distrital de cuidado","Inversión","Un nuevo contrato social y ambiental para la Bogotá del Siglo XXI",6,{"$f":"IF(ISERROR(VLOOKUP(K100,[2]Proposito_programa!$C$2:$E$59,2,FALSE)),\" \",VLOOKUP(K100,[2]Proposito_programa!$C$2:$E$59,2,FALSE))","v":"Sistema Distrital de Cuidado"},{"$f":"IF(ISERROR(VLOOKUP(K100,[2]Proposito_programa!$C$2:$E$59,3,FALSE)),\" \",VLOOKUP(K100,[2]Proposito_programa!$C$2:$E$59,3,FALSE))","v":"Propósito 1: Hacer un nuevo contrato social para incrementar la inclusión social, productiva y política"},1710,null,80204671,"MILTON CESAR DIAZ HERNANDEZ","Persona Natural",null,null,null,null,13200000,0,null,null,13200000,13200000,"2022-01-26","2022-02-01","2022-07-31",180,null,null,null,null,null,null,"Terminado",1]
[87,2022,"FDLCH-CPS-087-2022","https://community.secop.gov.co/Public/Tendering/OpportunityDetail/Index?noticeUID=CO1.NTC.2721480&isFromPublicArea=True&isModal=true&asPopupView=true","Contratos de prestación de servicios profesionales y de apoyo a la gestión","Contratación directa","Prestación de servicios profesionales y de apoyo a la gestión, o para la ejecución de trabajos artísticos que sólo puedan encomendarse a determinadas personas naturales","Prestar servicios profesionales para apoyar al equipo de prensa y comunicaciones de la Alcaldía Local en la realización y publicación de contenidos de redes sociales y canales de divulgación digital (sitio web) de la Alcaldía Local.","Inversión","Un nuevo contrato social y ambiental para la Bogotá del Siglo XXI",57,{"$f":"IF(ISERROR(VLOOKUP(K101,[2]Proposito_programa!$C$2:$E$59,2,FALSE)),\" \",VLOOKUP(K101,[2]Proposito_programa!$C$2:$E$59,2,FALSE))","v":"Gestión pública local"},{"$f":"IF(ISERROR(VLOOKUP(K101,[2]Proposito_programa!$C$2:$E$59,3,FALSE)),\" \",VLOOKUP(K101,[2]Proposito_programa!$C$2:$E$59,3,FALSE))","v":"Propósito 5: Construir Bogotá - Región con gobierno abierto, transparente y ciudadanía consciente"},1741,null,1070016439,"DANIEL ANTONIO RODRIGUEZ VENEGAS","Persona Natural",null,null,null,null,31032000,0,1,15516000,46548000,46548000,"2022-01-27","2022-01-27","2022-10-26",180,1,90,null,null,null,null,"Terminado",1]
[88,2022,"FDLCH-CPS-088-2022","https://community.secop.gov.co/Public/Tendering/OpportunityDetail/Index?noticeUID=CO1.NTC.2722368&isFromPublicArea=True&isModal=true&asPopupView=true","Contratos de prestación de servicios profesionales y de apoyo a la gestión","Contratación directa","Prestación de servicios profesionales y de apoyo a la gestión, o para la ejecución de trabajos artísticos que sólo puedan encomendarse a determinadas personas naturales","Prestar servicios profesionales para la gestión, formulación, desarrollo, seguimiento y evaluación del proyecto de inversión chapinero productivo y emprendedor la estrategia de mitigación y reactivación económica EMRE local y la supervisión de ocntratos que le sean asignados.","Inversión","Un nuevo contrato social y ambiental para la Bogotá del Siglo XXI",6,{"$f":"IF(ISERROR(VLOOKUP(K102,[2]Proposito_programa!$C$2:$E$59,2,FALSE)),\" \",VLOOKUP(K102,[2]Proposito_programa!$C$2:$E$59,2,FALSE))","v":"Sistema Distrital de Cuidado"},{"$f":"IF(ISERROR(VLOOKUP(K102,[2]Proposito_programa!$C$2:$E$59,3,FALSE)),\" \",VLOOKUP(K102,[2]Proposito_programa!$C$2:$E$59,3,FALSE))","v":"Propósito 1: Hacer un nuevo contrato social para incrementar la inclusión social, productiva y política"},1671,null,1013615672,"SERGIO ANDRES VARGAS CRUZ","Persona Natural",null,null,null,null,28200000,0,1,14100000,42300000,42300000,"2022-01-27","2022-02-01","2022-10-31",180,1,90,null,null,null,null,"Terminado",1]
[89,2022,"FDLCH-CPS-089-2022","https://community.secop.gov.co/Public/Tendering/OpportunityDetail/Index?noticeUID=CO1.NTC.2693626&isFromPublicArea=True&isModal=true&asPopupView=true","Contratos de prestación de servicios profesionales y de apoyo a la gestión","Contratación directa","Prestación de servicios profesionales y de apoyo a la gestión, o para la ejecución de trabajos artísticos que sólo puedan encomendarse a determinadas personas naturales","Prestar servicios de apoyo a la gestión en la ejecuciónd e las actividades administrativas y documentales relacionadas con la gestión policiva en la Alcaldía Local de Chapinero.","Inversión","Un nuevo contrato social y ambiental para la Bogotá del Siglo XXI",57,{"$f":"IF(ISERROR(VLOOKUP(K103,[2]Proposito_programa!$C$2:$E$59,2,FALSE)),\" \",VLOOKUP(K103,[2]Proposito_programa!$C$2:$E$59,2,FALSE))","v":"Gestión pública local"},{"$f":"IF(ISERROR(VLOOKUP(K103,[2]Proposito_programa!$C$2:$E$59,3,FALSE)),\" \",VLOOKUP(K103,[2]Proposito_programa!$C$2:$E$59,3,FALSE))","v":"Propósito 5: Construir Bogotá - Región con gobierno abierto, transparente y ciudadanía consciente"},1841,null,1016043505,"CRISTIAN OSWALDO LAITON VARGAS","Persona Natural",null,null,null,null,11000000,-1173333,1,5500000,15326667,15326667,"2022-01-25","2022-02-02","2022-09-16",150,1,75,null,null,null,null,"Terminado",1]
[90,2022,"FDLCH-CPS-090-2022","https://community.secop.gov.co/Public/Tendering/OpportunityDetail/Index?noticeUID=CO1.NTC.2694491&isFromPublicArea=True&isModal=true&asPopupView=true","Contratos de prestación de servicios profesionales y de apoyo a la gestión","Contratación directa","Prestación de servicios profesionales y de apoyo a la gestión, o para la ejecución de trabajos artísticos que sólo puedan encomendarse a determinadas personas naturales","Prestar servicios de apoyo a la gestión al área de gestión del desarrollo local en las actividades y estrategias de fomento y promoción de la reactivación económica local, el fortalecimiento de los emprendimientos y de las pequeñas y medianas empresas locales.","Inversión","Un nuevo contrato social y ambiental para la Bogotá del Siglo XXI",6,{"$f":"IF(ISERROR(VLOOKUP(K104,[2]Proposito_programa!$C$2:$E$59,2,FALSE)),\" \",VLOOKUP(K104,[2]Proposito_programa!$C$2:$E$59,2,FALSE))","v":"Sistema Distrital de Cuidado"},{"$f":"IF(ISERROR(VLOOKUP(K104,[2]Proposito_programa!$C$2:$E$59,3,FALSE)),\" \",VLOOKUP(K104,[2]Proposito_programa!$C$2:$E$59,3,FALSE))","v":"Propósito 1: Hacer un nuevo contrato social para incrementar la inclusión social, productiva y política"},1671,null,1070704250,"WILMER ANDRES MALDONADO RAMIREZ","Persona Natural",null,null,null,null,18000000,0,1,9000000,27000000,27000000,"2022-01-25","2022-01-26","2022-10-25",180,1,90,null,null,null,null,"Terminado",1]
[91,2022,"FDLCH-CPS-091-2022","https://community.secop.gov.co/Public/Tendering/OpportunityDetail/Index?noticeUID=CO1.NTC.2694322&isFromPublicArea=True&isModal=true&asPopupView=true","Contratos de prestación de servicios profesionales y de apoyo a la gestión","Contratación directa","Prestación de servicios profesionales y de apoyo a la gestión, o para la ejecución de trabajos artísticos que sólo puedan encomendarse a determinadas personas naturales","Prestar servicios técnicos para apoyar el área de gestión del desarrollo local en las actividades presupuestales requeridas por la Alcaldía Local de Chapinero.","Inversión","Un nuevo contrato social y ambiental para la Bogotá del Siglo XXI",57,{"$f":"IF(ISERROR(VLOOKUP(K105,[2]Proposito_programa!$C$2:$E$59,2,FALSE)),\" \",VLOOKUP(K105,[2]Proposito_programa!$C$2:$E$59,2,FALSE))","v":"Gestión pública local"},{"$f":"IF(ISERROR(VLOOKUP(K105,[2]Proposito_programa!$C$2:$E$59,3,FALSE)),\" \",VLOOKUP(K105,[2]Proposito_programa!$C$2:$E$59,3,FALSE))","v":"Propósito 5: Construir Bogotá - Región con gobierno abierto, transparente y ciudadanía consciente"},1741,null,1023945934,"GISELLE MARIANA FONSECA CRISTANCHO","Persona Natural",null,null,null,null,12000000,0,1,6000000,18000000,18000000,"2022-01-24","2022-01-26","2022-07-25",120,1,60,null,null,null,null,"Terminado",1]
[92,2022,"FDLCH-CPS-092-2022","https://community.secop.gov.co/Public/Tendering/OpportunityDetail/Index?noticeUID=CO1.NTC.2688253&isFromPublicArea=True&isModal=true&asPopupView=true","Contratos de prestación de servicios profesionales y de apoyo a la gestión","Contratación directa","Prestación de servicios profesionales y de apoyo a la gestión, o para la ejecución de trabajos artísticos que sólo puedan encomendarse a determinadas personas naturales","Prestar servicios de apoyo a la gestión para asistir organizacional y administrativamente el desarrollo de las actividades estratégicas desarrolladas por la Alcaldía Local de Chapinero.","Inversión","Un nuevo contrato social y ambiental para la Bogotá del Siglo XXI",57,{"$f":"IF(ISERROR(VLOOKUP(K106,[2]Proposito_programa!$C$2:$E$59,2,FALSE)),\" \",VLOOKUP(K106,[2]Proposito_programa!$C$2:$E$59,2,FALSE))","v":"Gestión pública local"},{"$f":"IF(ISERROR(VLOOKUP(K106,[2]Proposito_programa!$C$2:$E$59,3,FALSE)),\" \",VLOOKUP(K106,[2]Proposito_programa!$C$2:$E$59,3,FALSE))","v":"Propósito 5: Construir Bogotá - Región con gobierno abierto, transparente y ciudadanía consciente"},1741,null,73159185,"GERMAN ENRIQUE CASTILLO CORREA","Persona Natural",null,null,null,null,13200000,0,1,6600000,19800000,18846667,"2022-01-24","2022-01-25","2022-10-12",180,1,90,null,null,null,null,"Terminado",1]
[93,2022,"FDLCH-CPS-093-2022","https://community.secop.gov.co/Public/Tendering/OpportunityDetail/Index?noticeUID=CO1.NTC.2694053&isFromPublicArea=True&isModal=true&asPopupView=true","Contratos de prestación de servicios profesionales y de apoyo a la gestión","Contratación directa","Prestación de servicios profesionales y de apoyo a la gestión, o para la ejecución de trabajos artísticos que sólo puedan encomendarse a determinadas personas naturales","Prestar servicios técnicos para apoyar el área Gestión del Desarrollo Local en las actividades presupuestales requeridas por la Alcaldía Local de Chapinero","Inversión","Un nuevo contrato social y ambiental para la Bogotá del Siglo XXI",57,{"$f":"IF(ISERROR(VLOOKUP(K107,[2]Proposito_programa!$C$2:$E$59,2,FALSE)),\" \",VLOOKUP(K107,[2]Proposito_programa!$C$2:$E$59,2,FALSE))","v":"Gestión pública local"},{"$f":"IF(ISERROR(VLOOKUP(K107,[2]Proposito_programa!$C$2:$E$59,3,FALSE)),\" \",VLOOKUP(K107,[2]Proposito_programa!$C$2:$E$59,3,FALSE))","v":"Propósito 5: Construir Bogotá - Región con gobierno abierto, transparente y ciudadanía consciente"},1741,null,1023893986,"EILIN NATALY VILLABON PARDO","Persona Natural",null,null,null,null,24000000,0,1,6000000,30000000,20000000,"2022-01-25","2022-01-26","28/03/2023",240,1,60,null,null,null,null,"En ejecución",0.65]
[94,2022,"FDLCH-CPS-094-2022","https://community.secop.gov.co/Public/Tendering/OpportunityDetail/Index?noticeUID=CO1.NTC.2695245&isFromPublicArea=True&isModal=true&asPopupView=true","Contratos de prestación de servicios profesionales y de apoyo a la gestión","Contratación directa","Prestación de servicios profesionales y de apoyo a la gestión, o para la ejecución de trabajos artísticos que sólo puedan encomendarse a determinadas personas naturales","Prestar servicios profesionales de apoyo y jurídicamente el seguimiento, supervisión estratégica y sustanciación de procesos de competencia de la alcaldía local de chapinero anteriores a la entrada en vigencia de la ley 1801 de 2016","Inversión","Un nuevo contrato social y ambiental para la Bogotá del Siglo XXI",57,{"$f":"IF(ISERROR(VLOOKUP(K108,[2]Proposito_programa!$C$2:$E$59,2,FALSE)),\" \",VLOOKUP(K108,[2]Proposito_programa!$C$2:$E$59,2,FALSE))","v":"Gestión pública local"},{"$f":"IF(ISERROR(VLOOKUP(K108,[2]Proposito_programa!$C$2:$E$59,3,FALSE)),\" \",VLOOKUP(K108,[2]Proposito_programa!$C$2:$E$59,3,FALSE))","v":"Propósito 5: Construir Bogotá - Región con gobierno abierto, transparente y ciudadanía consciente"},1841,null,19271830,"MANUEL FALLA BUSTOS","Persona Natural",null,null,null,null,42400000,0,1,2120000,44520000,44520000,"2022-01-25","2022-01-26","2022-10-07",240,1,12,null,null,null,null,"Terminado",1]
[95,2022,"FDLCH-CPS-095-2022","https://community.secop.gov.co/Public/Tendering/OpportunityDetail/Index?noticeUID=CO1.NTC.2705442&isFromPublicArea=True&isModal=true&asPopupView=true","Contratos de prestación de servicios profesionales y de apoyo a la gestión","Contratación directa","Prestación de servicios profesionales y de apoyo a la gestión, o para la ejecución de trabajos artísticos que sólo puedan encomendarse a determinadas personas naturales","Prestar los servicios profesionales para la operación, prestación, seguimiento y cumplimiento de los procedimientos administrativos, operativos y programáticos del servicio apoyo económico tipo c, que contribuyan a la garantía de los derechos de la población mayor en el marco de la política pública social para el envejecimiento y la vejez en el distrito capital a cargo de la alcaldía local de chapinero","Inversión","Un nuevo contrato social y ambiental para la Bogotá del Siglo XXI",1,{"$f":"IF(ISERROR(VLOOKUP(K109,[2]Proposito_programa!$C$2:$E$59,2,FALSE)),\" \",VLOOKUP(K109,[2]Proposito_programa!$C$2:$E$59,2,FALSE))","v":"Subsidios y transferencias para la equidad"},{"$f":"IF(ISERROR(VLOOKUP(K109,[2]Proposito_programa!$C$2:$E$59,3,FALSE)),\" \",VLOOKUP(K109,[2]Proposito_programa!$C$2:$E$59,3,FALSE))","v":"Propósito 1: Hacer un nuevo contrato social para incrementar la inclusión social, productiva y política"},1815,null,34984062,"ENITH DEL ROSARIO RUIZ PORRAS","Persona Natural",null,null,null,null,18400000,0,1,9200000,27600000,27600000,"2022-01-25","2022-02-02","2022-08-01",120,1,60,null,null,null,null,"Terminado",1]
[96,2022,"FDLCH-CPS-096-2022","https://community.secop.gov.co/Public/Tendering/OpportunityDetail/Index?noticeUID=CO1.NTC.2705323&isFromPublicArea=True&isModal=true&asPopupView=true","Contratos de prestación de servicios profesionales y de apoyo a la gestión","Contratación directa","Prestación de servicios profesionales y de apoyo a la gestión, o para la ejecución de trabajos artísticos que sólo puedan encomendarse a determinadas personas naturales","Prestar servicios de apoyo a la gestión para desarrollar las actividades de radicación, gestión de correspondencia y de la documentación que expide, se allega y controlan las Inspecciones de Policía de la Alcaldía Local de Chapinero.","Inversión","Un nuevo contrato social y ambiental para la Bogotá del Siglo XXI",57,{"$f":"IF(ISERROR(VLOOKUP(K110,[2]Proposito_programa!$C$2:$E$59,2,FALSE)),\" \",VLOOKUP(K110,[2]Proposito_programa!$C$2:$E$59,2,FALSE))","v":"Gestión pública local"},{"$f":"IF(ISERROR(VLOOKUP(K110,[2]Proposito_programa!$C$2:$E$59,3,FALSE)),\" \",VLOOKUP(K110,[2]Proposito_programa!$C$2:$E$59,3,FALSE))","v":"Propósito 5: Construir Bogotá - Región con gobierno abierto, transparente y ciudadanía consciente"},1741,null,1063134906,"VANESA ALEXANDRA JIMENEZ ARTEAGA","Persona Natural",null,null,null,null,13200000,0,1,6600000,19800000,18993333,"2022-01-25","2022-01-26","2022-12-26",180,1,90,null,null,null,null,"Terminado",1]
[97,2022,"FDLCH-CPS-097-2022","https://community.secop.gov.co/Public/Tendering/OpportunityDetail/Index?noticeUID=CO1.NTC.2695769&isFromPublicArea=True&isModal=true&asPopupView=true","Contratos de prestación de servicios profesionales y de apoyo a la gestión","Contratación directa","Prestación de servicios profesionales y de apoyo a la gestión, o para la ejecución de trabajos artísticos que sólo puedan encomendarse a determinadas personas naturales","Prestar los servicios de apoyo necesarios para la conducción de los vehículos que conforman el parque automotor en propiedad o custodia del fondo de desarrollo local de chapinero, y el transporte de servidores públicos para la realización de las actividades misionales de la alcaldía local de chapinero","Inversión","Un nuevo contrato social y ambiental para la Bogotá del Siglo XXI",57,{"$f":"IF(ISERROR(VLOOKUP(K111,[2]Proposito_programa!$C$2:$E$59,2,FALSE)),\" \",VLOOKUP(K111,[2]Proposito_programa!$C$2:$E$59,2,FALSE))","v":"Gestión pública local"},{"$f":"IF(ISERROR(VLOOKUP(K111,[2]Proposito_programa!$C$2:$E$59,3,FALSE)),\" \",VLOOKUP(K111,[2]Proposito_programa!$C$2:$E$59,3,FALSE))","v":"Propósito 5: Construir Bogotá - Región con gobierno abierto, transparente y ciudadanía consciente"},1741,null,1018445848,"JUAN DAVID CHICACAUSA SALAS","Persona Natural",null,null,null,null,20800000,0,2,{"$f":"8320000+2080000","v":10400000},31200000,27733333,"2022-01-25","2022-01-26","24/01/2023",240,2,120,null,null,null,null,"En ejecución",0.9]
[98,2022,"FDLCH-CPS-098-2022","https://community.secop.gov.co/Public/Tendering/OpportunityDetail/Index?noticeUID=CO1.NTC.2695493&isFromPublicArea=True&isModal=true&asPopupView=true","Contratos de prestación de servicios profesionales y de apoyo a la gestión","Contratación directa","Prestación de servicios profesionales y de apoyo a la gestión, o para la ejecución de trabajos artísticos que sólo puedan encomendarse a determinadas personas naturales","Prestar los servicios profesionales para la gestión, formulación, desarrollo, seguimiento y evaluación del proyecto de inversión“Chapinero espacio para hábitos saludablesen el componente construcción y/o conservación de los parques vecinales y/o de bolsillo\"","Inversión","Un nuevo contrato social y ambiental para la Bogotá del Siglo XXI",33,{"$f":"IF(ISERROR(VLOOKUP(K112,[2]Proposito_programa!$C$2:$E$59,2,FALSE)),\" \",VLOOKUP(K112,[2]Proposito_programa!$C$2:$E$59,2,FALSE))","v":"Más árboles y más y mejor espacio público"},{"$f":"IF(ISERROR(VLOOKUP(K112,[2]Proposito_programa!$C$2:$E$59,3,FALSE)),\" \",VLOOKUP(K112,[2]Proposito_programa!$C$2:$E$59,3,FALSE))","v":"Propósito 2 : Cambiar Nuestros Hábitos de Vida para Reverdecer a Bogotá y Adaptarnos y Mitigar la Crisis Climática"},1723,null,79268761,"MAURICIO BOHORQUEZ ESCOBAR","Persona Natural",null,null,null,null,33000000,-10083333,null,null,22916667,22916667,"2022-01-25","2022-01-26","2022-06-01",180,null,null,null,null,null,null,"Terminado",1]
[99,2022,"FDLCH-CPS-099-2022","https://community.secop.gov.co/Public/Tendering/OpportunityDetail/Index?noticeUID=CO1.NTC.2696353&isFromPublicArea=True&isModal=true&asPopupView=true","Contratos de prestación de servicios profesionales y de apoyo a la gestión","Contratación directa","Prestación de servicios profesionales y de apoyo a la gestión, o para la ejecución de trabajos artísticos que sólo puedan encomendarse a determinadas personas naturales","Prestar los servicios técnicos de apoyo a la gestión, acciones administrativas y seguimiento de las actividades derIvadas del proyecto de inversión Chapinero Modelo de Movilidad Inteligente","Inversión","Un nuevo contrato social y ambiental para la Bogotá del Siglo XXI",49,{"$f":"IF(ISERROR(VLOOKUP(K113,[2]Proposito_programa!$C$2:$E$59,2,FALSE)),\" \",VLOOKUP(K113,[2]Proposito_programa!$C$2:$E$59,2,FALSE))","v":"Movilidad segura, sostenible y accesible"},{"$f":"IF(ISERROR(VLOOKUP(K113,[2]Proposito_programa!$C$2:$E$59,3,FALSE)),\" \",VLOOKUP(K113,[2]Proposito_programa!$C$2:$E$59,3,FALSE))","v":"Propósito 4: Hacer de Bogotá Región un modelo de movilidad multimodal, incluyente y sostenible"},1734,null,1018486888,"DAVID ALEXANDER ALVARADO CASTRILLON","Persona Natural",null,null,null,null,17400000,0,1,8700000,26100000,26100000,"2022-01-25","2022-02-01","2022-10-31",180,1,90,null,null,null,null,"Terminado",1]
[100,2022,"FDLCH-CPS-100-2022","https://community.secop.gov.co/Public/Tendering/OpportunityDetail/Index?noticeUID=CO1.NTC.2712599&isFromPublicArea=True&isModal=true&asPopupView=true","Contratos de prestación de servicios profesionales y de apoyo a la gestión","Contratación directa","Prestación de servicios profesionales y de apoyo a la gestión, o para la ejecución de trabajos artísticos que sólo puedan encomendarse a determinadas personas naturales","Prestar servicios profesionales especializdos para apoyar la organización y estructuración de la getión jurídica del despacho de la Alcaldía Local de Chapinero y la de las dependencias que la conforman.","Inversión","Un nuevo contrato social y ambiental para la Bogotá del Siglo XXI",57,{"$f":"IF(ISERROR(VLOOKUP(K114,[2]Proposito_programa!$C$2:$E$59,2,FALSE)),\" \",VLOOKUP(K114,[2]Proposito_programa!$C$2:$E$59,2,FALSE))","v":"Gestión pública local"},{"$f":"IF(ISERROR(VLOOKUP(K114,[2]Proposito_programa!$C$2:$E$59,3,FALSE)),\" \",VLOOKUP(K114,[2]Proposito_programa!$C$2:$E$59,3,FALSE))","v":"Propósito 5: Construir Bogotá - Región con gobierno abierto, transparente y ciudadanía consciente"},1741,null,1085933782,"KAREN DANIELA ROSERO NARVAEZ","Persona Natural",null,null,null,null,60000000,0,1,4000000,64000000,61250000,"2022-01-26","2022-01-26","2022-10-16",240,1,16,null,null,null,null,"Terminado",1]
[101,2022,"FDLCH-CPS-101-2022","https://community.secop.gov.co/Public/Tendering/OpportunityDetail/Index?noticeUID=CO1.NTC.2710357&isFromPublicArea=True&isModal=true&asPopupView=true","Contratos de prestación de servicios profesionales y de apoyo a la gestión","Contratación directa","Prestación de servicios profesionales y de apoyo a la gestión, o para la ejecución de trabajos artísticos que sólo puedan encomendarse a determinadas personas naturales","Prestar servicios profesionales de apoyo jurídico en la ejecución de las acciones requeridas para el trámite e impulso procesal de las actuaciones administrativas y de cobro persuasivo de competencia de la alcaldía local de chapinero.","Inversión","Un nuevo contrato social y ambiental para la Bogotá del Siglo XXI",57,{"$f":"IF(ISERROR(VLOOKUP(K115,[2]Proposito_programa!$C$2:$E$59,2,FALSE)),\" \",VLOOKUP(K115,[2]Proposito_programa!$C$2:$E$59,2,FALSE))","v":"Gestión pública local"},{"$f":"IF(ISERROR(VLOOKUP(K115,[2]Proposito_programa!$C$2:$E$59,3,FALSE)),\" \",VLOOKUP(K115,[2]Proposito_programa!$C$2:$E$59,3,FALSE))","v":"Propósito 5: Construir Bogotá - Región con gobierno abierto, transparente y ciudadanía consciente"},1841,null,1020734444,"JUAN CAMILO MENDOZA MARTINEZ","Persona Natural",null,null,null,null,27600000,0,1,13800000,41400000,41400000,"2022-01-25","2022-02-01","2022-10-31",180,1,90,null,null,null,null,"Terminado",1]
[102,2022,"FDLCH-CPS-102-2022","https://community.secop.gov.co/Public/Tendering/OpportunityDetail/Index?noticeUID=CO1.NTC.2714690&isFromPublicArea=True&isModal=true&asPopupView=true","Contratos de prestación de servicios profesionales y de apoyo a la gestión","Contratación directa","Prestación de servicios profesionales y de apoyo a la gestión, o para la ejecución de trabajos artísticos que sólo puedan encomendarse a determinadas personas naturales","Prestar servicios profesionales para apoyar el área de gestión del desarrollo local de la Alcaldía Local de Chapinero, en la gestión, formulación, desarrollo, seguimiento y evaluación de los temas relacionados con educación superior en la localidad de chapinero, enmarcados en el proyecto de inversión “Chapinero construye futuro y realizar el apoyo a la supervisión de los contratos y/o convenios que de el se deriven”","Inversión","Un nuevo contrato social y ambiental para la Bogotá del Siglo XXI",17,{"$f":"IF(ISERROR(VLOOKUP(K116,[2]Proposito_programa!$C$2:$E$59,2,FALSE)),\" \",VLOOKUP(K116,[2]Proposito_programa!$C$2:$E$59,2,FALSE))","v":"Jóvenes con capacidades: Proyecto de vida para la ciudadanía, la innovación y el trabajo del siglo XXI"},{"$f":"IF(ISERROR(VLOOKUP(K116,[2]Proposito_programa!$C$2:$E$59,3,FALSE)),\" \",VLOOKUP(K116,[2]Proposito_programa!$C$2:$E$59,3,FALSE))","v":"Propósito 1: Hacer un nuevo contrato social para incrementar la inclusión social, productiva y política"},1743,null,7724577,"JUAN CARLOS DUSSAN ZULETA","Persona Natural",null,null,null,null,28800000,0,1,14400000,43200000,43200000,"2022-01-26","2022-02-01","2022-10-31",180,1,90,null,null,null,null,"Terminado",1]
[103,2022,"FDLCH-CPS-103-2022","https://community.secop.gov.co/Public/Tendering/OpportunityDetail/Index?noticeUID=CO1.NTC.2714125&isFromPublicArea=True&isModal=true&asPopupView=true","Contratos de prestación de servicios profesionales y de apoyo a la gestión","Contratación directa","Prestación de servicios profesionales y de apoyo a la gestión, o para la ejecución de trabajos artísticos que sólo puedan encomendarse a determinadas personas naturales","Prestar servicios profesionales para apoyar el área de gestión del desarrollo local de la Alcaldía Local de Chapinero, en la gestión, formulación, desarrollo, seguimiento y evaluación de los temas relacionados con educación superior en la localidad de chapinero, enmarcados en el proyecto de inversión “Chapinero construye futuro\" y realizaqr el apoyo a la supervisión de los contratos y/o convenios que de el se deriven.","Inversión","Un nuevo contrato social y ambiental para la Bogotá del Siglo XXI",17,{"$f":"IF(ISERROR(VLOOKUP(K117,[2]Proposito_programa!$C$2:$E$59,2,FALSE)),\" \",VLOOKUP(K117,[2]Proposito_programa!$C$2:$E$59,2,FALSE))","v":"Jóvenes con capacidades: Proyecto de vida para la ciudadanía, la innovación y el trabajo del siglo XXI"},{"$f":"IF(ISERROR(VLOOKUP(K117,[2]Proposito_programa!$C$2:$E$59,3,FALSE)),\" \",VLOOKUP(K117,[2]Proposito_programa!$C$2:$E$59,3,FALSE))","v":"Propósito 1: Hacer un nuevo contrato social para incrementar la inclusión social, productiva y política"},1743,null,39540619,"LUZ YANETH DUQUE ALBA","Persona Natural",null,null,null,null,28800000,0,null,null,28800000,28800000,"2022-01-26","2022-02-03","2022-08-02",180,null,null,null,null,null,null,"Terminado",1]
[104,2022,"FDLCH-CPS-104-2022","https://community.secop.gov.co/Public/Tendering/OpportunityDetail/Index?noticeUID=CO1.NTC.2710953&isFromPublicArea=True&isModal=true&asPopupView=true","Contratos de prestación de servicios profesionales y de apoyo a la gestión","Contratación directa","Prestación de servicios profesionales y de apoyo a la gestión, o para la ejecución de trabajos artísticos que sólo puedan encomendarse a determinadas personas naturales","Prestar servicios profesionales para apoyar al área de gestión del desarrollo local de chapinero, en el acompañamiento, gestión, formulación y atención de la ejecución de las actividades derivadas del proyecto de inversión chapinero epicentro del deporte y la recreación.","Inversión","Un nuevo contrato social y ambiental para la Bogotá del Siglo XXI",20,{"$f":"IF(ISERROR(VLOOKUP(K118,[2]Proposito_programa!$C$2:$E$59,2,FALSE)),\" \",VLOOKUP(K118,[2]Proposito_programa!$C$2:$E$59,2,FALSE))","v":"Bogotá, referente en cultura, deporte, recreación y actividad física, con parques para el desarrollo y la salud"},{"$f":"IF(ISERROR(VLOOKUP(K118,[2]Proposito_programa!$C$2:$E$59,3,FALSE)),\" \",VLOOKUP(K118,[2]Proposito_programa!$C$2:$E$59,3,FALSE))","v":"Propósito 1: Hacer un nuevo contrato social para incrementar la inclusión social, productiva y política"},1845,null,1033802617,"LAURA CAMILA RAMIREZ","Persona Natural",null,null,null,null,27600000,0,2,13800000,41400000,41400000,"2022-01-25","2022-02-02","2022-11-01",180,1,90,null,null,null,null,"Terminado",1]
[105,2022,"FDLCH-CPS-105-2022","https://community.secop.gov.co/Public/Tendering/OpportunityDetail/Index?noticeUID=CO1.NTC.2709744&isFromPublicArea=True&isModal=true&asPopupView=true","Contratos de prestación de servicios profesionales y de apoyo a la gestión","Contratación directa","Prestación de servicios profesionales y de apoyo a la gestión, o para la ejecución de trabajos artísticos que sólo puedan encomendarse a determinadas personas naturales","Prestar servicios profesionales de apoyo a la gestión para el desarrollo de actividades relacionadas con la formulación, seguimiento, terminación y cierre de proyectos de inversión relacionados con la gestión ambiental local en el marco del proyecto de inversión Chapinero Siempra Esperanza.","Inversión","Un nuevo contrato social y ambiental para la Bogotá del Siglo XXI",24,{"$f":"IF(ISERROR(VLOOKUP(K119,[2]Proposito_programa!$C$2:$E$59,2,FALSE)),\" \",VLOOKUP(K119,[2]Proposito_programa!$C$2:$E$59,2,FALSE))","v":"Bogotá región emprendedora e innovadora"},{"$f":"IF(ISERROR(VLOOKUP(K119,[2]Proposito_programa!$C$2:$E$59,3,FALSE)),\" \",VLOOKUP(K119,[2]Proposito_programa!$C$2:$E$59,3,FALSE))","v":"Propósito 1: Hacer un nuevo contrato social para incrementar la inclusión social, productiva y política"},1631,null,1033773200,"PAULA ROCIO VELOZA MARTINEZ","Persona Natural",null,null,null,null,30000000,0,1,15000000,45000000,45000000,"2022-01-25","2022-02-01","2022-10-31",180,1,90,null,null,null,null,"Terminado",1]
[106,2022,"FDLCH-CPS-106-2022","https://community.secop.gov.co/Public/Tendering/OpportunityDetail/Index?noticeUID=CO1.NTC.2715731&isFromPublicArea=True&isModal=true&asPopupView=true","Contratos de prestación de servicios profesionales y de apoyo a la gestión","Contratación directa","Prestación de servicios profesionales y de apoyo a la gestión, o para la ejecución de trabajos artísticos que sólo puedan encomendarse a determinadas personas naturales","Prestar servicios asistenciales de apoyo para la gestión y desarrollo del proyecto de inversión No. 1715 \"Chapinero restaurasdor y cuidador del territorio\".","Inversión","Un nuevo contrato social y ambiental para la Bogotá del Siglo XXI",28,{"$f":"IF(ISERROR(VLOOKUP(K120,[2]Proposito_programa!$C$2:$E$59,2,FALSE)),\" \",VLOOKUP(K120,[2]Proposito_programa!$C$2:$E$59,2,FALSE))","v":"Bogotá protectora de sus recursos naturales"},{"$f":"IF(ISERROR(VLOOKUP(K120,[2]Proposito_programa!$C$2:$E$59,3,FALSE)),\" \",VLOOKUP(K120,[2]Proposito_programa!$C$2:$E$59,3,FALSE))","v":"Propósito 2 : Cambiar Nuestros Hábitos de Vida para Reverdecer a Bogotá y Adaptarnos y Mitigar la Crisis Climática"},1715,null,52131900,"MAGDA LUCIA RIVERA JOYA","Persona Natural",null,null,null,null,13200000,0,1,6600000,19800000,19800000,"2022-01-25","2022-02-02","2022-11-01",180,1,90,null,null,null,null,"Terminado",1]
[107,2022,"FDLCH-CPS-107-2022","https://community.secop.gov.co/Public/Tendering/OpportunityDetail/Index?noticeUID=CO1.NTC.2711727&isFromPublicArea=True&isModal=true&asPopupView=true","Contratos de prestación de servicios profesionales y de apoyo a la gestión","Contratación directa","Prestación de servicios profesionales y de apoyo a la gestión, o para la ejecución de trabajos artísticos que sólo puedan encomendarse a determinadas personas naturales","Prestar servicios asistenciales de apoyo a la gestión para el desarrollo de actividades relacionadas con la asistencia administrativa, seguimiento, terminación y cierre de proyectos de inversión relacionados con la gestión ambiental local en el marco del proyecto de inversión\" Chapinero siembra esperanza\".","Inversión","Un nuevo contrato social y ambiental para la Bogotá del Siglo XXI",24,{"$f":"IF(ISERROR(VLOOKUP(K121,[2]Proposito_programa!$C$2:$E$59,2,FALSE)),\" \",VLOOKUP(K121,[2]Proposito_programa!$C$2:$E$59,2,FALSE))","v":"Bogotá región emprendedora e innovadora"},{"$f":"IF(ISERROR(VLOOKUP(K121,[2]Proposito_programa!$C$2:$E$59,3,FALSE)),\" \",VLOOKUP(K121,[2]Proposito_programa!$C$2:$E$59,3,FALSE))","v":"Propósito 1: Hacer un nuevo contrato social para incrementar la inclusión social, productiva y política"},1631,null,1024569859,"YEISON JESUS SANCHEZ WALDO","Persona Natural",null,null,null,null,13200000,0,1,6600000,19800000,19800000,"2022-01-26","2022-02-02","2022-11-01",180,1,90,null,null,null,null,"Terminado",1]
[108,2022,"FDLCH-CPS-108-2022","https://community.secop.gov.co/Public/Tendering/OpportunityDetail/Index?noticeUID=CO1.NTC.2712220&isFromPublicArea=True&isModal=true&asPopupView=true","Contratos de prestación de servicios profesionales y de apoyo a la gestión","Contratación directa","Prestación de servicios profesionales y de apoyo a la gestión, o para la ejecución de trabajos artísticos que sólo puedan encomendarse a determinadas personas naturales","Prestar servicios técnicos de apoyo a la gestión, para el desarrollo de los procesos de formación y transformación ambiental en la localidad en el marco en el proyecto 1712 \"Chapinero consiencte y resilente con el cambio climático\".","Inversión","Un nuevo contrato social y ambiental para la Bogotá del Siglo XXI",27,{"$f":"IF(ISERROR(VLOOKUP(K122,[2]Proposito_programa!$C$2:$E$59,2,FALSE)),\" \",VLOOKUP(K122,[2]Proposito_programa!$C$2:$E$59,2,FALSE))","v":"Cambio cultural para la gestión de la crisis climática"},{"$f":"IF(ISERROR(VLOOKUP(K122,[2]Proposito_programa!$C$2:$E$59,3,FALSE)),\" \",VLOOKUP(K122,[2]Proposito_programa!$C$2:$E$59,3,FALSE))","v":"Propósito 2 : Cambiar Nuestros Hábitos de Vida para Reverdecer a Bogotá y Adaptarnos y Mitigar la Crisis Climática"},1712,null,1019127835,"NATALIA PUERTO GONZALEZ","Persona Natural",null,null,null,null,18000000,-15600000,1,9000000,11400000,27000000,"2022-01-26","2022-02-01","2022-10-31",180,1,90,null,null,null,null,"Terminado",1]
[109,2022,"FDLCH-CPS-109-2022","https://community.secop.gov.co/Public/Tendering/OpportunityDetail/Index?noticeUID=CO1.NTC.2738666&isFromPublicArea=True&isModal=true&asPopupView=true","Contratos de prestación de servicios profesionales y de apoyo a la gestión","Contratación directa","Prestación de servicios profesionales y de apoyo a la gestión, o para la ejecución de trabajos artísticos que sólo puedan encomendarse a determinadas personas naturales","Apoyar jurídicamente la ejecución de las acciones requeridas para la depuración de las actuaciones administrativas que cursan en la Alcaldía Local.","Inversión","Un nuevo contrato social y ambiental para la Bogotá del Siglo XXI",57,{"$f":"IF(ISERROR(VLOOKUP(K123,[2]Proposito_programa!$C$2:$E$59,2,FALSE)),\" \",VLOOKUP(K123,[2]Proposito_programa!$C$2:$E$59,2,FALSE))","v":"Gestión pública local"},{"$f":"IF(ISERROR(VLOOKUP(K123,[2]Proposito_programa!$C$2:$E$59,3,FALSE)),\" \",VLOOKUP(K123,[2]Proposito_programa!$C$2:$E$59,3,FALSE))","v":"Propósito 5: Construir Bogotá - Región con gobierno abierto, transparente y ciudadanía consciente"},1841,null,1026267438,"SERGIO GEOVANNY TOCANCIPA ARIZA","Persona Natural",null,null,null,null,27600000,0,1,13800000,41400000,41400000,"2022-01-27","2022-02-01","2022-10-31",180,1,90,null,null,null,null,"Terminado",1]
[110,2022,"FDLCH-CPS-110-2022","https://community.secop.gov.co/Public/Tendering/OpportunityDetail/Index?noticeUID=CO1.NTC.2708476&isFromPublicArea=True&isModal=true&asPopupView=true","Contratos de prestación de servicios profesionales y de apoyo a la gestión","Contratación directa","Prestación de servicios profesionales y de apoyo a la gestión, o para la ejecución de trabajos artísticos que sólo puedan encomendarse a determinadas personas naturales","Prestar servicios asistenciales de apoyo a la gestión para el desarrollo de actividades relacionadas con la gestión ambiental local en el marco del proyecto de inversión \"Chapinero sostenible y consciente\"","Inversión","Un nuevo contrato social y ambiental para la Bogotá del Siglo XXI",38,{"$f":"IF(ISERROR(VLOOKUP(K124,[2]Proposito_programa!$C$2:$E$59,2,FALSE)),\" \",VLOOKUP(K124,[2]Proposito_programa!$C$2:$E$59,2,FALSE))","v":"Ecoeficiencia, reciclaje, manejo de residuos e inclusión de la población recicladora"},{"$f":"IF(ISERROR(VLOOKUP(K124,[2]Proposito_programa!$C$2:$E$59,3,FALSE)),\" \",VLOOKUP(K124,[2]Proposito_programa!$C$2:$E$59,3,FALSE))","v":"Propósito 2 : Cambiar Nuestros Hábitos de Vida para Reverdecer a Bogotá y Adaptarnos y Mitigar la Crisis Climática"},1728,null,1077866912,"MARIA PAULA BRAVO OROZCO","Persona Natural",null,null,null,null,12000000,0,null,null,12000000,12000000,"2022-01-25","2022-02-01","2022-10-31",180,1,90,null,null,null,null,"Terminado",1]
[111,2022,"FDLCH-CPS-111-2022","https://community.secop.gov.co/Public/Tendering/OpportunityDetail/Index?noticeUID=CO1.NTC.2706517&isFromPublicArea=True&isModal=False","Contratos de prestación de servicios profesionales y de apoyo a la gestión","Contratación directa","Prestación de servicios profesionales y de apoyo a la gestión, o para la ejecución de trabajos artísticos que sólo puedan encomendarse a determinadas personas naturales","Prestar servicios de apoyo a la gestión, para apoyar al área de gestión del desarrollo local de la alcaldía local de chapinero, en la gestión, desarrollo, seguimiento y evaluación del proyecto de inversión chapinero es primera infancia del programa educación inicial: bases sólidas para la vida","Inversión","Un nuevo contrato social y ambiental para la Bogotá del Siglo XXI",12,{"$f":"IF(ISERROR(VLOOKUP(K125,[2]Proposito_programa!$C$2:$E$59,2,FALSE)),\" \",VLOOKUP(K125,[2]Proposito_programa!$C$2:$E$59,2,FALSE))","v":"Educación inicial: Bases sólidas para la vida."},{"$f":"IF(ISERROR(VLOOKUP(K125,[2]Proposito_programa!$C$2:$E$59,3,FALSE)),\" \",VLOOKUP(K125,[2]Proposito_programa!$C$2:$E$59,3,FALSE))","v":"Propósito 1: Hacer un nuevo contrato social para incrementar la inclusión social, productiva y política"},1830,null,1031138150,"DIANA PAOLA AGUDELO CABRERA","Persona Natural",null,null,null,null,16320000,0,1,8160000,24480000,24480000,"2022-01-25","2022-02-01","2022-10-31",180,1,90,null,null,null,null,"Terminado",1]
[112,2022,"FDLCH-CPS-112-2022","https://community.secop.gov.co/Public/Tendering/OpportunityDetail/Index?noticeUID=CO1.NTC.2707639&isFromPublicArea=True&isModal=true&asPopupView=true","Contratos de prestación de servicios profesionales y de apoyo a la gestión","Contratación directa","Prestación de servicios profesionales y de apoyo a la gestión, o para la ejecución de trabajos artísticos que sólo puedan encomendarse a determinadas personas naturales","Prestar servicios profesionales para la gestión, planeación, seguimiento, mitigación y respuesta a situaciones y escenarios de emergencia, en marco del fortalecimiento de la gestión local de los riesgos y la adaptación al cambio climático","Inversión","Un nuevo contrato social y ambiental para la Bogotá del Siglo XXI",30,{"$f":"IF(ISERROR(VLOOKUP(K126,[2]Proposito_programa!$C$2:$E$59,2,FALSE)),\" \",VLOOKUP(K126,[2]Proposito_programa!$C$2:$E$59,2,FALSE))","v":"Eficiencia en la atención de emergencias"},{"$f":"IF(ISERROR(VLOOKUP(K126,[2]Proposito_programa!$C$2:$E$59,3,FALSE)),\" \",VLOOKUP(K126,[2]Proposito_programa!$C$2:$E$59,3,FALSE))","v":"Propósito 2 : Cambiar Nuestros Hábitos de Vida para Reverdecer a Bogotá y Adaptarnos y Mitigar la Crisis Climática"},1719,null,80220756,"LUIS EDUARDO CRUZ SANCHEZ","Persona Natural",null,null,null,null,28800000,0,null,null,28800000,28640000,"2022-01-25","2022-01-26","2022-07-25",180,null,null,null,null,null,null,"Terminado",1]
[113,2022,"FDLCH-CPS-113-2022","https://community.secop.gov.co/Public/Tendering/OpportunityDetail/Index?noticeUID=CO1.NTC.2707602&isFromPublicArea=True&isModal=true&asPopupView=true","Contratos de prestación de servicios profesionales y de apoyo a la gestión","Contratación directa","Prestación de servicios profesionales y de apoyo a la gestión, o para la ejecución de trabajos artísticos que sólo puedan encomendarse a determinadas personas naturales","Prestar servicios profesionales para la atención integral de las víctimas del conflicto armado; la gestión, formulación, desarrollo, seguimiento y evaluación del proyecto \"Chapinero territorio de paz\" y la atención de las instacias de participación locales relacionadas con la construcción de paz local.","Inversión","Un nuevo contrato social y ambiental para la Bogotá del Siglo XXI",39,{"$f":"IF(ISERROR(VLOOKUP(K127,[2]Proposito_programa!$C$2:$E$59,2,FALSE)),\" \",VLOOKUP(K127,[2]Proposito_programa!$C$2:$E$59,2,FALSE))","v":"Bogotá territorio de paz y atención integral a las víctimas del conflicto armado"},{"$f":"IF(ISERROR(VLOOKUP(K127,[2]Proposito_programa!$C$2:$E$59,3,FALSE)),\" \",VLOOKUP(K127,[2]Proposito_programa!$C$2:$E$59,3,FALSE))","v":"Propósito 3: Inspirar confianza y legitimidad para vivir sin miedo y ser epicentro de cultura ciudadana, paz y reconciliación"},2028,null,1014284420,"LAURA DANIELA GONZALEZ PACHECO","Persona Natural",null,null,null,null,27600000,0,1,13800000,41400000,41400000,"2022-01-25","2022-01-28","2022-10-27",180,1,90,null,null,null,null,"Terminado",1]
[114,2022,"FDLCH-CPS-114-2022","https://community.secop.gov.co/Public/Tendering/OpportunityDetail/Index?noticeUID=CO1.NTC.2710522&isFromPublicArea=True&isModal=true&asPopupView=true","Contratos de prestación de servicios profesionales y de apoyo a la gestión","Contratación directa","Prestación de servicios profesionales y de apoyo a la gestión, o para la ejecución de trabajos artísticos que sólo puedan encomendarse a determinadas personas naturales","Prestar servicios de apoyo a la gestión para la atención integrasl de las víctimas del conflicto armado en la marco del proyecto \"Chapinero terrirorio de paz y la atención de las instancias de participación locales relacionadas con la construcción de paz local.","Inversión","Un nuevo contrato social y ambiental para la Bogotá del Siglo XXI",39,{"$f":"IF(ISERROR(VLOOKUP(K128,[2]Proposito_programa!$C$2:$E$59,2,FALSE)),\" \",VLOOKUP(K128,[2]Proposito_programa!$C$2:$E$59,2,FALSE))","v":"Bogotá territorio de paz y atención integral a las víctimas del conflicto armado"},{"$f":"IF(ISERROR(VLOOKUP(K128,[2]Proposito_programa!$C$2:$E$59,3,FALSE)),\" \",VLOOKUP(K128,[2]Proposito_programa!$C$2:$E$59,3,FALSE))","v":"Propósito 3: Inspirar confianza y legitimidad para vivir sin miedo y ser epicentro de cultura ciudadana, paz y reconciliación"},2028,null,1023903680,"ERIKA MILENA NIÑO MOYANO","Persona Natural",null,null,null,null,12000000,0,null,null,12000000,12000000,"2022-01-26","2022-01-28","2022-07-27",180,null,null,null,null,null,null,"Terminado",1]
[115,2022,"FDLCH-CPS-115-2022","https://community.secop.gov.co/Public/Tendering/OpportunityDetail/Index?noticeUID=CO1.NTC.2713041&isFromPublicArea=True&isModal=False","Contratos de prestación de servicios profesionales y de apoyo a la gestión","Contratación directa","Prestación de servicios profesionales y de apoyo a la gestión, o para la ejecución de trabajos artísticos que sólo puedan encomendarse a determinadas personas naturales","Prestar los servicios profesionales de apoyo a la gestión para la formulación, desarrollo y seguimiento del proyecto de inversión \"Chapinero modelo de moviidad inteligente\" y la supervisión de contratos que le sean asignados.","Inversión","Un nuevo contrato social y ambiental para la Bogotá del Siglo XXI",49,{"$f":"IF(ISERROR(VLOOKUP(K129,[2]Proposito_programa!$C$2:$E$59,2,FALSE)),\" \",VLOOKUP(K129,[2]Proposito_programa!$C$2:$E$59,2,FALSE))","v":"Movilidad segura, sostenible y accesible"},{"$f":"IF(ISERROR(VLOOKUP(K129,[2]Proposito_programa!$C$2:$E$59,3,FALSE)),\" \",VLOOKUP(K129,[2]Proposito_programa!$C$2:$E$59,3,FALSE))","v":"Propósito 4: Hacer de Bogotá Región un modelo de movilidad multimodal, incluyente y sostenible"},1734,null,1014240563,"DIEGO MANUEL SALGADO GUTIERREZ","Persona Natural",null,null,null,null,30000000,0,1,15000000,45000000,45000000,"2022-01-26","2022-02-01","2022-10-31",180,1,90,null,null,null,null,"Terminado",1]
[116,2022,"FDLCH-CPS-116-2022","https://community.secop.gov.co/Public/Tendering/OpportunityDetail/Index?noticeUID=CO1.NTC.2715572&isFromPublicArea=True&isModal=False","Contratos de prestación de servicios profesionales y de apoyo a la gestión","Contratación directa","Prestación de servicios profesionales y de apoyo a la gestión, o para la ejecución de trabajos artísticos que sólo puedan encomendarse a determinadas personas naturales","Prestar los servicios técnicos de apoyo a la gestión, acciones administrativas y seguimiento de las actividades derivadas del proyecto de inversión \"Chapinero modelo de movilidad inteligente\"","Inversión","Un nuevo contrato social y ambiental para la Bogotá del Siglo XXI",49,{"$f":"IF(ISERROR(VLOOKUP(K130,[2]Proposito_programa!$C$2:$E$59,2,FALSE)),\" \",VLOOKUP(K130,[2]Proposito_programa!$C$2:$E$59,2,FALSE))","v":"Movilidad segura, sostenible y accesible"},{"$f":"IF(ISERROR(VLOOKUP(K130,[2]Proposito_programa!$C$2:$E$59,3,FALSE)),\" \",VLOOKUP(K130,[2]Proposito_programa!$C$2:$E$59,3,FALSE))","v":"Propósito 4: Hacer de Bogotá Región un modelo de movilidad multimodal, incluyente y sostenible"},1734,null,1022388528,"JHON FREDDY VALERO MAYA","Persona Natural",null,null,null,null,17400000,0,1,8700000,26100000,26100000,"2022-01-26","2022-02-01","2022-10-31",180,1,90,null,null,null,null,"Terminado",1]
[117,2022,"FDLCH-CPS-117-2022","https://community.secop.gov.co/Public/Tendering/OpportunityDetail/Index?noticeUID=CO1.NTC.2713721&isFromPublicArea=True&isModal=False","Contratos de prestación de servicios profesionales y de apoyo a la gestión","Contratación directa","Prestación de servicios profesionales y de apoyo a la gestión, o para la ejecución de trabajos artísticos que sólo puedan encomendarse a determinadas personas naturales","Prestar los servicios técnicos de apoyo a la gestión, acciones administrativas y seguimiento de las actividades derivadas del proyecto de inversión \"Chapinero modelo de movilidad inteligente\"","Inversión","Un nuevo contrato social y ambiental para la Bogotá del Siglo XXI",49,{"$f":"IF(ISERROR(VLOOKUP(K131,[2]Proposito_programa!$C$2:$E$59,2,FALSE)),\" \",VLOOKUP(K131,[2]Proposito_programa!$C$2:$E$59,2,FALSE))","v":"Movilidad segura, sostenible y accesible"},{"$f":"IF(ISERROR(VLOOKUP(K131,[2]Proposito_programa!$C$2:$E$59,3,FALSE)),\" \",VLOOKUP(K131,[2]Proposito_programa!$C$2:$E$59,3,FALSE))","v":"Propósito 4: Hacer de Bogotá Región un modelo de movilidad multimodal, incluyente y sostenible"},1734,null,1020794388,"GINA PAOLA JIMENEZ CONTRERAS","Persona Natural",null,null,null,null,17400000,0,null,null,17400000,17400000,"2022-01-26","2022-02-01","2022-07-31",180,null,null,null,null,null,null,"Terminado",1]
[118,2022,"FDLCH-CPS-118-2022","https://community.secop.gov.co/Public/Tendering/OpportunityDetail/Index?noticeUID=CO1.NTC.2708743&isFromPublicArea=True&isModal=true&asPopupView=true","Contratos de prestación de servicios profesionales y de apoyo a la gestión","Contratación directa","Prestación de servicios profesionales y de apoyo a la gestión, o para la ejecución de trabajos artísticos que sólo puedan encomendarse a determinadas personas naturales","Prestar servicios profesionales para la gestión, desarrollo, seguimiento y evaluación jurídica pre-contractual, contractual y postcontractual del proyecto de inversión \"Chapinero modelo de movilidad inteligente” y las demás relacionadas con el proyecto.","Inversión","Un nuevo contrato social y ambiental para la Bogotá del Siglo XXI",49,{"$f":"IF(ISERROR(VLOOKUP(K132,[2]Proposito_programa!$C$2:$E$59,2,FALSE)),\" \",VLOOKUP(K132,[2]Proposito_programa!$C$2:$E$59,2,FALSE))","v":"Movilidad segura, sostenible y accesible"},{"$f":"IF(ISERROR(VLOOKUP(K132,[2]Proposito_programa!$C$2:$E$59,3,FALSE)),\" \",VLOOKUP(K132,[2]Proposito_programa!$C$2:$E$59,3,FALSE))","v":"Propósito 4: Hacer de Bogotá Región un modelo de movilidad multimodal, incluyente y sostenible"},1734,null,1057590689,"ELMER RICARDO RINCON PLAZAS","Persona Natural",null,null,null,null,33000000,0,2,14666667,47666667,47666667,"2022-01-25","2022-01-26","2022-10-15",180,2,80,null,null,null,null,"Terminado",1]
[119,2022,"FDLCH-CPS-119-2022","https://community.secop.gov.co/Public/Tendering/OpportunityDetail/Index?noticeUID=CO1.NTC.2711894&isFromPublicArea=True&isModal=False","Contratos de prestación de servicios profesionales y de apoyo a la gestión","Contratación directa","Prestación de servicios profesionales y de apoyo a la gestión, o para la ejecución de trabajos artísticos que sólo puedan encomendarse a determinadas personas naturales","Prestar los servicios profesionales para la gestión, formulación, desarrollo y seguimiento del proyecto de inversión \"Chapinero espacio para hábitos saludables\"","Inversión","Un nuevo contrato social y ambiental para la Bogotá del Siglo XXI",33,{"$f":"IF(ISERROR(VLOOKUP(K133,[2]Proposito_programa!$C$2:$E$59,2,FALSE)),\" \",VLOOKUP(K133,[2]Proposito_programa!$C$2:$E$59,2,FALSE))","v":"Más árboles y más y mejor espacio público"},{"$f":"IF(ISERROR(VLOOKUP(K133,[2]Proposito_programa!$C$2:$E$59,3,FALSE)),\" \",VLOOKUP(K133,[2]Proposito_programa!$C$2:$E$59,3,FALSE))","v":"Propósito 2 : Cambiar Nuestros Hábitos de Vida para Reverdecer a Bogotá y Adaptarnos y Mitigar la Crisis Climática"},1723,null,1018461926,"FABIAN ANDRES CARDONA MARTINEZ","Persona Natural",null,null,null,null,27600000,0,1,13800000,41400000,41400000,"2022-01-26","2022-02-01","2022-10-31",180,1,90,null,null,null,null,"Terminado",1]
[120,2022,"FDLCH-CPS-120-2022","https://community.secop.gov.co/Public/Tendering/OpportunityDetail/Index?noticeUID=CO1.NTC.2722658&isFromPublicArea=True&isModal=true&asPopupView=true","Contratos de prestación de servicios profesionales y de apoyo a la gestión","Contratación directa","Prestación de servicios profesionales y de apoyo a la gestión, o para la ejecución de trabajos artísticos que sólo puedan encomendarse a determinadas personas naturales","Prestar servicios profesionales para apoyar técnicamente las distintas etaspas de los procesos de competencia de las inspecciones de policia de la localidad de chapinero según reparto","Inversión","Un nuevo contrato social y ambiental para la Bogotá del Siglo XXI",57,{"$f":"IF(ISERROR(VLOOKUP(K134,[2]Proposito_programa!$C$2:$E$59,2,FALSE)),\" \",VLOOKUP(K134,[2]Proposito_programa!$C$2:$E$59,2,FALSE))","v":"Gestión pública local"},{"$f":"IF(ISERROR(VLOOKUP(K134,[2]Proposito_programa!$C$2:$E$59,3,FALSE)),\" \",VLOOKUP(K134,[2]Proposito_programa!$C$2:$E$59,3,FALSE))","v":"Propósito 5: Construir Bogotá - Región con gobierno abierto, transparente y ciudadanía consciente"},1841,null,80429650,"EXCELINO ROMERO CASTAÑEDA","Persona Natural",null,null,null,null,31080000,0,1,15540000,46620000,46620000,"2022-01-27","2022-02-02","2022-11-01",180,1,90,null,null,null,null,"Terminado",1]
[121,2022,"FDLCH-CPS-121-2022","https://community.secop.gov.co/Public/Tendering/OpportunityDetail/Index?noticeUID=CO1.NTC.2710891&isFromPublicArea=True&isModal=true&asPopupView=true","Contratos de prestación de servicios profesionales y de apoyo a la gestión","Contratación directa","Prestación de servicios profesionales y de apoyo a la gestión, o para la ejecución de trabajos artísticos que sólo puedan encomendarse a determinadas personas naturales","Prestar los servicios profesionales para apoyar el área de gestión de desarrollo local de la Alcaldía Local de Chapinero, en la formulación, gestión, ejecución y apoyo a la supervisión de los proyectos relacionados con los temas de salud, en cumplimiento de las metas y objetivos del plan de Desarrollo Local.","Inversión","Un nuevo contrato social y ambiental para la Bogotá del Siglo XXI",6,{"$f":"IF(ISERROR(VLOOKUP(K135,[2]Proposito_programa!$C$2:$E$59,2,FALSE)),\" \",VLOOKUP(K135,[2]Proposito_programa!$C$2:$E$59,2,FALSE))","v":"Sistema Distrital de Cuidado"},{"$f":"IF(ISERROR(VLOOKUP(K135,[2]Proposito_programa!$C$2:$E$59,3,FALSE)),\" \",VLOOKUP(K135,[2]Proposito_programa!$C$2:$E$59,3,FALSE))","v":"Propósito 1: Hacer un nuevo contrato social para incrementar la inclusión social, productiva y política"},2024,null,1014187761,"MARIA DEL PILAR VARGAS TALERO ","Persona Natural",null,null,null,null,28640000,null,1,8640000,37280000,37440000,"2022-01-25","2022-03-02","2022-10-25",180,1,60,52958310,"NADIA CATALINA ARAGON CHILITO","2022-03-02",28640000,"Terminado",1]
[122,2022,"FDLCH-CPS-122-2022","https://community.secop.gov.co/Public/Tendering/OpportunityDetail/Index?noticeUID=CO1.NTC.2710492&isFromPublicArea=True&isModal=true&asPopupView=true","Contratos de prestación de servicios profesionales y de apoyo a la gestión","Contratación directa","Prestación de servicios profesionales y de apoyo a la gestión, o para la ejecución de trabajos artísticos que sólo puedan encomendarse a determinadas personas naturales","Prestar los servicios profesionales de apoyo a la gestión, para el seguimiento y verificación de las garantías contractuales derivadas de los contratos del proyecto de inversión \"Chapinero modelo de movilidad inteligente\".","Inversión","Un nuevo contrato social y ambiental para la Bogotá del Siglo XXI",49,{"$f":"IF(ISERROR(VLOOKUP(K136,[2]Proposito_programa!$C$2:$E$59,2,FALSE)),\" \",VLOOKUP(K136,[2]Proposito_programa!$C$2:$E$59,2,FALSE))","v":"Movilidad segura, sostenible y accesible"},{"$f":"IF(ISERROR(VLOOKUP(K136,[2]Proposito_programa!$C$2:$E$59,3,FALSE)),\" \",VLOOKUP(K136,[2]Proposito_programa!$C$2:$E$59,3,FALSE))","v":"Propósito 4: Hacer de Bogotá Región un modelo de movilidad multimodal, incluyente y sostenible"},1734,null,1070011854,"SANDRA PAOLA SALAMANCA RIAÑO","Persona Natural",null,null,null,null,27600000,0,1,13800000,41400000,41400000,"2022-01-25","2022-01-27","2022-10-26",180,1,90,null,null,null,null,"Terminado",1]
[123,2022,"FDLCH-CPS-123-2022","https://community.secop.gov.co/Public/Tendering/OpportunityDetail/Index?noticeUID=CO1.NTC.2751055&isFromPublicArea=True&isModal=true&asPopupView=true","Contratos de prestación de servicios profesionales y de apoyo a la gestión","Contratación directa","Prestación de servicios profesionales y de apoyo a la gestión, o para la ejecución de trabajos artísticos que sólo puedan encomendarse a determinadas personas naturales","Prestar servicios profesionales para la gestión, formulación, desarrollo, seguimiento y evaluación del Proyecto “Chapinero territorio para vivir sin miedo","Inversión","Un nuevo contrato social y ambiental para la Bogotá del Siglo XXI",48,{"$f":"IF(ISERROR(VLOOKUP(K137,[2]Proposito_programa!$C$2:$E$59,2,FALSE)),\" \",VLOOKUP(K137,[2]Proposito_programa!$C$2:$E$59,2,FALSE))","v":"Plataforma institucional para la seguridad y justicia"},{"$f":"IF(ISERROR(VLOOKUP(K137,[2]Proposito_programa!$C$2:$E$59,3,FALSE)),\" \",VLOOKUP(K137,[2]Proposito_programa!$C$2:$E$59,3,FALSE))","v":"Propósito 3: Inspirar confianza y legitimidad para vivir sin miedo y ser epicentro de cultura ciudadana, paz y reconciliación"},1740,null,52904967,"ANGELA CRISTINA CARVAJAL TOVAR","Persona Natural",null,null,null,null,22800000,0,1,11400000,34200000,34200000,"2022-01-27","2022-02-01","2022-07-31",120,1,60,null,null,null,null,"Terminado",1]
[124,2022,"FDLCH-CPS-124-2022","https://community.secop.gov.co/Public/Tendering/OpportunityDetail/Index?noticeUID=CO1.NTC.2750522&isFromPublicArea=True&isModal=true&asPopupView=true","Contratos de prestación de servicios profesionales y de apoyo a la gestión","Contratación directa","Prestación de servicios profesionales y de apoyo a la gestión, o para la ejecución de trabajos artísticos que sólo puedan encomendarse a determinadas personas naturales","Prestar servicios de apoyo logístico asistencial para el desarrollo de actividades y eventos locales en el marco de la ejecución del plan de desarrollo local.","Inversión","Un nuevo contrato social y ambiental para la Bogotá del Siglo XXI",57,{"$f":"IF(ISERROR(VLOOKUP(K138,[2]Proposito_programa!$C$2:$E$59,2,FALSE)),\" \",VLOOKUP(K138,[2]Proposito_programa!$C$2:$E$59,2,FALSE))","v":"Gestión pública local"},{"$f":"IF(ISERROR(VLOOKUP(K138,[2]Proposito_programa!$C$2:$E$59,3,FALSE)),\" \",VLOOKUP(K138,[2]Proposito_programa!$C$2:$E$59,3,FALSE))","v":"Propósito 5: Construir Bogotá - Región con gobierno abierto, transparente y ciudadanía consciente"},1741,null,80410411,"CARLOS JULIO MARTINEZ RIPE","Persona Natural",null,null,null,null,13200000,0,1,6600000,19800000,19800000,"2022-01-27","2022-02-01","2022-10-31",180,1,90,null,null,null,null,"Terminado",1]
[125,2022,"FDLCH-CPS-125-2022","https://community.secop.gov.co/Public/Tendering/OpportunityDetail/Index?noticeUID=CO1.NTC.2750162&isFromPublicArea=True&isModal=true&asPopupView=true","Contratos de prestación de servicios profesionales y de apoyo a la gestión","Contratación directa","Prestación de servicios profesionales y de apoyo a la gestión, o para la ejecución de trabajos artísticos que sólo puedan encomendarse a determinadas personas naturales","Prestar los servicios de apoyo a la gestión para la orientación de sesiones de actividad física musicalizada y no musicalizada en la localidad como del acompañamiento atención y ejecución de actividades recreo-deportivas derivadas del proyecto de invrsión \"Chapinero epicentro del deporte y la recreación\".","Inversión","Un nuevo contrato social y ambiental para la Bogotá del Siglo XXI",20,{"$f":"IF(ISERROR(VLOOKUP(K139,[2]Proposito_programa!$C$2:$E$59,2,FALSE)),\" \",VLOOKUP(K139,[2]Proposito_programa!$C$2:$E$59,2,FALSE))","v":"Bogotá, referente en cultura, deporte, recreación y actividad física, con parques para el desarrollo y la salud"},{"$f":"IF(ISERROR(VLOOKUP(K139,[2]Proposito_programa!$C$2:$E$59,3,FALSE)),\" \",VLOOKUP(K139,[2]Proposito_programa!$C$2:$E$59,3,FALSE))","v":"Propósito 1: Hacer un nuevo contrato social para incrementar la inclusión social, productiva y política"},1845,null,1018432468,"EDISON FABIAN LEON LEON","Persona Natural",null,null,null,null,16500000,0,null,null,16500000,16499999,"2022-01-27","2022-02-02","2022-08-01",180,null,null,null,null,null,null,"Terminado",1]
[126,2022,"FDLCH-CPS-126-2022","https://community.secop.gov.co/Public/Tendering/OpportunityDetail/Index?noticeUID=CO1.NTC.2749931&isFromPublicArea=True&isModal=true&asPopupView=true","Contratos de prestación de servicios profesionales y de apoyo a la gestión","Contratación directa","Prestación de servicios profesionales y de apoyo a la gestión, o para la ejecución de trabajos artísticos que sólo puedan encomendarse a determinadas personas naturales","Prestar servicios de apoyo logístico asistencial para el desarrollo de actividades y eventos locales en el marco de la ejecución del plan de desarrollo local.","Inversión","Un nuevo contrato social y ambiental para la Bogotá del Siglo XXI",57,{"$f":"IF(ISERROR(VLOOKUP(K140,[2]Proposito_programa!$C$2:$E$59,2,FALSE)),\" \",VLOOKUP(K140,[2]Proposito_programa!$C$2:$E$59,2,FALSE))","v":"Gestión pública local"},{"$f":"IF(ISERROR(VLOOKUP(K140,[2]Proposito_programa!$C$2:$E$59,3,FALSE)),\" \",VLOOKUP(K140,[2]Proposito_programa!$C$2:$E$59,3,FALSE))","v":"Propósito 5: Construir Bogotá - Región con gobierno abierto, transparente y ciudadanía consciente"},1741,null,1071166907,"WILSON FERNANDO ORJUELA CHAVES","Persona Natural",null,null,null,null,13200000,0,1,6600000,19800000,19800000,"2022-01-27","2022-02-01","2022-10-31",180,1,90,null,null,null,null,"Terminado",1]
[127,2022,"FDLCH-CPS-127-2022","https://community.secop.gov.co/Public/Tendering/OpportunityDetail/Index?noticeUID=CO1.NTC.2734273&isFromPublicArea=True&isModal=true&asPopupView=true","Contratos de prestación de servicios profesionales y de apoyo a la gestión","Contratación directa","Prestación de servicios profesionales y de apoyo a la gestión, o para la ejecución de trabajos artísticos que sólo puedan encomendarse a determinadas personas naturales","Prestar los servicios de apoyo a la gestión en la implementación, atención, verificación, soporte y acompañamiento de los procesos y/o actuaciones administrativas de la Alcaldía Local, así como el seguimiento en los aplicativos y/o herramientas virtuales.","Inversión","Un nuevo contrato social y ambiental para la Bogotá del Siglo XXI",57,{"$f":"IF(ISERROR(VLOOKUP(K141,[2]Proposito_programa!$C$2:$E$59,2,FALSE)),\" \",VLOOKUP(K141,[2]Proposito_programa!$C$2:$E$59,2,FALSE))","v":"Gestión pública local"},{"$f":"IF(ISERROR(VLOOKUP(K141,[2]Proposito_programa!$C$2:$E$59,3,FALSE)),\" \",VLOOKUP(K141,[2]Proposito_programa!$C$2:$E$59,3,FALSE))","v":"Propósito 5: Construir Bogotá - Región con gobierno abierto, transparente y ciudadanía consciente"},1741,null,1120563691,"JHON FREDDY RAMIREZ VILLABUENA","Persona Natural",null,null,null,null,8000000,0,1,4000000,12000000,12000000,"2022-01-27","2022-02-02","2022-08-01",120,1,60,null,null,null,null,"Terminado",1]
[128,2022,"FDLCH-CPS-128-2022","https://community.secop.gov.co/Public/Tendering/OpportunityDetail/Index?noticeUID=CO1.NTC.2708767&isFromPublicArea=True&isModal=true&asPopupView=true","Contratos de prestación de servicios profesionales y de apoyo a la gestión","Contratación directa","Prestación de servicios profesionales y de apoyo a la gestión, o para la ejecución de trabajos artísticos que sólo puedan encomendarse a determinadas personas naturales","Prestar servicios profesionales para el apoyo a la gestión y la articulación de las acciones de inspección vigilancia y control requeridos por la Alcaldía Local de Chapinero en el marco de la normatividad.","Inversión","Un nuevo contrato social y ambiental para la Bogotá del Siglo XXI",57,{"$f":"IF(ISERROR(VLOOKUP(K142,[2]Proposito_programa!$C$2:$E$59,2,FALSE)),\" \",VLOOKUP(K142,[2]Proposito_programa!$C$2:$E$59,2,FALSE))","v":"Gestión pública local"},{"$f":"IF(ISERROR(VLOOKUP(K142,[2]Proposito_programa!$C$2:$E$59,3,FALSE)),\" \",VLOOKUP(K142,[2]Proposito_programa!$C$2:$E$59,3,FALSE))","v":"Propósito 5: Construir Bogotá - Región con gobierno abierto, transparente y ciudadanía consciente"},1841,null,31152253,"MARIA DEL ROSARIO VALDERRUTEN","Persona Natural",null,null,null,null,42240000,-28864000,null,null,13376000,13376000,"2022-01-26","2022-01-26","2022-03-23",180,null,null,null,null,null,null,"Terminado",1]
[129,2022,"FDLCH-CPS-129-2022","https://community.secop.gov.co/Public/Tendering/OpportunityDetail/Index?noticeUID=CO1.NTC.2737167&isFromPublicArea=True&isModal=true&asPopupView=true","Contratos de prestación de servicios profesionales y de apoyo a la gestión","Contratación directa","Prestación de servicios profesionales y de apoyo a la gestión, o para la ejecución de trabajos artísticos que sólo puedan encomendarse a determinadas personas naturales","Prestar servicios profesionales para la gestión, formulación, desarrollo, seguimiento y evaluación del proyecto de invesión chapinero productivo y emprendedor, la estrategia de mitigación y reactivación económica-EMRE Local y la supervisión de contratos que le asean asignados.","Inversión","Un nuevo contrato social y ambiental para la Bogotá del Siglo XXI",6,{"$f":"IF(ISERROR(VLOOKUP(K143,[2]Proposito_programa!$C$2:$E$59,2,FALSE)),\" \",VLOOKUP(K143,[2]Proposito_programa!$C$2:$E$59,2,FALSE))","v":"Sistema Distrital de Cuidado"},{"$f":"IF(ISERROR(VLOOKUP(K143,[2]Proposito_programa!$C$2:$E$59,3,FALSE)),\" \",VLOOKUP(K143,[2]Proposito_programa!$C$2:$E$59,3,FALSE))","v":"Propósito 1: Hacer un nuevo contrato social para incrementar la inclusión social, productiva y política"},1671,null,1032381420,"JENNIFER TORRES TORRES","Persona Natural",null,null,null,null,24000000,-8400000,null,null,15600000,15600000,"2022-01-27","2022-02-01","2022-04-18",120,null,null,null,null,null,null,"Terminado",1]
[130,2022,"FDLCH-CPS-130-2022","https://community.secop.gov.co/Public/Tendering/OpportunityDetail/Index?noticeUID=CO1.NTC.2735408&isFromPublicArea=True&isModal=true&asPopupView=true","Contratos de prestación de servicios profesionales y de apoyo a la gestión","Contratación directa","Prestación de servicios profesionales y de apoyo a la gestión, o para la ejecución de trabajos artísticos que sólo puedan encomendarse a determinadas personas naturales","Prestar servicios profesionales para apoyar al Alcalde Local en la gestión de los asuntos relacionados con seguridad ciudadana, convivencia y prevención de conflictividades, violencias y delitos en la localidad, de conformidad con el marco normativo aplicable en la materia.","Inversión","Un nuevo contrato social y ambiental para la Bogotá del Siglo XXI",57,{"$f":"IF(ISERROR(VLOOKUP(K144,[2]Proposito_programa!$C$2:$E$59,2,FALSE)),\" \",VLOOKUP(K144,[2]Proposito_programa!$C$2:$E$59,2,FALSE))","v":"Gestión pública local"},{"$f":"IF(ISERROR(VLOOKUP(K144,[2]Proposito_programa!$C$2:$E$59,3,FALSE)),\" \",VLOOKUP(K144,[2]Proposito_programa!$C$2:$E$59,3,FALSE))","v":"Propósito 5: Construir Bogotá - Región con gobierno abierto, transparente y ciudadanía consciente"},1741,null,79720862,"IVAN GUILLERMO RAMIREZ REYES","Persona Natural",null,null,null,null,48000000,0,2,{"$f":"19000000+5000000","v":24000000},{"$f":"+W144+X144+Z144","v":72000000},60800000,"2022-01-27","2022-01-27","25/01/2023",240,2,120,null,null,null,null,"En ejecución",0.9]
[131,2022,"FDLCH-CPS-131-2022","https://community.secop.gov.co/Public/Tendering/OpportunityDetail/Index?noticeUID=CO1.NTC.2732491&isFromPublicArea=True&isModal=true&asPopupView=true","Contratos de prestación de servicios profesionales y de apoyo a la gestión","Contratación directa","Prestación de servicios profesionales y de apoyo a la gestión, o para la ejecución de trabajos artísticos que sólo puedan encomendarse a determinadas personas naturales","Prestar servicios asistenciales para apoyar al Alcalde Local en la promoción, articulación, acompañamiento y seguimiento para la atención y protección de los animales domésticos y silvestres de la localidad.","Inversión","Un nuevo contrato social y ambiental para la Bogotá del Siglo XXI",34,{"$f":"IF(ISERROR(VLOOKUP(K145,[2]Proposito_programa!$C$2:$E$59,2,FALSE)),\" \",VLOOKUP(K145,[2]Proposito_programa!$C$2:$E$59,2,FALSE))","v":"Bogotá protectora de los animales"},{"$f":"IF(ISERROR(VLOOKUP(K145,[2]Proposito_programa!$C$2:$E$59,3,FALSE)),\" \",VLOOKUP(K145,[2]Proposito_programa!$C$2:$E$59,3,FALSE))","v":"Propósito 2 : Cambiar Nuestros Hábitos de Vida para Reverdecer a Bogotá y Adaptarnos y Mitigar la Crisis Climática"},1731,null,1026263210,"NORMA CONSTANZA IQUIRA ARISTIZABAL ","Persona Natural",null,null,null,null,11000000,null,1,5500000,16500000,13053333,"2022-01-27","2022-02-01","2022-09-21",150,1,75,53161037,"YURI MATOMA MENDEZ","2022-04-18",5333333,"Terminado",1]
[132,2022,"FDLCH-CPS-132-2022","https://community.secop.gov.co/Public/Tendering/OpportunityDetail/Index?noticeUID=CO1.NTC.2734177&isFromPublicArea=True&isModal=true&asPopupView=true","Contratos de prestación de servicios profesionales y de apoyo a la gestión","Contratación directa","Prestación de servicios profesionales y de apoyo a la gestión, o para la ejecución de trabajos artísticos que sólo puedan encomendarse a determinadas personas naturales","Prestar servicios profesionales para la gestión, formulación, desarrollo, seguimiento y evaluación del proyecto de inversión\"Chapinero y emprendedor, la estrategia de mitigación y reactivación económica - EMRE local y la supervisión de contratos que le sean asignados.","Inversión","Un nuevo contrato social y ambiental para la Bogotá del Siglo XXI",6,{"$f":"IF(ISERROR(VLOOKUP(K146,[2]Proposito_programa!$C$2:$E$59,2,FALSE)),\" \",VLOOKUP(K146,[2]Proposito_programa!$C$2:$E$59,2,FALSE))","v":"Sistema Distrital de Cuidado"},{"$f":"IF(ISERROR(VLOOKUP(K146,[2]Proposito_programa!$C$2:$E$59,3,FALSE)),\" \",VLOOKUP(K146,[2]Proposito_programa!$C$2:$E$59,3,FALSE))","v":"Propósito 1: Hacer un nuevo contrato social para incrementar la inclusión social, productiva y política"},1671,null,60256522,"NUBIA CONSTANZA MOGOLLON ACEVEDO","Persona Natural",null,null,null,null,28200000,0,1,14100000,42300000,42300000,"2022-01-27","2022-02-01","2022-10-31",180,1,90,null,null,null,null,"Terminado",1]
[133,2022,"FDLCH-CPS-133-2022","https://community.secop.gov.co/Public/Tendering/OpportunityDetail/Index?noticeUID=CO1.NTC.2736462&isFromPublicArea=True&isModal=true&asPopupView=true","Contratos de prestación de servicios profesionales y de apoyo a la gestión","Contratación directa","Prestación de servicios profesionales y de apoyo a la gestión, o para la ejecución de trabajos artísticos que sólo puedan encomendarse a determinadas personas naturales","Prestar los servicios técnicos de apoyo para la operación, seguimiento y cumplmiento de los procesos y procedimientos del servicio, apoyos económicos TIPO C, requeridos para el oportuno y adecuado registro, cruce y reporte de los datos en el sistema misional SIRBE, que contribuyan a la garantía de los derechos de la población mayor en el marco de la política pública social para el envejecimeinto y la vejez en el distrito capital a cargo de la Alcaldía Local.","Inversión","Un nuevo contrato social y ambiental para la Bogotá del Siglo XXI",1,{"$f":"IF(ISERROR(VLOOKUP(K147,[2]Proposito_programa!$C$2:$E$59,2,FALSE)),\" \",VLOOKUP(K147,[2]Proposito_programa!$C$2:$E$59,2,FALSE))","v":"Subsidios y transferencias para la equidad"},{"$f":"IF(ISERROR(VLOOKUP(K147,[2]Proposito_programa!$C$2:$E$59,3,FALSE)),\" \",VLOOKUP(K147,[2]Proposito_programa!$C$2:$E$59,3,FALSE))","v":"Propósito 1: Hacer un nuevo contrato social para incrementar la inclusión social, productiva y política"},1815,null,80449648,"JUAN CARLOS AREVALO","Persona Natural",null,null,null,null,25200000,0,1,12600000,37800000,37800000,"2022-01-27","2022-02-01","2022-10-31",180,1,90,null,null,null,null,"Terminado",1]
[134,2022,"FDLCH-CPS-134-2022","https://community.secop.gov.co/Public/Tendering/OpportunityDetail/Index?noticeUID=CO1.NTC.2738213&isFromPublicArea=True&isModal=true&asPopupView=true","Contratos de prestación de servicios profesionales y de apoyo a la gestión","Contratación directa","Prestación de servicios profesionales y de apoyo a la gestión, o para la ejecución de trabajos artísticos que sólo puedan encomendarse a determinadas personas naturales","Prestar servicios de apoyo a la gestión en la ejecución de las actividades administrativas y documentales relacionadas con la gestión policiva en la Alcaldía Local de Chapinero.","Inversión","Un nuevo contrato social y ambiental para la Bogotá del Siglo XXI",57,{"$f":"IF(ISERROR(VLOOKUP(K148,[2]Proposito_programa!$C$2:$E$59,2,FALSE)),\" \",VLOOKUP(K148,[2]Proposito_programa!$C$2:$E$59,2,FALSE))","v":"Gestión pública local"},{"$f":"IF(ISERROR(VLOOKUP(K148,[2]Proposito_programa!$C$2:$E$59,3,FALSE)),\" \",VLOOKUP(K148,[2]Proposito_programa!$C$2:$E$59,3,FALSE))","v":"Propósito 5: Construir Bogotá - Región con gobierno abierto, transparente y ciudadanía consciente"},1841,null,39547488,"MARIA CRISTINA CRISTANCHO TRIANA","Persona Natural",null,null,null,null,13200000,0,1,6600000,19800000,19800000,"2022-01-27","2022-02-01","2022-10-31",180,1,90,null,null,null,null,"Terminado",1]
[135,2022,"FDLCH-CPS-135-2022","https://community.secop.gov.co/Public/Tendering/OpportunityDetail/Index?noticeUID=CO1.NTC.2734892&isFromPublicArea=True&isModal=true&asPopupView=true","Contratos de prestación de servicios profesionales y de apoyo a la gestión","Contratación directa","Prestación de servicios profesionales y de apoyo a la gestión, o para la ejecución de trabajos artísticos que sólo puedan encomendarse a determinadas personas naturales","Prestar servicios técnicos para apoyar la gestión jurídica en la ejecución de las actividades administrativas y documentales con contenido jurídico, relacionadas con los procesos de inspección, vigilancia y control que adelanta la Alcaldía Local de Chapinero","Inversión","Un nuevo contrato social y ambiental para la Bogotá del Siglo XXI",57,{"$f":"IF(ISERROR(VLOOKUP(K149,[2]Proposito_programa!$C$2:$E$59,2,FALSE)),\" \",VLOOKUP(K149,[2]Proposito_programa!$C$2:$E$59,2,FALSE))","v":"Gestión pública local"},{"$f":"IF(ISERROR(VLOOKUP(K149,[2]Proposito_programa!$C$2:$E$59,3,FALSE)),\" \",VLOOKUP(K149,[2]Proposito_programa!$C$2:$E$59,3,FALSE))","v":"Propósito 5: Construir Bogotá - Región con gobierno abierto, transparente y ciudadanía consciente"},1841,null,52524843,"YADY MATILDE MORENO VARGAS","Persona Natural",null,null,null,null,14000000,0,1,7000000,21000000,21000000,"2022-01-27","2022-02-02","2022-08-01",120,1,60,null,null,null,null,"Terminado",1]
[136,2022,"FDLCH-CPS-136-2022","https://community.secop.gov.co/Public/Tendering/OpportunityDetail/Index?noticeUID=CO1.NTC.2790309&isFromPublicArea=True&isModal=true&asPopupView=true","Contratos de prestación de servicios profesionales y de apoyo a la gestión","Contratación directa","Prestación de servicios profesionales y de apoyo a la gestión, o para la ejecución de trabajos artísticos que sólo puedan encomendarse a determinadas personas naturales","Prestar los servicios de apoyo necesarios para la conducción de los vehículos que conforman el parque automotor en propiedad o custodia del fondo de desarrollo local de chapinero, y el transporte de servidores públicos para la realización de las actividades misionales de la alcaldía local de chapinero","Inversión","Un nuevo contrato social y ambiental para la Bogotá del Siglo XXI",57,{"$f":"IF(ISERROR(VLOOKUP(K150,[2]Proposito_programa!$C$2:$E$59,2,FALSE)),\" \",VLOOKUP(K150,[2]Proposito_programa!$C$2:$E$59,2,FALSE))","v":"Gestión pública local"},{"$f":"IF(ISERROR(VLOOKUP(K150,[2]Proposito_programa!$C$2:$E$59,3,FALSE)),\" \",VLOOKUP(K150,[2]Proposito_programa!$C$2:$E$59,3,FALSE))","v":"Propósito 5: Construir Bogotá - Región con gobierno abierto, transparente y ciudadanía consciente"},1741,null,80143954,"OSCAR FABIAN PINEDA CASTRO","Persona Natural",null,null,null,null,{"$f":"15600000+5806667","v":21406667},-5806667,1,2600000,18200000,16640000,"2022-01-28","2022-02-08","2023-03-01",180,1,30,1026562676,"HENRY MICHEL DAZA OSPINA","2022-09-27",5806667,"En ejecución",0.9]
[137,2022,"FDLCH-CPS-137-2022","https://community.secop.gov.co/Public/Tendering/OpportunityDetail/Index?noticeUID=CO1.NTC.2732747&isFromPublicArea=True&isModal=true&asPopupView=true","Contratos de prestación de servicios profesionales y de apoyo a la gestión","Contratación directa","Prestación de servicios profesionales y de apoyo a la gestión, o para la ejecución de trabajos artísticos que sólo puedan encomendarse a determinadas personas naturales","Prestar servicios de apoyo a la gestión para desarrollar las actividades de atención y orientación al ciudadano que se requieran en las instalaciones de la alcaldía local de chapinero","Inversión","Un nuevo contrato social y ambiental para la Bogotá del Siglo XXI",57,{"$f":"IF(ISERROR(VLOOKUP(K151,[2]Proposito_programa!$C$2:$E$59,2,FALSE)),\" \",VLOOKUP(K151,[2]Proposito_programa!$C$2:$E$59,2,FALSE))","v":"Gestión pública local"},{"$f":"IF(ISERROR(VLOOKUP(K151,[2]Proposito_programa!$C$2:$E$59,3,FALSE)),\" \",VLOOKUP(K151,[2]Proposito_programa!$C$2:$E$59,3,FALSE))","v":"Propósito 5: Construir Bogotá - Región con gobierno abierto, transparente y ciudadanía consciente"},1741,null,52785810,"DIANA SHIRLEY ARDILA ARDILA","Persona Natural",null,null,null,null,12000000,0,1,6000000,18000000,18000000,"2022-01-26","2022-02-01","2022-10-31",180,1,90,null,null,null,null,"Terminado",1]
[138,2022,"FDLCH-CPS-138-2022","https://community.secop.gov.co/Public/Tendering/OpportunityDetail/Index?noticeUID=CO1.NTC.2732435&isFromPublicArea=True&isModal=true&asPopupView=true","Contratos de prestación de servicios profesionales y de apoyo a la gestión","Contratación directa","Prestación de servicios profesionales y de apoyo a la gestión, o para la ejecución de trabajos artísticos que sólo puedan encomendarse a determinadas personas naturales","Apoyar en las tareas operativas de carácter archivístico desarrolladas en la Alcaldía Local de Chapinero para garantizar la aplicación correcta de los procedimientos técnicos","Inversión","Un nuevo contrato social y ambiental para la Bogotá del Siglo XXI",57,{"$f":"IF(ISERROR(VLOOKUP(K152,[2]Proposito_programa!$C$2:$E$59,2,FALSE)),\" \",VLOOKUP(K152,[2]Proposito_programa!$C$2:$E$59,2,FALSE))","v":"Gestión pública local"},{"$f":"IF(ISERROR(VLOOKUP(K152,[2]Proposito_programa!$C$2:$E$59,3,FALSE)),\" \",VLOOKUP(K152,[2]Proposito_programa!$C$2:$E$59,3,FALSE))","v":"Propósito 5: Construir Bogotá - Región con gobierno abierto, transparente y ciudadanía consciente"},1741,null,52423626,"DIANA PAOLA OVALLE RODRIGUEZ","Persona Natural",null,null,null,null,24000000,0,1,12000000,36000000,36000000,"2022-01-26","2022-02-01","2022-10-31",180,1,90,null,null,null,null,"Terminado",1]
[71,2021,"FDLCH-CPS-071-2021","https://colombiacompra.gov.co/tienda-virtual-del-estado-colombiano/ordenes-compra/65068","Contratos de prestación de servicios","Selección abreviada","Selección abreviada por menor cuantía ","Prestar los servicios de aseo y cafeteria en la Alcaldía Local de Chapinero y sus sedes, conforme a lo estipulado en el Acuerdo Marco de Precios III","Funcionamiento","Un nuevo contrato social y ambiental para la Bogotá del Siglo XXI","No aplica",{"$f":"IF(ISERROR(VLOOKUP(K153,Proposito_programa!$C$2:$E$59,2,FALSE)),\" \",VLOOKUP(K153,Proposito_programa!$C$2:$E$59,2,FALSE))","v":" "},{"$f":"IF(ISERROR(VLOOKUP(K153,Proposito_programa!$C$2:$E$59,3,FALSE)),\" \",VLOOKUP(K153,Proposito_programa!$C$2:$E$59,3,FALSE))","v":" "},null,null,830068543,"MUNDOLIMPIEZA LTDA","Persona Jurídica",null,null,null,null,null,null,null,8606292,{"$f":"+W153+X153+Z153","v":8606292},8606292,"2022-05-11","2021-03-04",null,null,null,null,null,null,null,null,"Terminado",1]
[140,2022,"FLCH-CPS-140-2022","https://community.secop.gov.co/Public/Tendering/OpportunityDetail/Index?noticeUID=CO1.NTC.2735830&isFromPublicArea=True&isModal=true&asPopupView=true","Contratos de prestación de servicios profesionales y de apoyo a la gestión","Contratación directa","Prestación de servicios profesionales y de apoyo a la gestión, o para la ejecución de trabajos artísticos que sólo puedan encomendarse a determinadas personas naturales","Prestar servicios profesionales para apoyar la formulación, ejecución, seguimiento y mejora continua de las herramientas que conforman la gestión ambienal institucional de la Alcaldía Local de Chapinero.","Inversión","Un nuevo contrato social y ambiental para la Bogotá del Siglo XXI",57,{"$f":"IF(ISERROR(VLOOKUP(K154,[2]Proposito_programa!$C$2:$E$59,2,FALSE)),\" \",VLOOKUP(K154,[2]Proposito_programa!$C$2:$E$59,2,FALSE))","v":"Gestión pública local"},{"$f":"IF(ISERROR(VLOOKUP(K154,[2]Proposito_programa!$C$2:$E$59,3,FALSE)),\" \",VLOOKUP(K154,[2]Proposito_programa!$C$2:$E$59,3,FALSE))","v":"Propósito 5: Construir Bogotá - Región con gobierno abierto, transparente y ciudadanía consciente"},1741,null,79748591,"HARVY ZURITH BARRIOS LOPEZ","Persona Natural",null,null,null,null,27600000,0,null,null,27600000,27600000,"2022-01-27","2022-02-01","2022-07-31",180,null,null,null,null,null,null,"Terminado",1]
[141,2022,"FDLCH-CPS-141-2022","https://community.secop.gov.co/Public/Tendering/OpportunityDetail/Index?noticeUID=CO1.NTC.2760172&isFromPublicArea=True&isModal=true&asPopupView=true","Contratos de prestación de servicios profesionales y de apoyo a la gestión","Contratación directa","Prestación de servicios profesionales y de apoyo a la gestión, o para la ejecución de trabajos artísticos que sólo puedan encomendarse a determinadas personas naturales","Prestar servicios profesionales para el apoyo en la gestión, ejecución y seguimiento de los contratos derivados del proyecto \"Chapinero productivo y emprendedor\", y aquellos relacionados con la estrategia de mitigación y reacitivación económica- EMRE LOCAL","Inversión","Un nuevo contrato social y ambiental para la Bogotá del Siglo XXI",6,{"$f":"IF(ISERROR(VLOOKUP(K155,[2]Proposito_programa!$C$2:$E$59,2,FALSE)),\" \",VLOOKUP(K155,[2]Proposito_programa!$C$2:$E$59,2,FALSE))","v":"Sistema Distrital de Cuidado"},{"$f":"IF(ISERROR(VLOOKUP(K155,[2]Proposito_programa!$C$2:$E$59,3,FALSE)),\" \",VLOOKUP(K155,[2]Proposito_programa!$C$2:$E$59,3,FALSE))","v":"Propósito 1: Hacer un nuevo contrato social para incrementar la inclusión social, productiva y política"},1671,null,79365852,"JOHN ROGER SANCHEZ RAMOS","Persona Natural",null,null,null,null,23500000,-13473334,null,null,10026666,10026666,"2022-01-27","2022-02-02","2022-07-01",150,null,null,null,null,null,null,"Terminado",1]
[142,2022,"FDLCH-CPS-142-2022","https://community.secop.gov.co/Public/Tendering/OpportunityDetail/Index?noticeUID=CO1.NTC.2735250&isFromPublicArea=True&isModal=true&asPopupView=true","Contratos de prestación de servicios profesionales y de apoyo a la gestión","Contratación directa","Prestación de servicios profesionales y de apoyo a la gestión, o para la ejecución de trabajos artísticos que sólo puedan encomendarse a determinadas personas naturales","Apoyar jurídicamente la ejecución de las acciones requeridas para la depuración de las actuaciones administrativas que cursan en la Alcaldía Local.","Inversión","Un nuevo contrato social y ambiental para la Bogotá del Siglo XXI",57,{"$f":"IF(ISERROR(VLOOKUP(K156,[2]Proposito_programa!$C$2:$E$59,2,FALSE)),\" \",VLOOKUP(K156,[2]Proposito_programa!$C$2:$E$59,2,FALSE))","v":"Gestión pública local"},{"$f":"IF(ISERROR(VLOOKUP(K156,[2]Proposito_programa!$C$2:$E$59,3,FALSE)),\" \",VLOOKUP(K156,[2]Proposito_programa!$C$2:$E$59,3,FALSE))","v":"Propósito 5: Construir Bogotá - Región con gobierno abierto, transparente y ciudadanía consciente"},1841,null,79937933,"HERNANDO ELIAS GARCÍA VARGAS","Persona Natural",null,null,null,null,18400000,0,1,9200000,27600000,27600000,"2022-01-27","2022-02-02","2022-08-01",120,1,60,null,null,null,null,"Terminado",1]
[143,2022,"FDLCH-CPS-143-2022","https://community.secop.gov.co/Public/Tendering/OpportunityDetail/Index?noticeUID=CO1.NTC.2779034&isFromPublicArea=True&isModal=true&asPopupView=true","Contratos de prestación de servicios profesionales y de apoyo a la gestión","Contratación directa","Prestación de servicios profesionales y de apoyo a la gestión, o para la ejecución de trabajos artísticos que sólo puedan encomendarse a determinadas personas naturales","Prestar servicios de apoyo a la gestión para asistir administrativamente al área de gestión del Desarrollo de la Localidad de Chapinero.","Inversión","Un nuevo contrato social y ambiental para la Bogotá del Siglo XXI",57,{"$f":"IF(ISERROR(VLOOKUP(K157,[2]Proposito_programa!$C$2:$E$59,2,FALSE)),\" \",VLOOKUP(K157,[2]Proposito_programa!$C$2:$E$59,2,FALSE))","v":"Gestión pública local"},{"$f":"IF(ISERROR(VLOOKUP(K157,[2]Proposito_programa!$C$2:$E$59,3,FALSE)),\" \",VLOOKUP(K157,[2]Proposito_programa!$C$2:$E$59,3,FALSE))","v":"Propósito 5: Construir Bogotá - Región con gobierno abierto, transparente y ciudadanía consciente"},1741,null,1024577383,"CRISTIAM DAVID ESTUPIÑAN RODRIGUEZ","Persona Natural",null,null,null,null,8800000,0,1,4400000,13200000,13200000,"2022-01-28","2022-02-02","2022-08-01",120,1,60,null,null,null,null,"Terminado",1]
[144,2022,"FDLCH-CPS-144-2022","https://community.secop.gov.co/Public/Tendering/OpportunityDetail/Index?noticeUID=CO1.NTC.2777999&isFromPublicArea=True&isModal=true&asPopupView=true","Contratos de prestación de servicios profesionales y de apoyo a la gestión","Contratación directa","Prestación de servicios profesionales y de apoyo a la gestión, o para la ejecución de trabajos artísticos que sólo puedan encomendarse a determinadas personas naturales","Prestar servicios de apoyo a la gestión para desarrollar las actividades de radicación, gestión de correspondencia y de la documentación que expide, se allega y controla de la Alcaldía Local de Chapinero.","Inversión","Un nuevo contrato social y ambiental para la Bogotá del Siglo XXI",57,{"$f":"IF(ISERROR(VLOOKUP(K158,[2]Proposito_programa!$C$2:$E$59,2,FALSE)),\" \",VLOOKUP(K158,[2]Proposito_programa!$C$2:$E$59,2,FALSE))","v":"Gestión pública local"},{"$f":"IF(ISERROR(VLOOKUP(K158,[2]Proposito_programa!$C$2:$E$59,3,FALSE)),\" \",VLOOKUP(K158,[2]Proposito_programa!$C$2:$E$59,3,FALSE))","v":"Propósito 5: Construir Bogotá - Región con gobierno abierto, transparente y ciudadanía consciente"},1741,null,79638358,"HERNANDO FERNEY QUIROGA ARIZA ","Persona Natural",null,null,null,null,{"$f":"8000000+7133333","v":15133333},-7133333,1,4000000,12000000,12000000,"2022-01-28","2022-02-02","2022-08-01",120,1,60,52603721,"SANDRA MILENA RODRIGUEZ SASTOQUE","2022-02-14",7133333,"Terminado",1]
[145,2022,"FDLCH-CPS-145-2022","https://community.secop.gov.co/Public/Tendering/OpportunityDetail/Index?noticeUID=CO1.NTC.2784026&isFromPublicArea=True&isModal=true&asPopupView=true","Contratos de prestación de servicios profesionales y de apoyo a la gestión","Contratación directa","Prestación de servicios profesionales y de apoyo a la gestión, o para la ejecución de trabajos artísticos que sólo puedan encomendarse a determinadas personas naturales","Prestar servicios profesionales para apoyar técnicamente las distintas etapas de los procesos de competencia de las inspecciones de policía de la localidad de chapinero según reparto.","Inversión","Un nuevo contrato social y ambiental para la Bogotá del Siglo XXI",57,{"$f":"IF(ISERROR(VLOOKUP(K159,[2]Proposito_programa!$C$2:$E$59,2,FALSE)),\" \",VLOOKUP(K159,[2]Proposito_programa!$C$2:$E$59,2,FALSE))","v":"Gestión pública local"},{"$f":"IF(ISERROR(VLOOKUP(K159,[2]Proposito_programa!$C$2:$E$59,3,FALSE)),\" \",VLOOKUP(K159,[2]Proposito_programa!$C$2:$E$59,3,FALSE))","v":"Propósito 5: Construir Bogotá - Región con gobierno abierto, transparente y ciudadanía consciente"},1841,null,82393070,"EDSON ANDRES RINCON RAMIREZ","Persona Natural",null,null,null,null,25900000,0,null,null,25900000,25900000,"2022-01-28","2022-02-02","2022-07-01",150,null,null,null,null,null,null,"Terminado",1]
[146,2022,"FDLCH-CPS-146-2022","https://community.secop.gov.co/Public/Tendering/OpportunityDetail/Index?noticeUID=CO1.NTC.2785318&isFromPublicArea=True&isModal=true&asPopupView=true","Contratos de prestación de servicios profesionales y de apoyo a la gestión","Contratación directa","Prestación de servicios profesionales y de apoyo a la gestión, o para la ejecución de trabajos artísticos que sólo puedan encomendarse a determinadas personas naturales","Prestar servicios asistenciales de apoyo para la gestión y desarrollo del proyecto de inversión No. 1827 \"Chapinero rural y productivo\".","Inversión","Un nuevo contrato social y ambiental para la Bogotá del Siglo XXI",23,{"$f":"IF(ISERROR(VLOOKUP(K160,[2]Proposito_programa!$C$2:$E$59,2,FALSE)),\" \",VLOOKUP(K160,[2]Proposito_programa!$C$2:$E$59,2,FALSE))","v":"Bogotá rural"},{"$f":"IF(ISERROR(VLOOKUP(K160,[2]Proposito_programa!$C$2:$E$59,3,FALSE)),\" \",VLOOKUP(K160,[2]Proposito_programa!$C$2:$E$59,3,FALSE))","v":"Propósito 1: Hacer un nuevo contrato social para incrementar la inclusión social, productiva y política"},1827,null,52909131,"REINA DAYANIRA ALVIS MELGAREJO","Persona Natural",null,null,null,null,7520000,0,1,3760000,11280000,11280000,"2022-01-28","2022-02-02","2022-08-01",120,1,60,null,null,null,null,"Terminado",1]
[147,2022,"FDLCH-CPS-147-2022","https://community.secop.gov.co/Public/Tendering/OpportunityDetail/Index?noticeUID=CO1.NTC.2782918&isFromPublicArea=True&isModal=true&asPopupView=true","Contratos de prestación de servicios profesionales y de apoyo a la gestión","Contratación directa","Prestación de servicios profesionales y de apoyo a la gestión, o para la ejecución de trabajos artísticos que sólo puedan encomendarse a determinadas personas naturales","Prestar los servicios profesionales de apoyo jurídico en la ejecución de las acciones requeridas para el trámite e impulso procesal de las actuaciones, contravenciones y/o querellas que cursen en las inspecciones de policia de la Localidad.","Inversión","Un nuevo contrato social y ambiental para la Bogotá del Siglo XXI",57,{"$f":"IF(ISERROR(VLOOKUP(K161,[2]Proposito_programa!$C$2:$E$59,2,FALSE)),\" \",VLOOKUP(K161,[2]Proposito_programa!$C$2:$E$59,2,FALSE))","v":"Gestión pública local"},{"$f":"IF(ISERROR(VLOOKUP(K161,[2]Proposito_programa!$C$2:$E$59,3,FALSE)),\" \",VLOOKUP(K161,[2]Proposito_programa!$C$2:$E$59,3,FALSE))","v":"Propósito 5: Construir Bogotá - Región con gobierno abierto, transparente y ciudadanía consciente"},1841,null," 1020727657","ANGELICA ALONSO DUEÑAS","Persona Natural",null,null,null,null,18400000,0,null,null,18400000,18400000,"2022-01-28","2022-02-02","2022-06-01",120,null,null,null,null,null,null,"Terminado",1]
[74,2021,"FDLCH-CCBM-074-2021","https://community.secop.gov.co/Public/Tendering/OpportunityDetail/Index?noticeUID=CO1.NTC.1834562&isFromPublicArea=True&isModal=False","Contratos de prestación de servicios","Selección abreviada","Selección abreviada por menor cuantía ","La adquisición a traves de la BMC - BOLSA MERCANTIL DE COLOMBIA S.A del servicio de vigilancia y seguridas privada integral permanente en la modalidad fija para protección y cuidado de los funcionarios, usuarios y todos los bienes muebles e inmuebles de propiedad o en custodia del Fondo de Desarrollo Local de Chapinero y todos aquellos d elos que llegare a adquirir.","Funcionamiento","Un nuevo contrato social y ambiental para la Bogotá del Siglo XXI","No aplica",{"$f":"IF(ISERROR(VLOOKUP(K162,Proposito_programa!$C$2:$E$59,2,FALSE)),\" \",VLOOKUP(K162,Proposito_programa!$C$2:$E$59,2,FALSE))","v":" "},{"$f":"IF(ISERROR(VLOOKUP(K162,Proposito_programa!$C$2:$E$59,3,FALSE)),\" \",VLOOKUP(K162,Proposito_programa!$C$2:$E$59,3,FALSE))","v":" "},null,null,805000867,"CORREAGRO SA","Persona Jurídica",null,null,null,null,null,null,null,29791766,29791766,29791766,"2022-06-07","2020-10-19",null,null,null,null,null,null,null,null,"Terminado",1]
[149,2022,"FDLCH-CPS-149-2022","https://community.secop.gov.co/Public/Tendering/OpportunityDetail/Index?noticeUID=CO1.NTC.2892481&isFromPublicArea=True&isModal=true&asPopupView=true","Contratos de prestación de servicios","Contratación mínima cuantia","No aplica","Prestar los servicios y elementos logísticos para apoyar actividades físicas y deportivas que desarrolle el Fondo de Desarrollo Local de Chapinero","Inversión","Un nuevo contrato social y ambiental para la Bogotá del Siglo XXI",20,{"$f":"IF(ISERROR(VLOOKUP(K163,[2]Proposito_programa!$C$2:$E$59,2,FALSE)),\" \",VLOOKUP(K163,[2]Proposito_programa!$C$2:$E$59,2,FALSE))","v":"Bogotá, referente en cultura, deporte, recreación y actividad física, con parques para el desarrollo y la salud"},{"$f":"IF(ISERROR(VLOOKUP(K163,[2]Proposito_programa!$C$2:$E$59,3,FALSE)),\" \",VLOOKUP(K163,[2]Proposito_programa!$C$2:$E$59,3,FALSE))","v":"Propósito 1: Hacer un nuevo contrato social para incrementar la inclusión social, productiva y política"},1845,3,830133329,"FUNDACION PARA EL DESARROLLO SOCIOCULTURAL DEPORTIVO Y COMUNITARIO FUNDESCO","Persona Jurídica",null,null,null,null,27000000,0,null,null,27000000,19460000,"2022-04-21","2022-04-22","2022-10-21",180,null,null,null,null,null,null,"Terminado",1]
[88,2021,"FDLCH-CSE-088-2021","https://community.secop.gov.co/Public/Tendering/OpportunityDetail/Index?noticeUID=CO1.NTC.1823951&isFromPublicArea=True&isModal=False","Seguros","Selección abreviada","Selección abreviada por menor cuantía ","Contratar los seguros que amparen los intereses patrimoniales actuales y futuros, así como los bienes de propiedad del Fondo de Desarrollo Locla de Chapinero, que esten bajo su responsabilidad y custodia y aquellos que sean adquiridos para desarrollar las funciones inherentes a su actuvidad asi coo cualquier otra póliza de seguros que requiera la entidad en el desarrollo de su actividad.","Funcionamiento","Un nuevo contrato social y ambiental para la Bogotá del Siglo XXI","No aplica",{"$f":"IF(ISERROR(VLOOKUP(K164,Proposito_programa!$C$2:$E$59,2,FALSE)),\" \",VLOOKUP(K164,Proposito_programa!$C$2:$E$59,2,FALSE))","v":" "},{"$f":"IF(ISERROR(VLOOKUP(K164,Proposito_programa!$C$2:$E$59,3,FALSE)),\" \",VLOOKUP(K164,Proposito_programa!$C$2:$E$59,3,FALSE))","v":" "},null,1,891700037,"MAPFRE SEGUROS GENERALES DE COLOMBIA SA","Persona Jurídica",null,null,null,null,null,null,null,3279437,3279437,0,"2022-04-29","2021-03-30",null,null,null,null,null,null,null,null,"Terminado",1]
[139,2022,"FDLCH-CAR-139-2022","https://community.secop.gov.co/Public/Tendering/OpportunityDetail/Index?noticeUID=CO1.NTC.2775074&isFromPublicArea=True&isModal=true&asPopupView=true","Arrendamiento de inmuebles","Contratación directa","Prestación de servicios profesionales y de apoyo a la gestión, o para la ejecución de trabajos artísticos que sólo puedan encomendarse a determinadas personas naturales","Contratar en arriendo una bodega con el propósito de guardar los elementos decomisados durante losoperativos de control de espacio público adelantados por la Alcaldía Local de Chapinero.","Funcionamiento","Un nuevo contrato social y ambiental para la Bogotá del Siglo XXI","No aplica",{"$f":"IF(ISERROR(VLOOKUP(K165,[2]Proposito_programa!$C$2:$E$59,2,FALSE)),\" \",VLOOKUP(K165,[2]Proposito_programa!$C$2:$E$59,2,FALSE))","v":" "},{"$f":"IF(ISERROR(VLOOKUP(K165,[2]Proposito_programa!$C$2:$E$59,3,FALSE)),\" \",VLOOKUP(K165,[2]Proposito_programa!$C$2:$E$59,3,FALSE))","v":" "},null,null,20185010,"ANA GRACIELA GALAN","Persona Natural",null,null,null,null,54450000,0,1,9900000,64350000,49500000,"2022-01-28","2022-01-28","27/02/2023",330,1,60,null,null,null,null,"Terminado",1]
[148,2022,"FDLCH-CPS-148-2022","https://colombiacompra.gov.co/tienda-virtual-del-estado-colombiano/ordenes-compra/85280","Seguros","Selección abreviada","Selección abreviada por menor cuantía ","Adquirir el seguro obligatorio de accidente de transito (SOAT) para el parque automotor de la Alcaldía Local de Chapinero.","Funcionamiento","Un nuevo contrato social y ambiental para la Bogotá del Siglo XXI","No aplica",{"$f":"IF(ISERROR(VLOOKUP(K166,[2]Proposito_programa!$C$2:$E$59,2,FALSE)),\" \",VLOOKUP(K166,[2]Proposito_programa!$C$2:$E$59,2,FALSE))","v":" "},{"$f":"IF(ISERROR(VLOOKUP(K166,[2]Proposito_programa!$C$2:$E$59,3,FALSE)),\" \",VLOOKUP(K166,[2]Proposito_programa!$C$2:$E$59,3,FALSE))","v":" "},null,null,"860037013","COMPAÑIA MUNDIAL DE SEGUROS SA","Persona Natural",null,null,null,null,5124096,-54576,null,null,5069520,5069520,"2022-02-15","2022-02-17","2022-03-03",30,null,null,null,null,null,null,"Liquidado",1]
[153,2022,"FDLCH-CPS-153-2022","https://community.secop.gov.co/Public/Tendering/OpportunityDetail/Index?noticeUID=CO1.NTC.2951756&isFromPublicArea=True&isModal=true&asPopupView=true","Contratos de prestación de servicios","Selección abreviada","Selección abreviada por menor cuantía ","Prestar servicios para realizar la ejecución de las escuelas de formación deportiva de la Localidad de Chapinero.","Inversión","Un nuevo contrato social y ambiental para la Bogotá del Siglo XXI",20,{"$f":"IF(ISERROR(VLOOKUP(K167,[2]Proposito_programa!$C$2:$E$59,2,FALSE)),\" \",VLOOKUP(K167,[2]Proposito_programa!$C$2:$E$59,2,FALSE))","v":"Bogotá, referente en cultura, deporte, recreación y actividad física, con parques para el desarrollo y la salud"},{"$f":"IF(ISERROR(VLOOKUP(K167,[2]Proposito_programa!$C$2:$E$59,3,FALSE)),\" \",VLOOKUP(K167,[2]Proposito_programa!$C$2:$E$59,3,FALSE))","v":"Propósito 1: Hacer un nuevo contrato social para incrementar la inclusión social, productiva y política"},1845,4,900094963,"FUNDACION PARA EL DESARROLLO INFANTIL SOCIAL Y CULTURAL IWOKE","Persona Jurídica",null,null,null,null,258914320,0,null,null,258914320,51782864,"2022-06-08","2022-06-13","2023-02-12",240,null,null,null,null,null,null,"En ejecución",0.85]
[154,2022,"FDLCH-CIA-154-2022","https://www.contratos.gov.co/consultas/detalleProceso.do?numConstancia=22-22-37942&g-recaptcha-response=03ANYolqu6VqecP1MwkAsm4oCC6DyH_o_e8rrAkpp9UHN6n7LnqymaIDtZAxfhA3ZIicq7mzK3C8u9ukPpQ5i7O_1sZmGmySGf1cSjRrtZlht-tZ3_wgs9e7FRMDgbI5KAm0m-VWIBDFfzrdIrtqVRMD9AlxrkBMlvIllmBQB1psFz5idGKCISENlfvvq57Afp5kPzcikS-h2nLp2B9tQA6eZVmeWG23HmDbbJLreVEdQPJw_aC17Rb4XozmhCWPmdRUyuw1PxpZGkYucOUt3jEpd9_5VvJOBLAmLUq-DzKdIQ83jtLA3dwB54-jPraSPNl_KI5OcAq0guRLqTVsn8FSjD-XstFioG0kjPdOVgEBmJUalM56H4W7goAphkWX7hapFGbmz6TV6ON94Pkij9UmEelDjUIPxYlA9yN_Rja6sKUf7knyQT7vyE3_5bo4HtemGrCuQ7sssYtORQFVQhWRGM0LO1n8puOs0ByzCfbOYDIdVGY-b-Rx_CQ6H91XqdC8NR9d4QHv5QhWA9YkO9ODxjC6jllqYj-g","Convenios/Contratos interadministrativos","Contratación directa","Contratos interadministrativos","Aunar esfuerzos técnicos, administrativos y financieros con el fin de desarrollar acciones articuladas entre la SCRD, el IDARTES y los Fondos de Desarrollo Local, orientadas a fomentar procesos de formación, cualificación, fortalecimiento de los agentes culturales territoriales del Distrito Capital, en el marco de la generación y circulación de bienes y servicios culturales, artísticos y patrimoniales, de conformidad con las iniciativas priorizadas y concertadas en la estrategia Distrital \"Presupuestos Participativos\" y/o de las concertaciones con los grupos de interés de las localidades y a las acciones adelantadas en el “Proceso Misional de Fomento”, de acuerdo con los proyectos a ejecutar asociados a las metas de cada localidad en el programa \"Es Cultura Local 2022\".","Inversión","Un nuevo contrato social y ambiental para la Bogotá del Siglo XXI",21,{"$f":"IF(ISERROR(VLOOKUP(K168,[2]Proposito_programa!$C$2:$E$59,2,FALSE)),\" \",VLOOKUP(K168,[2]Proposito_programa!$C$2:$E$59,2,FALSE))","v":"Creación y vida cotidiana: Apropiación ciudadana del arte, la cultura y el patrimonio, para la democracia cultural"},{"$f":"IF(ISERROR(VLOOKUP(K168,[2]Proposito_programa!$C$2:$E$59,3,FALSE)),\" \",VLOOKUP(K168,[2]Proposito_programa!$C$2:$E$59,3,FALSE))","v":"Propósito 1: Hacer un nuevo contrato social para incrementar la inclusión social, productiva y política"},1848,null,899999061,"SECRETARIA DE CULTURA, RECREACION Y DEPORTE-SCRD","Persona Jurídica",null,null,null,null,490000000,0,null,null,490000000,483552000,"2022-07-08","2022-07-19","2023-08-31",360,null,null,null,null,null,null,"En ejecución",0.5]
[150,2022,"FDLCH-CS-150-2022","https://community.secop.gov.co/Public/Tendering/OpportunityDetail/Index?noticeUID=CO1.NTC.2901139&isFromPublicArea=True&isModal=true&asPopupView=true","Seguros","Selección abreviada","Selección abreviada por menor cuantía ","Contratar los seguros que amparen los intereses patrimoniales actuales y futuros así como los bienes de propiedad del Fondo de Desarrollo Local de Chapinero que estén bajo su responsabilidad y custodia y aquellos que sean adquiridos para desarrollar las funciones inherentes a su actividad así como cualquier otra póliza de seguros que requiera la entidad en el desarrollo de su actividad.","Funcionamiento","Un nuevo contrato social y ambiental para la Bogotá del Siglo XXI","No aplica",{"$f":"IF(ISERROR(VLOOKUP(K169,[2]Proposito_programa!$C$2:$E$59,2,FALSE)),\" \",VLOOKUP(K169,[2]Proposito_programa!$C$2:$E$59,2,FALSE))","v":" "},{"$f":"IF(ISERROR(VLOOKUP(K169,[2]Proposito_programa!$C$2:$E$59,3,FALSE)),\" \",VLOOKUP(K169,[2]Proposito_programa!$C$2:$E$59,3,FALSE))","v":" "},null,null,860037013,"COMPAÑIA MUNDIAL DE SEGUROS SA","Persona Jurídica",null,null,null,null,6148110,0,null,null,6148110,6148110,"2022-04-29","2022-04-30","2023-06-16",360,null,null,null,null,null,null,"En ejecución",0.55000000000000004]
[151,2022,"FDLCH-CCBM-151-2022","https://community.secop.gov.co/Public/Tendering/OpportunityDetail/Index?noticeUID=CO1.NTC.2959926&isFromPublicArea=True&isModal=False","Contratos de prestación de servicios","Selección abreviada","Selección abreviada por menor cuantía ","LA ADQUISICION A TRAVES DE LA BOLSA MERCANTIL DE COLOMBIA S.A. - BMC DEL SERVICIO DE VIGILANCIA Y SEGURIDAD PRIVADA INTEGRAL PERMANENTE EN LAMODALIDAD FIJA PARA PROTECCIÓN Y CUIDADO DE LOS FUNCIONARIOS, USUARIOS YTODOS LOS BIENES MUEBLES E INMUEBLES DE PROPIEDAD O EN CUSTODIA DEL FONDO DE DESARROLLO LOCAL DE CHAPINERO Y DE TODOS AQUELLOS DE LOS QUE LLEGARE A ADQUIRIR.","Funcionamiento","Un nuevo contrato social y ambiental para la Bogotá del Siglo XXI","No aplica",{"$f":"IF(ISERROR(VLOOKUP(K170,[2]Proposito_programa!$C$2:$E$59,2,FALSE)),\" \",VLOOKUP(K170,[2]Proposito_programa!$C$2:$E$59,2,FALSE))","v":" "},{"$f":"IF(ISERROR(VLOOKUP(K170,[2]Proposito_programa!$C$2:$E$59,3,FALSE)),\" \",VLOOKUP(K170,[2]Proposito_programa!$C$2:$E$59,3,FALSE))","v":" "},null,null,891502104,"COMPAÑIA DE VIGILANCIA COVISUR DE COLOMBIA LTDA","Persona Jurídica",null,null,null,null,555941174,0,1,91517371,647458545,354495947,"2022-05-24","2022-06-08","2023-08-06",360,1,39,null,null,null,null,"En ejecución",0.5]
[158,2022,"FDLCH-CPS-158-2022","https://community.secop.gov.co/Public/Tendering/OpportunityDetail/Index?noticeUID=CO1.NTC.3010459&isFromPublicArea=True&isModal=true&asPopupView=true","Contratos de prestación de servicios","Selección abreviada","Selección abreviada por menor cuantía ","Prestar servicios para desarrollar los eventos de circulación artística, cultural y patrimonial de la Localidad de Chapinero.","Inversión","Un nuevo contrato social y ambiental para la Bogotá del Siglo XXI",21,{"$f":"IF(ISERROR(VLOOKUP(K171,[2]Proposito_programa!$C$2:$E$59,2,FALSE)),\" \",VLOOKUP(K171,[2]Proposito_programa!$C$2:$E$59,2,FALSE))","v":"Creación y vida cotidiana: Apropiación ciudadana del arte, la cultura y el patrimonio, para la democracia cultural"},{"$f":"IF(ISERROR(VLOOKUP(K171,[2]Proposito_programa!$C$2:$E$59,3,FALSE)),\" \",VLOOKUP(K171,[2]Proposito_programa!$C$2:$E$59,3,FALSE))","v":"Propósito 1: Hacer un nuevo contrato social para incrementar la inclusión social, productiva y política"},1848,5,830112276,"FUNDACION ESPACIOS DE VIDA","Persona Jurídica",null,null,null,null,260582932,0,null,null,260582932,208466346,"2022-07-28","2022-08-01","2023-02-28",210,null,null,null,null,null,null,"En ejecución",0.85]
[159,2022,"FDLCH-COP-159-2022","https://community.secop.gov.co/Public/Tendering/OpportunityDetail/Index?noticeUID=CO1.NTC.2977809&isFromPublicArea=True&isModal=true&asPopupView=true","Contratos de prestación de servicios","Licitación pública","No aplica","Ejecutar a monto agotable, por precios unitarios fijos obras y actividades para la conservación de la infraestructura vial, urbana de la Localidad de Chapinero, en Bogota DC","Inversión","Un nuevo contrato social y ambiental para la Bogotá del Siglo XXI",49,{"$f":"IF(ISERROR(VLOOKUP(K172,[2]Proposito_programa!$C$2:$E$59,2,FALSE)),\" \",VLOOKUP(K172,[2]Proposito_programa!$C$2:$E$59,2,FALSE))","v":"Movilidad segura, sostenible y accesible"},{"$f":"IF(ISERROR(VLOOKUP(K172,[2]Proposito_programa!$C$2:$E$59,3,FALSE)),\" \",VLOOKUP(K172,[2]Proposito_programa!$C$2:$E$59,3,FALSE))","v":"Propósito 4: Hacer de Bogotá Región un modelo de movilidad multimodal, incluyente y sostenible"},1734,5,901617716,"UT BRAPO","Persona Jurídica",null,null,null,null,3696922405,0,null,null,3696922405,0,"2022-08-05","2022-08-31","2023-03-29",210,null,null,null,null,null,null,"En ejecución",0.8]
[160,2022,"FDLCH-CPS-160-2022","https://community.secop.gov.co/Public/Tendering/OpportunityDetail/Index?noticeUID=CO1.NTC.3114911&isFromPublicArea=True&isModal=true&asPopupView=true","Contratos de prestación de servicios profesionales y de apoyo a la gestión","Contratación directa","Prestación de servicios profesionales y de apoyo a la gestión, o para la ejecución de trabajos artísticos que sólo puedan encomendarse a determinadas personas naturales","Prestar los servicios de apoyo a la gestión para la orientación de sesiones de actividad física musicalizada y no musicalizada en la localidad como del acompañamiento, atención y de ejecución de actividades recreo deportivas derivadas del proyecto de inversión \"Chapinero Epicentro del Deporte y a Recreación.","Inversión","Un nuevo contrato social y ambiental para la Bogotá del Siglo XXI",20,{"$f":"IF(ISERROR(VLOOKUP(K173,[2]Proposito_programa!$C$2:$E$59,2,FALSE)),\" \",VLOOKUP(K173,[2]Proposito_programa!$C$2:$E$59,2,FALSE))","v":"Bogotá, referente en cultura, deporte, recreación y actividad física, con parques para el desarrollo y la salud"},{"$f":"IF(ISERROR(VLOOKUP(K173,[2]Proposito_programa!$C$2:$E$59,3,FALSE)),\" \",VLOOKUP(K173,[2]Proposito_programa!$C$2:$E$59,3,FALSE))","v":"Propósito 1: Hacer un nuevo contrato social para incrementar la inclusión social, productiva y política"},1845,null,1018432468,"EDISON FABIAN LEON LEON","Persona Natural",null,null,null,null,13700000,0,1,6850000,20550000,11690667,"2022-08-05","2022-08-08","2023-01-07",150,1,75,null,null,null,null,"Terminado",1]
[161,2022,"FDLCH-CPS-161-2022","https://community.secop.gov.co/Public/Tendering/OpportunityDetail/Index?noticeUID=CO1.NTC.3236992&isFromPublicArea=True&isModal=true&asPopupView=true","Contratos de prestación de servicios profesionales y de apoyo a la gestión","Contratación directa","Prestación de servicios profesionales y de apoyo a la gestión, o para la ejecución de trabajos artísticos que sólo puedan encomendarse a determinadas personas naturales","Prestar servicios técnicos para apoyo a la gestión, formulación, desarrollo y seguimiento del proyecto de inversión No.1731 \"CHAPINERO DEJANDO HUELLA POR LOS ANIMALES\".","Inversión","Un nuevo contrato social y ambiental para la Bogotá del Siglo XXI",34,{"$f":"IF(ISERROR(VLOOKUP(K174,[2]Proposito_programa!$C$2:$E$59,2,FALSE)),\" \",VLOOKUP(K174,[2]Proposito_programa!$C$2:$E$59,2,FALSE))","v":"Bogotá protectora de los animales"},{"$f":"IF(ISERROR(VLOOKUP(K174,[2]Proposito_programa!$C$2:$E$59,3,FALSE)),\" \",VLOOKUP(K174,[2]Proposito_programa!$C$2:$E$59,3,FALSE))","v":"Propósito 2 : Cambiar Nuestros Hábitos de Vida para Reverdecer a Bogotá y Adaptarnos y Mitigar la Crisis Climática"},1731,null,1022411110,"VERONICA SIMONA MARTINEZ AREVALO","Persona Natural",null,null,null,null,14000000,0,null,null,14000000,7373333,"2022-09-05","2022-09-12","2023-02-11",150,null,null,null,null,null,null,"En ejecución",0.85]
[162,2022,"FDLCH-CPS-162-2022","https://community.secop.gov.co/Public/Tendering/OpportunityDetail/Index?noticeUID=CO1.NTC.3116913&isFromPublicArea=True&isModal=true&asPopupView=true","Contratos de prestación de servicios profesionales y de apoyo a la gestión","Contratación directa","Prestación de servicios profesionales y de apoyo a la gestión, o para la ejecución de trabajos artísticos que sólo puedan encomendarse a determinadas personas naturales","Apoyar jurídicamente la ejecución de las acciones requeridas para la depuración de las actuaciones administrativas que cursan en la Alcaldía Local.","Inversión","Un nuevo contrato social y ambiental para la Bogotá del Siglo XXI",57,{"$f":"IF(ISERROR(VLOOKUP(K175,[2]Proposito_programa!$C$2:$E$59,2,FALSE)),\" \",VLOOKUP(K175,[2]Proposito_programa!$C$2:$E$59,2,FALSE))","v":"Gestión pública local"},{"$f":"IF(ISERROR(VLOOKUP(K175,[2]Proposito_programa!$C$2:$E$59,3,FALSE)),\" \",VLOOKUP(K175,[2]Proposito_programa!$C$2:$E$59,3,FALSE))","v":"Propósito 5: Construir Bogotá - Región con gobierno abierto, transparente y ciudadanía consciente"},1841,null,79937933,"HERNANDO ELIAS GARCIA VARGAS","Persona Natural",null,null,null,null,23000000,0,null,null,23000000,17326667,"2022-08-05","2022-08-08","2023-01-07",150,null,null,null,null,null,null,"Terminado",1]
[163,2022,"FDLCH-CPS-163-2022","https://community.secop.gov.co/Public/Tendering/OpportunityDetail/Index?noticeUID=CO1.NTC.3115465&isFromPublicArea=True&isModal=true&asPopupView=true","Contratos de prestación de servicios profesionales y de apoyo a la gestión","Contratación directa","Prestación de servicios profesionales y de apoyo a la gestión, o para la ejecución de trabajos artísticos que sólo puedan encomendarse a determinadas personas naturales","Prestación de servicios de apoyo en la gestión de los asuntos relacionados con la comunicación ciudadana para la seguridad ciudadana, la convivencia y la prevención de conflictividades, violencias y delitos en la localidad de Chapinero, en el marco del proyecto \"Chapinero promueve y genera confianza ciudadana\".","Inversión","Un nuevo contrato social y ambiental para la Bogotá del Siglo XXI",43,{"$f":"IF(ISERROR(VLOOKUP(K176,[2]Proposito_programa!$C$2:$E$59,2,FALSE)),\" \",VLOOKUP(K176,[2]Proposito_programa!$C$2:$E$59,2,FALSE))","v":"Cultura ciudadana para la confianza, la convivencia y la participación desde la vida cotidiana"},{"$f":"IF(ISERROR(VLOOKUP(K176,[2]Proposito_programa!$C$2:$E$59,3,FALSE)),\" \",VLOOKUP(K176,[2]Proposito_programa!$C$2:$E$59,3,FALSE))","v":"Propósito 3: Inspirar confianza y legitimidad para vivir sin miedo y ser epicentro de cultura ciudadana, paz y reconciliación"},1735,null,51646432,"MARTHA PATRICIA MUÑOZ RUIZ","Persona Natural",null,null,null,null,13630000,0,null,null,13630000,11630933,"2022-08-08","2022-08-08","2023-01-07",150,null,null,null,null,null,null,"Terminado",1]
[164,2022,"FDLCH-CPS-164-2022","https://community.secop.gov.co/Public/Tendering/OpportunityDetail/Index?noticeUID=CO1.NTC.3124670&isFromPublicArea=True&isModal=true&asPopupView=true","Contratos de prestación de servicios profesionales y de apoyo a la gestión","Contratación directa","Prestación de servicios profesionales y de apoyo a la gestión, o para la ejecución de trabajos artísticos que sólo puedan encomendarse a determinadas personas naturales","Prestar servicios profesionales para el apoyo a la gestión y la articulación de las acciones de inspección, vigilancia y control requeridas por la Alcaldía local de Chapinero en el marco de la normatividad vigente.","Inversión","Un nuevo contrato social y ambiental para la Bogotá del Siglo XXI",57,{"$f":"IF(ISERROR(VLOOKUP(K177,[2]Proposito_programa!$C$2:$E$59,2,FALSE)),\" \",VLOOKUP(K177,[2]Proposito_programa!$C$2:$E$59,2,FALSE))","v":"Gestión pública local"},{"$f":"IF(ISERROR(VLOOKUP(K177,[2]Proposito_programa!$C$2:$E$59,3,FALSE)),\" \",VLOOKUP(K177,[2]Proposito_programa!$C$2:$E$59,3,FALSE))","v":"Propósito 5: Construir Bogotá - Región con gobierno abierto, transparente y ciudadanía consciente"},1841,null,79053156,"PEDRO JAVIER ORTEGON PINILLA","Persona Natural",null,null,null,null,24000000,0,1,9000000,33000000,22200000,"2022-08-09","2022-08-10","2023-01-24",120,1,45,null,null,null,null,"En ejecución",0.9]
[165,2022,"FDLCH-CPS-165-2022","https://community.secop.gov.co/Public/Tendering/OpportunityDetail/Index?noticeUID=CO1.NTC.3116397&isFromPublicArea=True&isModal=true&asPopupView=true","Contratos de prestación de servicios profesionales y de apoyo a la gestión","Contratación directa","Prestación de servicios profesionales y de apoyo a la gestión, o para la ejecución de trabajos artísticos que sólo puedan encomendarse a determinadas personas naturales","Prestar servicios de apoyo a la gestión para el desarrollo de estrategias que promuevan la prevención, atención de la violencia intrafamiliar y sexual y la eliminación de las violencias basadas en género en el marco del programa sistema distrital de cuidado.","Inversión","Un nuevo contrato social y ambiental para la Bogotá del Siglo XXI",6,{"$f":"IF(ISERROR(VLOOKUP(K178,[2]Proposito_programa!$C$2:$E$59,2,FALSE)),\" \",VLOOKUP(K178,[2]Proposito_programa!$C$2:$E$59,2,FALSE))","v":"Sistema Distrital de Cuidado"},{"$f":"IF(ISERROR(VLOOKUP(K178,[2]Proposito_programa!$C$2:$E$59,3,FALSE)),\" \",VLOOKUP(K178,[2]Proposito_programa!$C$2:$E$59,3,FALSE))","v":"Propósito 1: Hacer un nuevo contrato social para incrementar la inclusión social, productiva y política"},1710,null,52150992,"NURY ALEXANDRA HERNANDEZ PIRAJAN","Persona Natural",null,null,null,null,10800000,0,1,810000,11610000,11610000,"2022-08-05","2022-08-08","19/12/2022",120,1,9,null,null,null,null,"Terminado",1]
[152,2022,"FDLCH-CS-152-2022","https://community.secop.gov.co/Public/Tendering/OpportunityDetail/Index?noticeUID=CO1.NTC.2939316&isFromPublicArea=True&isModal=true&asPopupView=true","Seguros","Selección abreviada","Selección abreviada por menor cuantía ","Contratar los seguros que amparen los intereses patrimoniales actuales y futuros así como los bienes de propiedad del Fondo de Desarrollo Local de Chapinero que esten bajo su responsabilidad y costodia y aquellos que sean adquiridos para desarrollar las funciones inherentes a su actividad.","Funcionamiento","Un nuevo contrato social y ambiental para la Bogotá del Siglo XXI","No aplica",{"$f":"IF(ISERROR(VLOOKUP(K179,[2]Proposito_programa!$C$2:$E$59,2,FALSE)),\" \",VLOOKUP(K179,[2]Proposito_programa!$C$2:$E$59,2,FALSE))","v":" "},{"$f":"IF(ISERROR(VLOOKUP(K179,[2]Proposito_programa!$C$2:$E$59,3,FALSE)),\" \",VLOOKUP(K179,[2]Proposito_programa!$C$2:$E$59,3,FALSE))","v":" "},null,2,860002184,"AXA COLPATRIA SEGUROS SA","Persona Jurídica",null,null,null,null,53937538,0,null,null,53937538,48937538,"2022-05-27","2022-05-30","2023-09-03",450,null,null,null,null,null,null,"En ejecución",0.5]
[155,2022,"FDLCH-CPS-155-2022","https://colombiacompra.gov.co/tienda-virtual-del-estado-colombiano/ordenes-compra/92908","Contratos de prestación de servicios","Selección abreviada","Acuerdo marco de precios ","Contratar el servicio Software por catálogo el cual permite la adquisición de bienes y servicios para la Alcaldía Local de Chapinero","Funcionamiento","Un nuevo contrato social y ambiental para la Bogotá del Siglo XXI","No aplica",{"$f":"IF(ISERROR(VLOOKUP(K180,[2]Proposito_programa!$C$2:$E$59,2,FALSE)),\" \",VLOOKUP(K180,[2]Proposito_programa!$C$2:$E$59,2,FALSE))","v":" "},{"$f":"IF(ISERROR(VLOOKUP(K180,[2]Proposito_programa!$C$2:$E$59,3,FALSE)),\" \",VLOOKUP(K180,[2]Proposito_programa!$C$2:$E$59,3,FALSE))","v":" "},null,null,901399373,"LA UNION TEMPORAL DELL EMC","Persona Jurídica",null,null,null,null,125006400,0,null,null,125006400,125006400,"2022-07-05","2022-07-05","2022-08-04",30,null,null,null,null,null,null,"Terminado",1]
[167,2022,"FDLCH-CPS-167-2022","https://community.secop.gov.co/Public/Tendering/OpportunityDetail/Index?noticeUID=CO1.NTC.3125002&isFromPublicArea=True&isModal=true&asPopupView=true","Contratos de prestación de servicios profesionales y de apoyo a la gestión","Contratación directa","Prestación de servicios profesionales y de apoyo a la gestión, o para la ejecución de trabajos artísticos que sólo puedan encomendarse a determinadas personas naturales","Prestar servicios profesionales para la gestión, formulación, desarrollo, seguimiento y evaluación del Proyecto “Chapinero territorio para vivir sin miedo","Inversión","Un nuevo contrato social y ambiental para la Bogotá del Siglo XXI",48,{"$f":"IF(ISERROR(VLOOKUP(K181,[2]Proposito_programa!$C$2:$E$59,2,FALSE)),\" \",VLOOKUP(K181,[2]Proposito_programa!$C$2:$E$59,2,FALSE))","v":"Plataforma institucional para la seguridad y justicia"},{"$f":"IF(ISERROR(VLOOKUP(K181,[2]Proposito_programa!$C$2:$E$59,3,FALSE)),\" \",VLOOKUP(K181,[2]Proposito_programa!$C$2:$E$59,3,FALSE))","v":"Propósito 3: Inspirar confianza y legitimidad para vivir sin miedo y ser epicentro de cultura ciudadana, paz y reconciliación"},1740,null,52904967,"ANGELA CRISTINA CARVAJAL TOVAR","Persona Natural",null,null,null,null,22800000,0,1,5700000,28500000,24130000,"2022-08-09","2022-08-09","2023-01-08",120,1,30,null,null,null,null,"Terminado",1]
[169,2022,"FDLCH-CPS-169-2022","https://community.secop.gov.co/Public/Tendering/OpportunityDetail/Index?noticeUID=CO1.NTC.3127835&isFromPublicArea=True&isModal=true&asPopupView=true","Contratos de prestación de servicios profesionales y de apoyo a la gestión","Contratación directa","Prestación de servicios profesionales y de apoyo a la gestión, o para la ejecución de trabajos artísticos que sólo puedan encomendarse a determinadas personas naturales","Prestar los servicios de apoyo a la gestión en la implementación, atención, verificación, soporte y acompañamiento de los procesos y/o actuaciones administrativas de registro y seguimiento a la propiedad horizontal en los aplicativos y/o herramientas virutales en la Localidad de Chapinero.","Inversión","Un nuevo contrato social y ambiental para la Bogotá del Siglo XXI",57,{"$f":"IF(ISERROR(VLOOKUP(K182,[2]Proposito_programa!$C$2:$E$59,2,FALSE)),\" \",VLOOKUP(K182,[2]Proposito_programa!$C$2:$E$59,2,FALSE))","v":"Gestión pública local"},{"$f":"IF(ISERROR(VLOOKUP(K182,[2]Proposito_programa!$C$2:$E$59,3,FALSE)),\" \",VLOOKUP(K182,[2]Proposito_programa!$C$2:$E$59,3,FALSE))","v":"Propósito 5: Construir Bogotá - Región con gobierno abierto, transparente y ciudadanía consciente"},1741,null,1013639105,"ANDRES MAURICIO CONDE TOLEDO","Persona Natural",null,null,null,null,8800000,0,1,4400000,13200000,9240000,"2022-08-09","2022-08-10","2023-02-09",120,1,60,null,null,null,null,"En ejecución",0.85]
[170,2022,"FDLCH-CPS-170-2022","https://community.secop.gov.co/Public/Tendering/OpportunityDetail/Index?noticeUID=CO1.NTC.3146230&isFromPublicArea=True&isModal=true&asPopupView=true","Contratos de prestación de servicios profesionales y de apoyo a la gestión","Contratación directa","Prestación de servicios profesionales y de apoyo a la gestión, o para la ejecución de trabajos artísticos que sólo puedan encomendarse a determinadas personas naturales","Prestar los servicios profesionales para la operación  prestación  seguimiento y cumplimiento de los procedimientos administrativos  operativos y programáticos del servicio apoyo económico tipo c  que contribuyan a la garantía de los derechos de la población mayor en el marco de la política pública","Inversión","Un nuevo contrato social y ambiental para la Bogotá del Siglo XXI",1,{"$f":"IF(ISERROR(VLOOKUP(K183,[2]Proposito_programa!$C$2:$E$59,2,FALSE)),\" \",VLOOKUP(K183,[2]Proposito_programa!$C$2:$E$59,2,FALSE))","v":"Subsidios y transferencias para la equidad"},{"$f":"IF(ISERROR(VLOOKUP(K183,[2]Proposito_programa!$C$2:$E$59,3,FALSE)),\" \",VLOOKUP(K183,[2]Proposito_programa!$C$2:$E$59,3,FALSE))","v":"Propósito 1: Hacer un nuevo contrato social para incrementar la inclusión social, productiva y política"},1815,null,34984062,"ENITH DEL ROSARIO RUIZ PORRAS","Persona Natural",null,null,null,null,18400000,0,1,6900000,25300000,18400000,"2022-08-16","2022-08-16","2023-01-30",120,1,45,null,null,null,null,"En ejecución",0.9]
[171,2022,"FDLCH-CPS-171-2022","https://community.secop.gov.co/Public/Tendering/OpportunityDetail/Index?noticeUID=CO1.NTC.3146347&isFromPublicArea=True&isModal=true&asPopupView=true","Contratos de prestación de servicios profesionales y de apoyo a la gestión","Contratación directa","Prestación de servicios profesionales y de apoyo a la gestión, o para la ejecución de trabajos artísticos que sólo puedan encomendarse a determinadas personas naturales","Prestar servicios profesionales para apoyar técnicamente las actuaciones administrativas, impulso procesal y de inspección, vigilancia y control de competencia de la alcaldía local de chapinero","Inversión","Un nuevo contrato social y ambiental para la Bogotá del Siglo XXI",57,{"$f":"IF(ISERROR(VLOOKUP(K184,[2]Proposito_programa!$C$2:$E$59,2,FALSE)),\" \",VLOOKUP(K184,[2]Proposito_programa!$C$2:$E$59,2,FALSE))","v":"Gestión pública local"},{"$f":"IF(ISERROR(VLOOKUP(K184,[2]Proposito_programa!$C$2:$E$59,3,FALSE)),\" \",VLOOKUP(K184,[2]Proposito_programa!$C$2:$E$59,3,FALSE))","v":"Propósito 5: Construir Bogotá - Región con gobierno abierto, transparente y ciudadanía consciente"},1841,null,1074136017,"JUAN DAVID URREGO MESA","Persona Natural",null,null,null,null,18060000,0,1,9030000,27090000,17909500,"2022-08-16","2022-08-17","2023-02-16",120,1,60,null,null,null,null,"En ejecución",0.85]
[172,2022,"FDLCH-CIA-172-2022","https://community.secop.gov.co/Public/Tendering/OpportunityDetail/Index?noticeUID=CO1.NTC.3172436&isFromPublicArea=True&isModal=true&asPopupView=true","Convenios/Contratos interadministrativos","Contratación directa","Contratos interadministrativos","Aunar esfuerzos técnicos, administrativos, financieros y logísticos para realizar a través de procesos asistencia técnica, la formulación de planes de inversión y capitalización de unidades productivas o emprendimientos según la focalización territorial definida de la Localidad de Chapinero, con el fin de promover la sostenibilidad de la población con mayores brechas sociales y económicas en el marco de la post pandemia.","Inversión","Un nuevo contrato social y ambiental para la Bogotá del Siglo XXI",6,{"$f":"IF(ISERROR(VLOOKUP(K185,[2]Proposito_programa!$C$2:$E$59,2,FALSE)),\" \",VLOOKUP(K185,[2]Proposito_programa!$C$2:$E$59,2,FALSE))","v":"Sistema Distrital de Cuidado"},{"$f":"IF(ISERROR(VLOOKUP(K185,[2]Proposito_programa!$C$2:$E$59,3,FALSE)),\" \",VLOOKUP(K185,[2]Proposito_programa!$C$2:$E$59,3,FALSE))","v":"Propósito 1: Hacer un nuevo contrato social para incrementar la inclusión social, productiva y política"},1671,null,800250713,"CORPORACION PARA EL DESARROLLO DE LAS MICROEMPRESAS","Persona Jurídica",null,null,null,null,683403543,0,null,null,683403543,486451772,"2022-08-19","2022-08-29","2023-06-28",300,null,null,null,null,null,null,"En ejecución",0.5]
[173,2022,"FDLCH-CPS-173-2022","https://community.secop.gov.co/Public/Tendering/OpportunityDetail/Index?noticeUID=CO1.NTC.3146311&isFromPublicArea=True&isModal=true&asPopupView=true","Contratos de prestación de servicios profesionales y de apoyo a la gestión","Contratación directa","Prestación de servicios profesionales y de apoyo a la gestión, o para la ejecución de trabajos artísticos que sólo puedan encomendarse a determinadas personas naturales","Prestar servicios de apoyo a la gestión para la atención integral de las víctimas del conflicto armado en el marco del proyecto \"Chapinero Territorio de Paz y la Atención de las Instancias de Participación Locales\", relacionadas con la construcción de paz local.","Inversión","Un nuevo contrato social y ambiental para la Bogotá del Siglo XXI",39,{"$f":"IF(ISERROR(VLOOKUP(K186,[2]Proposito_programa!$C$2:$E$59,2,FALSE)),\" \",VLOOKUP(K186,[2]Proposito_programa!$C$2:$E$59,2,FALSE))","v":"Bogotá territorio de paz y atención integral a las víctimas del conflicto armado"},{"$f":"IF(ISERROR(VLOOKUP(K186,[2]Proposito_programa!$C$2:$E$59,3,FALSE)),\" \",VLOOKUP(K186,[2]Proposito_programa!$C$2:$E$59,3,FALSE))","v":"Propósito 3: Inspirar confianza y legitimidad para vivir sin miedo y ser epicentro de cultura ciudadana, paz y reconciliación"},2028,null,1018472123,"CAMILO ANDRES MENDEZ SALAMANCA","Persona Natural",null,null,null,null,10960000,0,null,null,10960000,9498667,"2022-08-16","2022-08-17","2022-12-16",120,null,null,null,null,null,null,"Terminado",1]
[175,2022,"FDLCH-CPS-175-2022","https://community.secop.gov.co/Public/Tendering/OpportunityDetail/Index?noticeUID=CO1.NTC.3165327&isFromPublicArea=True&isModal=true&asPopupView=true","Contratos de prestación de servicios profesionales y de apoyo a la gestión","Contratación directa","Prestación de servicios profesionales y de apoyo a la gestión, o para la ejecución de trabajos artísticos que sólo puedan encomendarse a determinadas personas naturales","Prestación de servicios profesionales para apoyar al área de gestión del desarrollo local de la alcaldía local de chapinero  en la gestión  formulación  desarrollo  seguimiento y evaluación de los temas relacionados con educación superior en la localidad de chapinero  enmarcados en el proyecto de \"Inversión Chapinero Construye Futuro y realizar el apoyo a la supervisión de los contratos y/o convenios que de él se deriva.","Inversión","Un nuevo contrato social y ambiental para la Bogotá del Siglo XXI",17,{"$f":"IF(ISERROR(VLOOKUP(K187,[2]Proposito_programa!$C$2:$E$59,2,FALSE)),\" \",VLOOKUP(K187,[2]Proposito_programa!$C$2:$E$59,2,FALSE))","v":"Jóvenes con capacidades: Proyecto de vida para la ciudadanía, la innovación y el trabajo del siglo XXI"},{"$f":"IF(ISERROR(VLOOKUP(K187,[2]Proposito_programa!$C$2:$E$59,3,FALSE)),\" \",VLOOKUP(K187,[2]Proposito_programa!$C$2:$E$59,3,FALSE))","v":"Propósito 1: Hacer un nuevo contrato social para incrementar la inclusión social, productiva y política"},1743,null,51950770,"ARACELY MEJIA HERRERA","Persona Natural",null,null,null,null,19200000,0,1,4800000,24000000,18720000,"2022-08-18","2022-08-19","2023-01-18",120,1,30,null,null,null,null,"En ejecución",0.95]
[176,2022,"FDLCH-CPS-176-2022","https://community.secop.gov.co/Public/Tendering/OpportunityDetail/Index?noticeUID=CO1.NTC.3165930&isFromPublicArea=True&isModal=true&asPopupView=true","Contratos de prestación de servicios profesionales y de apoyo a la gestión","Contratación directa","Prestación de servicios profesionales y de apoyo a la gestión, o para la ejecución de trabajos artísticos que sólo puedan encomendarse a determinadas personas naturales","Prestar servicios técnicos para apoyar la gestión jurídica en la ejecución de las actividades administrativas y documentales con contenido jurídico relacionadas con los procesos de inspección, vigilancia y control que adelanta la Alcaldía Local de Chapinero.","Inversión","Un nuevo contrato social y ambiental para la Bogotá del Siglo XXI",57,{"$f":"IF(ISERROR(VLOOKUP(K188,[2]Proposito_programa!$C$2:$E$59,2,FALSE)),\" \",VLOOKUP(K188,[2]Proposito_programa!$C$2:$E$59,2,FALSE))","v":"Gestión pública local"},{"$f":"IF(ISERROR(VLOOKUP(K188,[2]Proposito_programa!$C$2:$E$59,3,FALSE)),\" \",VLOOKUP(K188,[2]Proposito_programa!$C$2:$E$59,3,FALSE))","v":"Propósito 5: Construir Bogotá - Región con gobierno abierto, transparente y ciudadanía consciente"},1841,null,52524843,"YADY MATILDE MORENO VARGAS","Persona Natural",null,null,null,null,14000000,0,1,1750000,15750000,11433333,"2022-08-19","2022-08-23","2023-06-01",120,1,15,null,null,null,null,"Terminado",1]
[177,2022,"FDLCH-CIN-177-2022","https://community.secop.gov.co/Public/Tendering/OpportunityDetail/Index?noticeUID=CO1.NTC.3017832&isFromPublicArea=True&isModal=true&asPopupView=true","Interventoría","Concurso de méritos","No aplica","Realizar la interventoría técnica administrativa legal, financiera, social, ambental y sistema de seguridad y salud en el trabajo - SG-SST  del contrato de obra que se derive de la licitación pública o la que haga sus veces que refiere a ejecutar a monto agotable por precios unitarios fijos obras y actividades para la conservación de la infraestructura víal, urbana de la Localidad de Chapinero, en Bogotá D.C.","Inversión","Un nuevo contrato social y ambiental para la Bogotá del Siglo XXI",49,{"$f":"IF(ISERROR(VLOOKUP(K189,[2]Proposito_programa!$C$2:$E$59,2,FALSE)),\" \",VLOOKUP(K189,[2]Proposito_programa!$C$2:$E$59,2,FALSE))","v":"Movilidad segura, sostenible y accesible"},{"$f":"IF(ISERROR(VLOOKUP(K189,[2]Proposito_programa!$C$2:$E$59,3,FALSE)),\" \",VLOOKUP(K189,[2]Proposito_programa!$C$2:$E$59,3,FALSE))","v":"Propósito 4: Hacer de Bogotá Región un modelo de movilidad multimodal, incluyente y sostenible"},1734,7,900644351,"CONSULTORES DONOVAN SAS","Persona Jurídica",null,null,null,null,548402175,0,null,null,548402175,0,"2022-08-17","2022-08-31","2023-03-29",210,null,null,null,null,null,null,"En ejecución",0.8]
[178,2022,"FDLCH-CPS-178-2022","https://community.secop.gov.co/Public/Tendering/OpportunityDetail/Index?noticeUID=CO1.NTC.3183687&isFromPublicArea=True&isModal=true&asPopupView=true","Contratos de prestación de servicios profesionales y de apoyo a la gestión","Contratación directa","Prestación de servicios profesionales y de apoyo a la gestión, o para la ejecución de trabajos artísticos que sólo puedan encomendarse a determinadas personas naturales","prestar los servicios profesionales para coordinar la articulación  asistencia y acompañamiento de los procesos de planeación local  para la promoción de la participación de las mujeres y de la equidad de género  para materializar en la localidad las estrategias de territorialización y transversalización de la política pública de mujeres y equidad de género, ppmyeg.","Inversión","Un nuevo contrato social y ambiental para la Bogotá del Siglo XXI",40,{"$f":"IF(ISERROR(VLOOKUP(K190,[2]Proposito_programa!$C$2:$E$59,2,FALSE)),\" \",VLOOKUP(K190,[2]Proposito_programa!$C$2:$E$59,2,FALSE))","v":"Más mujeres viven una vida libre de violencias, se sienten seguras y acceden con confianza al sistema de justicia"},{"$f":"IF(ISERROR(VLOOKUP(K190,[2]Proposito_programa!$C$2:$E$59,3,FALSE)),\" \",VLOOKUP(K190,[2]Proposito_programa!$C$2:$E$59,3,FALSE))","v":"Propósito 3: Inspirar confianza y legitimidad para vivir sin miedo y ser epicentro de cultura ciudadana, paz y reconciliación"},2035,null,53108000,"LEIDY VIVIANA ORTIZ GUEVARA","Persona Natural",null,null,null,null,24000000,0,1,12000000,36000000,22400000,"2022-08-23","2022-08-24","23/02/2023",120,1,60,null,null,null,null,"En ejecución",0.85]
[180,2022,"FDLCH-CPS-180-2022","https://community.secop.gov.co/Public/Tendering/OpportunityDetail/Index?noticeUID=CO1.NTC.3194455&isFromPublicArea=True&isModal=true&asPopupView=true","Contratos de prestación de servicios profesionales y de apoyo a la gestión","Contratación directa","Prestación de servicios profesionales y de apoyo a la gestión, o para la ejecución de trabajos artísticos que sólo puedan encomendarse a determinadas personas naturales","Prestar los servicios profesionales de apoyo al área de gestión del desarrollo local en los procesos de  estructuración y seguimiento del proceso de planeación local  desarrollando actividades relacionadas con la formulación, seguimiento, terminación y cierre de proyectos de inversión  así como el fortalecimiento y promoción de la participación ciudadana.","Inversión","Un nuevo contrato social y ambiental para la Bogotá del Siglo XXI",57,{"$f":"IF(ISERROR(VLOOKUP(K191,[2]Proposito_programa!$C$2:$E$59,2,FALSE)),\" \",VLOOKUP(K191,[2]Proposito_programa!$C$2:$E$59,2,FALSE))","v":"Gestión pública local"},{"$f":"IF(ISERROR(VLOOKUP(K191,[2]Proposito_programa!$C$2:$E$59,3,FALSE)),\" \",VLOOKUP(K191,[2]Proposito_programa!$C$2:$E$59,3,FALSE))","v":"Propósito 5: Construir Bogotá - Región con gobierno abierto, transparente y ciudadanía consciente"},1741,null,1032489616,"MARIA CAMILA FARFAN LEYVA","Persona Natural",null,null,null,null,26000000,0,1,13000000,39000000,23833333,"2022-08-25","2022-08-26","2023-02-25",120,1,60,null,null,null,null,"En ejecución",0.9]
[181,2022,"FDLCH-CPS-181-2022","https://community.secop.gov.co/Public/Tendering/OpportunityDetail/Index?noticeUID=CO1.NTC.3188758&isFromPublicArea=True&isModal=true&asPopupView=true","Contratos de prestación de servicios profesionales y de apoyo a la gestión","Contratación directa","Prestación de servicios profesionales y de apoyo a la gestión, o para la ejecución de trabajos artísticos que sólo puedan encomendarse a determinadas personas naturales","Prestar servicios profesionales para apoyar la formulación, ejecución, seguimiento y menjora continua de las herramientas que conforman la gestión ambiental institucional de la Alcaldía Local de Chapinero.","Inversión","Un nuevo contrato social y ambiental para la Bogotá del Siglo XXI",57,{"$f":"IF(ISERROR(VLOOKUP(K192,[2]Proposito_programa!$C$2:$E$59,2,FALSE)),\" \",VLOOKUP(K192,[2]Proposito_programa!$C$2:$E$59,2,FALSE))","v":"Gestión pública local"},{"$f":"IF(ISERROR(VLOOKUP(K192,[2]Proposito_programa!$C$2:$E$59,3,FALSE)),\" \",VLOOKUP(K192,[2]Proposito_programa!$C$2:$E$59,3,FALSE))","v":"Propósito 5: Construir Bogotá - Región con gobierno abierto, transparente y ciudadanía consciente"},1741,null,79748591,"HARVY ZURITH BARRIOS LOPEZ","Persona Natural",null,null,null,null,18400000,0,null,null,18400000,13953333,"2022-08-24","2022-08-30","2022-12-29",120,null,null,null,null,null,null,"Terminado",1]
[182,2022,"FDLCH-CIA-182-2022","https://community.secop.gov.co/Public/Tendering/OpportunityDetail/Index?noticeUID=CO1.NTC.3197922&isFromPublicArea=True&isModal=true&asPopupView=true","Convenios/Contratos interadministrativos","Contratación directa","Contratos interadministrativos","Aunar esfuerzos técnicos, administrativos, jurídicos y financieros entre la Agencia Distrital para la Educación Superior, la Ciencia y la Tecnología - Atenea y el Fondo de Desarrollo Local de Chapinero para la implementación de un nuevo modelo inclusivo, eficiente y flexible para el acceso y la permanencia de las y los jóvenes egresados de instituciones de educación media a programas de educación superior y posmedia","Inversión","Un nuevo contrato social y ambiental para la Bogotá del Siglo XXI",17,{"$f":"IF(ISERROR(VLOOKUP(K193,[2]Proposito_programa!$C$2:$E$59,2,FALSE)),\" \",VLOOKUP(K193,[2]Proposito_programa!$C$2:$E$59,2,FALSE))","v":"Jóvenes con capacidades: Proyecto de vida para la ciudadanía, la innovación y el trabajo del siglo XXI"},{"$f":"IF(ISERROR(VLOOKUP(K193,[2]Proposito_programa!$C$2:$E$59,3,FALSE)),\" \",VLOOKUP(K193,[2]Proposito_programa!$C$2:$E$59,3,FALSE))","v":"Propósito 1: Hacer un nuevo contrato social para incrementar la inclusión social, productiva y política"},1743,null,901508361,"AGENCIA DISTRITAL PARA LA EDUCACION SUPERIOR, LA CIENCIA Y LA TECNOLOGIA, ATENEA","Persona Jurídica",null,null,null,null,1153434000,0,null,null,1153434000,1153434000,"2022-08-26","2022-08-31","2028-06-30",150,null,null,null,null,null,null,"En ejecución",0.4]
[183,2022,"FDLCH-CPS-183-2022","https://community.secop.gov.co/Public/Tendering/OpportunityDetail/Index?noticeUID=CO1.NTC.3215794&isFromPublicArea=True&isModal=true&asPopupView=true","Contratos de prestación de servicios profesionales y de apoyo a la gestión","Contratación directa","Prestación de servicios profesionales y de apoyo a la gestión, o para la ejecución de trabajos artísticos que sólo puedan encomendarse a determinadas personas naturales","Prestación de servicios profesionales para la atención integral y apoyo en el manejo de gestión administrativa de las actuaciones de inspección, vigilancia y control competencia de la Alcaldía Local de Chapinero.","Inversión","Un nuevo contrato social y ambiental para la Bogotá del Siglo XXI",57,{"$f":"IF(ISERROR(VLOOKUP(K194,[2]Proposito_programa!$C$2:$E$59,2,FALSE)),\" \",VLOOKUP(K194,[2]Proposito_programa!$C$2:$E$59,2,FALSE))","v":"Gestión pública local"},{"$f":"IF(ISERROR(VLOOKUP(K194,[2]Proposito_programa!$C$2:$E$59,3,FALSE)),\" \",VLOOKUP(K194,[2]Proposito_programa!$C$2:$E$59,3,FALSE))","v":"Propósito 5: Construir Bogotá - Región con gobierno abierto, transparente y ciudadanía consciente"},1841,null,52533394,"MARICELA PALACIO RODRIGUEZ","Persona Natural",null,null,null,null,21200000,0,1,10600000,31800000,18726667,"2022-08-31","2022-08-31","2023-02-28",120,1,60,null,null,null,null,"En ejecución",0.85]
[185,2022,"FDLCH-CPS-185-2022","https://community.secop.gov.co/Public/Tendering/OpportunityDetail/Index?noticeUID=CO1.NTC.3229526&isFromPublicArea=True&isModal=true&asPopupView=true","Contratos de prestación de servicios profesionales y de apoyo a la gestión","Contratación directa","Prestación de servicios profesionales y de apoyo a la gestión, o para la ejecución de trabajos artísticos que sólo puedan encomendarse a determinadas personas naturales","Prestar servicios de apoyo a la gestión para asistir administrativamente al área de gestión del desarrollo de la Alcaldía Local de Chapinero.","Inversión","Un nuevo contrato social y ambiental para la Bogotá del Siglo XXI",57,{"$f":"IF(ISERROR(VLOOKUP(K195,[2]Proposito_programa!$C$2:$E$59,2,FALSE)),\" \",VLOOKUP(K195,[2]Proposito_programa!$C$2:$E$59,2,FALSE))","v":"Gestión pública local"},{"$f":"IF(ISERROR(VLOOKUP(K195,[2]Proposito_programa!$C$2:$E$59,3,FALSE)),\" \",VLOOKUP(K195,[2]Proposito_programa!$C$2:$E$59,3,FALSE))","v":"Propósito 5: Construir Bogotá - Región con gobierno abierto, transparente y ciudadanía consciente"},1741,null,1010182229,"JONNATHAN EDGARDO SANCHEZ MONTAÑA","Persona Natural",null,null,null,null,10908000,0,1,5454000,16362000,9453600,"2022-09-02","2022-09-02","2023-03-01",120,1,60,null,null,null,null,"En ejecución",0.8]
[186,2022,"FDLCH-CPS-186-2022","https://community.secop.gov.co/Public/Tendering/OpportunityDetail/Index?noticeUID=CO1.NTC.3237323&isFromPublicArea=True&isModal=true&asPopupView=true","Contratos de prestación de servicios profesionales y de apoyo a la gestión","Contratación directa","Prestación de servicios profesionales y de apoyo a la gestión, o para la ejecución de trabajos artísticos que sólo puedan encomendarse a determinadas personas naturales","Prestar los servicios profesionales para apoyar el área de gestión del desarrollo loacal de la Alcaldía Local de Chapinero, en la formulación, gestión, ejecución y apoyo a la supervisión de los proyectos relacionados con los temas de salud, en cumplimiento de las metas y objetivos del Plan de Desarrollo Local.","Inversión","Un nuevo contrato social y ambiental para la Bogotá del Siglo XXI",6,{"$f":"IF(ISERROR(VLOOKUP(K196,[2]Proposito_programa!$C$2:$E$59,2,FALSE)),\" \",VLOOKUP(K196,[2]Proposito_programa!$C$2:$E$59,2,FALSE))","v":"Sistema Distrital de Cuidado"},{"$f":"IF(ISERROR(VLOOKUP(K196,[2]Proposito_programa!$C$2:$E$59,3,FALSE)),\" \",VLOOKUP(K196,[2]Proposito_programa!$C$2:$E$59,3,FALSE))","v":"Propósito 1: Hacer un nuevo contrato social para incrementar la inclusión social, productiva y política"},2024,null,52035792,"ADRIANA MARIA PEÑALOZA TORO","Persona Natural",null,null,null,null,18400000,0,1,3986568,22386568,12113333,"2022-09-08","2022-09-12","2023-06-02",120,1,28,null,null,null,null,"En ejecución",0.5]
[187,2022,"FDLCH-CPS-187-2022","https://community.secop.gov.co/Public/Tendering/OpportunityDetail/Index?noticeUID=CO1.NTC.3236657&isFromPublicArea=True&isModal=true&asPopupView=true","Contratos de prestación de servicios profesionales y de apoyo a la gestión","Contratación directa","Prestación de servicios profesionales y de apoyo a la gestión, o para la ejecución de trabajos artísticos que sólo puedan encomendarse a determinadas personas naturales","Prestar servicios profesionales para apoyar la gestión jurídica en la ejecución de las acciones requeridas para el trámite e impulso procesal de las actuaciones administrativas y de inspección, vigilancia y control de competencia de la Alcaldía Local de Chapinero en cerros orientales, zona de reserva forestal protectora, polígonos de monitoreo, áreas de ocupación pública prioritaria, franja de adecuación y zonas de especial protección ambiental.","Inversión","Un nuevo contrato social y ambiental para la Bogotá del Siglo XXI",57,{"$f":"IF(ISERROR(VLOOKUP(K197,[2]Proposito_programa!$C$2:$E$59,2,FALSE)),\" \",VLOOKUP(K197,[2]Proposito_programa!$C$2:$E$59,2,FALSE))","v":"Gestión pública local"},{"$f":"IF(ISERROR(VLOOKUP(K197,[2]Proposito_programa!$C$2:$E$59,3,FALSE)),\" \",VLOOKUP(K197,[2]Proposito_programa!$C$2:$E$59,3,FALSE))","v":"Propósito 5: Construir Bogotá - Región con gobierno abierto, transparente y ciudadanía consciente"},1841,null,79608642,"HERBERT JOHNN MARTINEZ BUITRAGO","Persona Natural",null,null,null,null,20000000,0,null,null,20000000,14000000,"2022-09-05","2022-09-07","2023-01-06",120,null,null,null,null,null,null,"Terminado",1]
[188,2022,"FDLCH-CPS-188-2022","https://community.secop.gov.co/Public/Tendering/OpportunityDetail/Index?noticeUID=CO1.NTC.3237018&isFromPublicArea=True&isModal=true&asPopupView=true","Contratos de prestación de servicios profesionales y de apoyo a la gestión","Contratación directa","Prestación de servicios profesionales y de apoyo a la gestión, o para la ejecución de trabajos artísticos que sólo puedan encomendarse a determinadas personas naturales","Prestar servicios de apoyo a la gestión al área de gestión del desarrollo local en las actividades y estrategias de fomento y promoción de la reactivación económica local, el fortalecimiento de los emprendimientos y de las pequeñas y medianas empresas locales","Inversión","Un nuevo contrato social y ambiental para la Bogotá del Siglo XXI",6,{"$f":"IF(ISERROR(VLOOKUP(K198,[2]Proposito_programa!$C$2:$E$59,2,FALSE)),\" \",VLOOKUP(K198,[2]Proposito_programa!$C$2:$E$59,2,FALSE))","v":"Sistema Distrital de Cuidado"},{"$f":"IF(ISERROR(VLOOKUP(K198,[2]Proposito_programa!$C$2:$E$59,3,FALSE)),\" \",VLOOKUP(K198,[2]Proposito_programa!$C$2:$E$59,3,FALSE))","v":"Propósito 1: Hacer un nuevo contrato social para incrementar la inclusión social, productiva y política"},1671,null,1023938082,"BONNER YESID HERNANDEZ BENITO","Persona Natural",null,null,null,null,10000000,0,1,416666,10416666,8333333,"2022-09-05","2022-09-06","2023-01-10",120,1,5,null,null,null,null,"En ejecución",0.95]
[189,2022,"FDLCH-CPS-189-2022","https://community.secop.gov.co/Public/Tendering/OpportunityDetail/Index?noticeUID=CO1.NTC.3250540&isFromPublicArea=True&isModal=true&asPopupView=true","Contratos de prestación de servicios profesionales y de apoyo a la gestión","Contratación directa","Prestación de servicios profesionales y de apoyo a la gestión, o para la ejecución de trabajos artísticos que sólo puedan encomendarse a determinadas personas naturales","Prestar los servicios técnicos de apoyo a la gestión, acciones administrativas y seguimiento de las actividades derivadas del proyecto de inversión \"Chapinero modelo de movilidad inteligente\"","Inversión","Un nuevo contrato social y ambiental para la Bogotá del Siglo XXI",49,{"$f":"IF(ISERROR(VLOOKUP(K199,[2]Proposito_programa!$C$2:$E$59,2,FALSE)),\" \",VLOOKUP(K199,[2]Proposito_programa!$C$2:$E$59,2,FALSE))","v":"Movilidad segura, sostenible y accesible"},{"$f":"IF(ISERROR(VLOOKUP(K199,[2]Proposito_programa!$C$2:$E$59,3,FALSE)),\" \",VLOOKUP(K199,[2]Proposito_programa!$C$2:$E$59,3,FALSE))","v":"Propósito 4: Hacer de Bogotá Región un modelo de movilidad multimodal, incluyente y sostenible"},1734,null,1020794388,"GINA PAOLA JIMENEZ CONTRERAS","Persona Natural",null,null,null,null,12792000,0,1,6396000,19188000,10340200,"2022-09-07","2022-09-09","2023-08-03",120,1,60,null,null,null,null,"En ejecución",0.5]
[190,2022,"FDLCH-CPS-190-2022","https://community.secop.gov.co/Public/Tendering/OpportunityDetail/Index?noticeUID=CO1.NTC.3250569&isFromPublicArea=True&isModal=true&asPopupView=true","Contratos de prestación de servicios profesionales y de apoyo a la gestión","Contratación directa","Prestación de servicios profesionales y de apoyo a la gestión, o para la ejecución de trabajos artísticos que sólo puedan encomendarse a determinadas personas naturales","Prestar servicios profesionales para la gestión, desarrollo y seguimiento del proyecto de inversión \" CHAPINERO ESPACIO PARA HÁBITOS SALUDABLES\"","Inversión","Un nuevo contrato social y ambiental para la Bogotá del Siglo XXI",33,{"$f":"IF(ISERROR(VLOOKUP(K200,[2]Proposito_programa!$C$2:$E$59,2,FALSE)),\" \",VLOOKUP(K200,[2]Proposito_programa!$C$2:$E$59,2,FALSE))","v":"Más árboles y más y mejor espacio público"},{"$f":"IF(ISERROR(VLOOKUP(K200,[2]Proposito_programa!$C$2:$E$59,3,FALSE)),\" \",VLOOKUP(K200,[2]Proposito_programa!$C$2:$E$59,3,FALSE))","v":"Propósito 2 : Cambiar Nuestros Hábitos de Vida para Reverdecer a Bogotá y Adaptarnos y Mitigar la Crisis Climática"},1723,null,1032445959,"MARIA ALEJANDRA JIMENEZ AUCIQUE","Persona Natural",null,null,null,null,18760000,null,1,9380000,28140000,14695333,"2022-09-07","2022-09-12","2023-03-11",120,1,60,null,null,null,null,"En ejecución",0.8]
[191,2022,"FDLCH-CPS-191-2022","https://community.secop.gov.co/Public/Tendering/OpportunityDetail/Index?noticeUID=CO1.NTC.3248406&isFromPublicArea=True&isModal=true&asPopupView=true","Contratos de prestación de servicios profesionales y de apoyo a la gestión","Contratación directa","Prestación de servicios profesionales y de apoyo a la gestión, o para la ejecución de trabajos artísticos que sólo puedan encomendarse a determinadas personas naturales","Prestar servicios de apoyo a la gestión en la ejecución de las actividades administrativas y documentales relacionadas con la gestión policiva en la Alcaldía Local de Chapinero.","Inversión","Un nuevo contrato social y ambiental para la Bogotá del Siglo XXI",57,{"$f":"IF(ISERROR(VLOOKUP(K201,[2]Proposito_programa!$C$2:$E$59,2,FALSE)),\" \",VLOOKUP(K201,[2]Proposito_programa!$C$2:$E$59,2,FALSE))","v":"Gestión pública local"},{"$f":"IF(ISERROR(VLOOKUP(K201,[2]Proposito_programa!$C$2:$E$59,3,FALSE)),\" \",VLOOKUP(K201,[2]Proposito_programa!$C$2:$E$59,3,FALSE))","v":"Propósito 5: Construir Bogotá - Región con gobierno abierto, transparente y ciudadanía consciente"},1841,null,101643505,"CRISTIAN OSWALDO LAITON VARGAS","Persona Natural",null,null,null,null,8800000,0,null,null,8800000,7186667,"2022-09-07","2022-09-08","2023-01-07",120,null,null,null,null,null,null,"Terminado",1]
[192,2022,"FDLCH-CPS-192-2022","https://community.secop.gov.co/Public/Tendering/OpportunityDetail/Index?noticeUID=CO1.NTC.3254730&isFromPublicArea=True&isModal=true&asPopupView=true","Contratos de prestación de servicios profesionales y de apoyo a la gestión","Contratación directa","Prestación de servicios profesionales y de apoyo a la gestión, o para la ejecución de trabajos artísticos que sólo puedan encomendarse a determinadas personas naturales","Prestar servicios de apoyo técnico para la gestión y ejecución de las actividades administrativas que se adelantan en la Alcaldía Local de Chapinero.","Inversión","Un nuevo contrato social y ambiental para la Bogotá del Siglo XXI",57,{"$f":"IF(ISERROR(VLOOKUP(K202,[2]Proposito_programa!$C$2:$E$59,2,FALSE)),\" \",VLOOKUP(K202,[2]Proposito_programa!$C$2:$E$59,2,FALSE))","v":"Gestión pública local"},{"$f":"IF(ISERROR(VLOOKUP(K202,[2]Proposito_programa!$C$2:$E$59,3,FALSE)),\" \",VLOOKUP(K202,[2]Proposito_programa!$C$2:$E$59,3,FALSE))","v":"Propósito 5: Construir Bogotá - Región con gobierno abierto, transparente y ciudadanía consciente"},1741,null,52603721,"SANDRA MILENA RODRIGUEZ SASTOQUE","Persona Natural",null,null,null,null,8211000,0,1,4105500,12316500,8575933,"2022-09-08","2022-09-12","2023-01-25",240,1,45,null,null,null,null,"En ejecución",0.9]
[193,2022,"FDLCH-CPS-193-2022","https://community.secop.gov.co/Public/Tendering/OpportunityDetail/Index?noticeUID=CO1.NTC.3254742&isFromPublicArea=True&isModal=true&asPopupView=true","Contratos de prestación de servicios profesionales y de apoyo a la gestión","Contratación directa","Prestación de servicios profesionales y de apoyo a la gestión, o para la ejecución de trabajos artísticos que sólo puedan encomendarse a determinadas personas naturales","Prestar servicios técnicos para apoyar el área de Gestión del Desarrollo Local en las actividades presupuestales y contables requeridas por la Alcaldía Local de Chapinero.","Inversión","Un nuevo contrato social y ambiental para la Bogotá del Siglo XXI",57,{"$f":"IF(ISERROR(VLOOKUP(K203,[2]Proposito_programa!$C$2:$E$59,2,FALSE)),\" \",VLOOKUP(K203,[2]Proposito_programa!$C$2:$E$59,2,FALSE))","v":"Gestión pública local"},{"$f":"IF(ISERROR(VLOOKUP(K203,[2]Proposito_programa!$C$2:$E$59,3,FALSE)),\" \",VLOOKUP(K203,[2]Proposito_programa!$C$2:$E$59,3,FALSE))","v":"Propósito 5: Construir Bogotá - Región con gobierno abierto, transparente y ciudadanía consciente"},1741,null,1023945934,"GISELLE MARIANA FONSECA CRISTANCHO","Persona Natural",null,null,null,null,14000000,0,1,6933333,20933333,12400000,"2022-09-08","2022-09-13","2023-02-18",90,1,52,null,null,null,null,"En ejecución",0.8]
[194,2022,"FDLCH-CPS-194-2022","https://community.secop.gov.co/Public/Tendering/OpportunityDetail/Index?noticeUID=CO1.NTC.3257006&isFromPublicArea=True&isModal=true&asPopupView=true","Contratos de prestación de servicios profesionales y de apoyo a la gestión","Contratación directa","Prestación de servicios profesionales y de apoyo a la gestión, o para la ejecución de trabajos artísticos que sólo puedan encomendarse a determinadas personas naturales","Apoyar jurídicamente la ejecución de las acciones requeridas para la depuración de las actuaciones administrativas que cursan en la Alcaldía Local de Chapinero.","Inversión","Un nuevo contrato social y ambiental para la Bogotá del Siglo XXI",57,{"$f":"IF(ISERROR(VLOOKUP(K204,[2]Proposito_programa!$C$2:$E$59,2,FALSE)),\" \",VLOOKUP(K204,[2]Proposito_programa!$C$2:$E$59,2,FALSE))","v":"Gestión pública local"},{"$f":"IF(ISERROR(VLOOKUP(K204,[2]Proposito_programa!$C$2:$E$59,3,FALSE)),\" \",VLOOKUP(K204,[2]Proposito_programa!$C$2:$E$59,3,FALSE))","v":"Propósito 5: Construir Bogotá - Región con gobierno abierto, transparente y ciudadanía consciente"},1841,null,80829955,"ANDERSSON CAMILO USSA SANCHEZ ","Persona Natural",null,null,null,null,46766666,-30666666,1,6900000,23000000,6593333,"2022-09-20","2022-09-22","2023-03-14",90,1,45,1022941172,"JEFFERSON ALEJANDRO GOMEZ SANTAFE","2022-10-18",15333333,"En ejecución",0.75]
[195,2022,"FDLCH-CPS-195-2022","https://community.secop.gov.co/Public/Tendering/OpportunityDetail/Index?noticeUID=CO1.NTC.3256946&isFromPublicArea=True&isModal=true&asPopupView=true","Contratos de prestación de servicios profesionales y de apoyo a la gestión","Contratación directa","Prestación de servicios profesionales y de apoyo a la gestión, o para la ejecución de trabajos artísticos que sólo puedan encomendarse a determinadas personas naturales","Prestar servicios profesionales para apoyar técnicamente las distintas etapas de los procesos de competencia de las inspecciones de policia de la Localidad de Chapinero, según reparto.","Inversión","Un nuevo contrato social y ambiental para la Bogotá del Siglo XXI",57,{"$f":"IF(ISERROR(VLOOKUP(K205,[2]Proposito_programa!$C$2:$E$59,2,FALSE)),\" \",VLOOKUP(K205,[2]Proposito_programa!$C$2:$E$59,2,FALSE))","v":"Gestión pública local"},{"$f":"IF(ISERROR(VLOOKUP(K205,[2]Proposito_programa!$C$2:$E$59,3,FALSE)),\" \",VLOOKUP(K205,[2]Proposito_programa!$C$2:$E$59,3,FALSE))","v":"Propósito 5: Construir Bogotá - Región con gobierno abierto, transparente y ciudadanía consciente"},1841,null,17122651,"FERNANDO CUERVO RODRIGUEZ","Persona Natural",null,null,null,null,20720000,0,null,null,20720000,12259333,"2022-09-08","2022-09-20","2023-01-19",120,null,null,null,null,null,null,"En ejecución",0.9]
[157,2022,"FDLCH-CPS-157-2022","https://community.secop.gov.co/Public/Tendering/OpportunityDetail/Index?noticeUID=CO1.NTC.3017744&isFromPublicArea=True&isModal=true&asPopupView=true","Contratos de prestación de servicios","Selección abreviada","Selección abreviada por menor cuantía ","Prestar servicios de soporte técnico, mantenimiento preventivo y correctivo de equipos de cómputo, scáner, impresoras, dispositivos de red e infraestructura tecnológica de propiedad del Fondo de Desarrollo Local de Chapinero.","Funcionamiento","Un nuevo contrato social y ambiental para la Bogotá del Siglo XXI","No aplica",{"$f":"IF(ISERROR(VLOOKUP(K206,[2]Proposito_programa!$C$2:$E$59,2,FALSE)),\" \",VLOOKUP(K206,[2]Proposito_programa!$C$2:$E$59,2,FALSE))","v":" "},{"$f":"IF(ISERROR(VLOOKUP(K206,[2]Proposito_programa!$C$2:$E$59,3,FALSE)),\" \",VLOOKUP(K206,[2]Proposito_programa!$C$2:$E$59,3,FALSE))","v":" "},null,4,900179430,"INMOTICA LTDA","Persona Jurídica",null,null,null,null,61800000,0,null,null,61800000,0,"2022-07-27","2022-08-01","2023-05-31",300,null,null,null,null,null,null,"En ejecución",0.6]
[166,2022,"FDLCH-CSU-166-2022","https://colombiacompra.gov.co/tienda-virtual-del-estado-colombiano/ordenes-compra/93787","Contratos de prestación de servicios","Selección abreviada","Selección abreviada por menor cuantía ","Contratar el suminsitro de combustible (GASOLINA CORRIENTE Y ACPM) para los vehpiculos que conforman el parque automotor de propiedad al servicio del Fondo de Desarrollo Local de CHapineo en las condiciones del Acuerdo Marco de Precios CCE-715-1-AMP 2018","Funcionamiento","Un nuevo contrato social y ambiental para la Bogotá del Siglo XXI","No aplica",{"$f":"IF(ISERROR(VLOOKUP(K207,[2]Proposito_programa!$C$2:$E$59,2,FALSE)),\" \",VLOOKUP(K207,[2]Proposito_programa!$C$2:$E$59,2,FALSE))","v":" "},{"$f":"IF(ISERROR(VLOOKUP(K207,[2]Proposito_programa!$C$2:$E$59,3,FALSE)),\" \",VLOOKUP(K207,[2]Proposito_programa!$C$2:$E$59,3,FALSE))","v":" "},null,null,830095213,"ORGANIZACION TERPEL SA","Persona Jurídica",null,null,null,null,10000000,0,null,null,10000000,7970058,"2022-07-25","2022-08-08","2023-05-07",270,null,null,null,null,null,null,"En ejecución",0.7]
[199,2022,"FDLCH-CPS-199-2022","https://community.secop.gov.co/Public/Tendering/OpportunityDetail/Index?noticeUID=CO1.NTC.3145775&isFromPublicArea=True&isModal=true&asPopupView=true","Contratos de prestación de servicios","Licitación pública","No aplica","Prestar servicios para implementar acciones en atención de urgencias, brigadas médico-veterinarias, esterilización, adopción de fauna doméstica, en habitabilidad de calle y/o condiciones de vulnerabilidad, educación en tenencia responsable y fortalecimiento de la Red de Proteccionistas en la Localidad de Chapinero.","Inversión","Un nuevo contrato social y ambiental para la Bogotá del Siglo XXI",34,{"$f":"IF(ISERROR(VLOOKUP(K208,[2]Proposito_programa!$C$2:$E$59,2,FALSE)),\" \",VLOOKUP(K208,[2]Proposito_programa!$C$2:$E$59,2,FALSE))","v":"Bogotá protectora de los animales"},{"$f":"IF(ISERROR(VLOOKUP(K208,[2]Proposito_programa!$C$2:$E$59,3,FALSE)),\" \",VLOOKUP(K208,[2]Proposito_programa!$C$2:$E$59,3,FALSE))","v":"Propósito 2 : Cambiar Nuestros Hábitos de Vida para Reverdecer a Bogotá y Adaptarnos y Mitigar la Crisis Climática"},1731,2,901039835,"IMPECOS SAS","Persona Jurídica",null,null,null,null,286801900,0,null,null,286801900,0,"2022-09-08","2022-09-16","2023-05-15",240,null,null,null,null,null,null,"En ejecución",0.6]
[166,2022,"FDLCH-CSU-166-2022","https://colombiacompra.gov.co/tienda-virtual-del-estado-colombiano/ordenes-compra/93787","Contratos de prestación de servicios","Selección abreviada","Selección abreviada por menor cuantía ","Contratar el suminsitro de combustible (GASOLINA CORRIENTE Y ACPM) para los vehpiculos que conforman el parque automotor de propiedad al servicio del Fondo de Desarrollo Local de CHapineo en las condiciones del Acuerdo Marco de Precios CCE-715-1-AMP 2018","Funcionamiento","Un nuevo contrato social y ambiental para la Bogotá del Siglo XXI","No aplica",null,null,null,null,830095213,"ORGANIZACION TERPEL SA","Persona Jurídica",null,null,null,null,10600000,0,null,null,10600000,0,"2022-07-25","2022-08-08","2023-05-07",null,null,null,null,null,null,null,"En ejecución",0.7]
[201,2022,"FDLCH-CPS-201-2022","https://community.secop.gov.co/Public/Tendering/OpportunityDetail/Index?noticeUID=CO1.NTC.3208477&isFromPublicArea=True&isModal=true&asPopupView=true","Suministro","Contratación mínima cuantia","No aplica","Suministrar a monto agotable los bienes requeridos para el mantenimiento, adecuación y embellecimiento de espacio público, en el marco de juntos cuidamos Bogotá, para la Localidad de Chapinero.","Inversión","Un nuevo contrato social y ambiental para la Bogotá del Siglo XXI",49,{"$f":"IF(ISERROR(VLOOKUP(K210,[2]Proposito_programa!$C$2:$E$59,2,FALSE)),\" \",VLOOKUP(K210,[2]Proposito_programa!$C$2:$E$59,2,FALSE))","v":"Movilidad segura, sostenible y accesible"},{"$f":"IF(ISERROR(VLOOKUP(K210,[2]Proposito_programa!$C$2:$E$59,3,FALSE)),\" \",VLOOKUP(K210,[2]Proposito_programa!$C$2:$E$59,3,FALSE))","v":"Propósito 4: Hacer de Bogotá Región un modelo de movilidad multimodal, incluyente y sostenible"},1734,5,830073899,"COMERCIALIZADORA ELECTROCON SAS","Persona Jurídica",null,null,null,null,28000000,0,null,null,28000000,0,"2022-09-08","2022-09-09","2023-03-08",180,null,null,null,null,null,null,"En ejecución",0.75]
[202,2022,"FDLCH-CPS-202-2022","https://community.secop.gov.co/Public/Tendering/OpportunityDetail/Index?noticeUID=CO1.NTC.3329140&isFromPublicArea=True&isModal=False","Contratos de prestación de servicios profesionales y de apoyo a la gestión","Contratación directa","Prestación de servicios profesionales y de apoyo a la gestión, o para la ejecución de trabajos artísticos que sólo puedan encomendarse a determinadas personas naturales","Prestar servicios asistesnciales de apoyo para la gestión y desarrollo del proyecto de inversión No. 1827 \"Chapinero Rural y Productivo.","Inversión","Un nuevo contrato social y ambiental para la Bogotá del Siglo XXI",23,{"$f":"IF(ISERROR(VLOOKUP(K211,[2]Proposito_programa!$C$2:$E$59,2,FALSE)),\" \",VLOOKUP(K211,[2]Proposito_programa!$C$2:$E$59,2,FALSE))","v":"Bogotá rural"},{"$f":"IF(ISERROR(VLOOKUP(K211,[2]Proposito_programa!$C$2:$E$59,3,FALSE)),\" \",VLOOKUP(K211,[2]Proposito_programa!$C$2:$E$59,3,FALSE))","v":"Propósito 1: Hacer un nuevo contrato social para incrementar la inclusión social, productiva y política"},1827,null,1026583329,"ALHISON VANESA GARZON CASTAÑEDA","Persona Natural",null,null,null,null,6300000,0,1,1050000,7350000,5110000,"2022-09-27","2022-10-03","17/01/2023",90,1,15,null,null,null,null,"En ejecución",0.9]
[203,2022,"FDLCH-CPS-203-2022","https://community.secop.gov.co/Public/Tendering/OpportunityDetail/Index?noticeUID=CO1.NTC.3344415&isFromPublicArea=True&isModal=true&asPopupView=true","Contratos de prestación de servicios profesionales y de apoyo a la gestión","Contratación directa","Prestación de servicios profesionales y de apoyo a la gestión, o para la ejecución de trabajos artísticos que sólo puedan encomendarse a determinadas personas naturales","Prestar los servicios profesionales de apoyo a la gestión para la formulación, desarrollo y seguimiento del proyecto de inversión \"CHAPINERO MODELO DE MOVILIDAD INTELIGENTE\" y la supervisión de contratos que le sean asignados.","Inversión","Un nuevo contrato social y ambiental para la Bogotá del Siglo XXI",49,{"$f":"IF(ISERROR(VLOOKUP(K212,[2]Proposito_programa!$C$2:$E$59,2,FALSE)),\" \",VLOOKUP(K212,[2]Proposito_programa!$C$2:$E$59,2,FALSE))","v":"Movilidad segura, sostenible y accesible"},{"$f":"IF(ISERROR(VLOOKUP(K212,[2]Proposito_programa!$C$2:$E$59,3,FALSE)),\" \",VLOOKUP(K212,[2]Proposito_programa!$C$2:$E$59,3,FALSE))","v":"Propósito 4: Hacer de Bogotá Región un modelo de movilidad multimodal, incluyente y sostenible"},1734,null,12194109,"FREDY SILVA VARGAS","Persona Natural",null,null,null,null,20000000,0,1,10000000,30000000,12000000,"2022-10-03","2022-10-04","2023-03-03",120,1,60,null,null,null,null,"En ejecución",0.75]
[204,2022,"FDCLH-CPS-204-2022","https://community.secop.gov.co/Public/Tendering/OpportunityDetail/Index?noticeUID=CO1.NTC.3291112&isFromPublicArea=True&isModal=true&asPopupView=true","Contratos de prestación de servicios","Selección abreviada","Selección abreviada por menor cuantía ","Prestar servicios para desarrollar estrategias de sensibilización y formación para el fortalecimiento de práctivas de crianza asertivas en primera infancia, cuidado y desarrollo integral, dirigido a las instituciones educativas distritales de la Localidad de Chapinero.","Inversión","Un nuevo contrato social y ambiental para la Bogotá del Siglo XXI",12,{"$f":"IF(ISERROR(VLOOKUP(K213,[2]Proposito_programa!$C$2:$E$59,2,FALSE)),\" \",VLOOKUP(K213,[2]Proposito_programa!$C$2:$E$59,2,FALSE))","v":"Educación inicial: Bases sólidas para la vida."},{"$f":"IF(ISERROR(VLOOKUP(K213,[2]Proposito_programa!$C$2:$E$59,3,FALSE)),\" \",VLOOKUP(K213,[2]Proposito_programa!$C$2:$E$59,3,FALSE))","v":"Propósito 1: Hacer un nuevo contrato social para incrementar la inclusión social, productiva y política"},1830,7,900175862,"CORPORACION ESTRATEGICA EN GESTION E INTEGRACION COLOMBIA EGESCO","Persona Jurídica",null,null,null,null,280000000,0,null,null,280000000,84000000,"2022-10-10","2022-10-18","2023-05-02",180,null,null,null,null,null,null,"En ejecución",0.5]
[205,2022,"FDLCH-CPS-205-2022","https://community.secop.gov.co/Public/Tendering/OpportunityDetail/Index?noticeUID=CO1.NTC.3358072&isFromPublicArea=True&isModal=true&asPopupView=true","Contratos de prestación de servicios profesionales y de apoyo a la gestión","Contratación directa","Prestación de servicios profesionales y de apoyo a la gestión, o para la ejecución de trabajos artísticos que sólo puedan encomendarse a determinadas personas naturales","Prestar los servicios profesionale sde apoyo a la gestión para la planeación, gestión, formulación, desarrollo, seguimineto y evaluación del proyecto de inversión \"EN CHAPINERO TODAS CONTAMOS\", en atención al fortalecimiento de la capacidad de gestión del Fondo de Desarrollo Local.","Inversión","Un nuevo contrato social y ambiental para la Bogotá del Siglo XXI",40,{"$f":"IF(ISERROR(VLOOKUP(K214,[2]Proposito_programa!$C$2:$E$59,2,FALSE)),\" \",VLOOKUP(K214,[2]Proposito_programa!$C$2:$E$59,2,FALSE))","v":"Más mujeres viven una vida libre de violencias, se sienten seguras y acceden con confianza al sistema de justicia"},{"$f":"IF(ISERROR(VLOOKUP(K214,[2]Proposito_programa!$C$2:$E$59,3,FALSE)),\" \",VLOOKUP(K214,[2]Proposito_programa!$C$2:$E$59,3,FALSE))","v":"Propósito 3: Inspirar confianza y legitimidad para vivir sin miedo y ser epicentro de cultura ciudadana, paz y reconciliación"},2035,null,1015411319,"LESLY VANESSA VALBUENA CAICEDO","Persona Natural",null,null,null,null,13542000,0,1,6771000,20313000,10833600,"2022-10-04","2022-10-05","19/02/2023",90,1,45,null,null,null,null,"En ejecución",0.85]
[206,2022,"FDLCH-CPS-206-2022","https://community.secop.gov.co/Public/Tendering/OpportunityDetail/Index?noticeUID=CO1.NTC.3383344&isFromPublicArea=True&isModal=true&asPopupView=true","Contratos de prestación de servicios profesionales y de apoyo a la gestión","Contratación directa","Prestación de servicios profesionales y de apoyo a la gestión, o para la ejecución de trabajos artísticos que sólo puedan encomendarse a determinadas personas naturales","Prestar servicios técnicos para apoyar la gestión jurídica en la ejecución de las actividades administrativas y documentales con contenido jurídico, relacionadas con los procesos de inspección, vigilancia y control que adelanta la Alcaldía Local de Chapinero.","Inversión","Un nuevo contrato social y ambiental para la Bogotá del Siglo XXI",57,{"$f":"IF(ISERROR(VLOOKUP(K215,[2]Proposito_programa!$C$2:$E$59,2,FALSE)),\" \",VLOOKUP(K215,[2]Proposito_programa!$C$2:$E$59,2,FALSE))","v":"Gestión pública local"},{"$f":"IF(ISERROR(VLOOKUP(K215,[2]Proposito_programa!$C$2:$E$59,3,FALSE)),\" \",VLOOKUP(K215,[2]Proposito_programa!$C$2:$E$59,3,FALSE))","v":"Propósito 5: Construir Bogotá - Región con gobierno abierto, transparente y ciudadanía consciente"},1841,null,1057594809,"KELLY YOHANA PEREZ BENAVIDES","Persona Natural",null,null,null,null,11400000,0,1,5700000,17100000,8106667,"2022-10-10","2022-10-11","2023-02-25",90,1,45,null,null,null,null,"En ejecución",0.9]
[208,2022,"FDLCH-CPS-208-2022","https://community.secop.gov.co/Public/Tendering/OpportunityDetail/Index?noticeUID=CO1.NTC.3325285&isFromPublicArea=True&isModal=true&asPopupView=true","Contratos de prestación de servicios","Contratación mínima cuantia","No aplica","Prestar los servicios para desarrollar el encuentro de juegos tradicionales étnicos de la Localidad de Chapinero.","Inversión","Un nuevo contrato social y ambiental para la Bogotá del Siglo XXI",20,{"$f":"IF(ISERROR(VLOOKUP(K216,[2]Proposito_programa!$C$2:$E$59,2,FALSE)),\" \",VLOOKUP(K216,[2]Proposito_programa!$C$2:$E$59,2,FALSE))","v":"Bogotá, referente en cultura, deporte, recreación y actividad física, con parques para el desarrollo y la salud"},{"$f":"IF(ISERROR(VLOOKUP(K216,[2]Proposito_programa!$C$2:$E$59,3,FALSE)),\" \",VLOOKUP(K216,[2]Proposito_programa!$C$2:$E$59,3,FALSE))","v":"Propósito 1: Hacer un nuevo contrato social para incrementar la inclusión social, productiva y política"},1845,2,830123987,"CORPORACION ENCAMINADA AL DESARROLLO INTEGRAL DE LA COMUNIDAD CEDEINCO","Persona Jurídica",null,null,null,null,22642200,0,null,null,22642200,null,"2022-10-12","2022-11-09","2023-02-18",60,null,null,null,null,null,null,"En ejecución",0.9]
[209,2022,"FDLCH-CPS-209-2022","https://community.secop.gov.co/Public/Tendering/OpportunityDetail/Index?noticeUID=CO1.NTC.3393630&isFromPublicArea=True&isModal=true&asPopupView=true","Contratos de prestación de servicios profesionales y de apoyo a la gestión","Contratación directa","Prestación de servicios profesionales y de apoyo a la gestión, o para la ejecución de trabajos artísticos que sólo puedan encomendarse a determinadas personas naturales","Prestar servicios profesionales de apoyo y jurídicamente el seguimiento, supervisión estratégica y sustanciación de procesos de competencia de la alcaldía local de chapinero anteriores a la entrada en vigencia de la ley 1801 de 2016","Inversión","Un nuevo contrato social y ambiental para la Bogotá del Siglo XXI",57,{"$f":"IF(ISERROR(VLOOKUP(K217,[2]Proposito_programa!$C$2:$E$59,2,FALSE)),\" \",VLOOKUP(K217,[2]Proposito_programa!$C$2:$E$59,2,FALSE))","v":"Gestión pública local"},{"$f":"IF(ISERROR(VLOOKUP(K217,[2]Proposito_programa!$C$2:$E$59,3,FALSE)),\" \",VLOOKUP(K217,[2]Proposito_programa!$C$2:$E$59,3,FALSE))","v":"Propósito 5: Construir Bogotá - Región con gobierno abierto, transparente y ciudadanía consciente"},1841,null,19271830,"MANUEL FALLA BUSTOS","Persona Natural",null,null,null,null,18000000,0,null,null,{"$f":"+W217+X217+Z217","v":18000000},9600000,"2022-10-12","2022-10-13","2023-01-12",90,null,null,null,null,null,null,"En ejecución",0.9]
[211,2022,"FDLCH-CPS-211-2022","https://community.secop.gov.co/Public/Tendering/OpportunityDetail/Index?noticeUID=CO1.NTC.3404722&isFromPublicArea=True&isModal=true&asPopupView=true","Contratos de prestación de servicios profesionales y de apoyo a la gestión","Contratación directa","Prestación de servicios profesionales y de apoyo a la gestión, o para la ejecución de trabajos artísticos que sólo puedan encomendarse a determinadas personas naturales","Prestar servicios profesionales para el apoyo al área de gestión del desarrollo local de la Alcaldía Local de Chapinero en la formulación, gestión, ejecución, desarrollo y seguimiento de los contratos derivados del proyecto \"CHAPINERO LIDERADO POR LA CIUDADANÍA\" así como el apoyo a la supervisión de los contratos que le sean asignados por el alcalde local.","Inversión","Un nuevo contrato social y ambiental para la Bogotá del Siglo XXI",55,{"$f":"IF(ISERROR(VLOOKUP(K218,[2]Proposito_programa!$C$2:$E$59,2,FALSE)),\" \",VLOOKUP(K218,[2]Proposito_programa!$C$2:$E$59,2,FALSE))","v":"Fortalecimiento de cultura ciudadana y su institucionalidad"},{"$f":"IF(ISERROR(VLOOKUP(K218,[2]Proposito_programa!$C$2:$E$59,3,FALSE)),\" \",VLOOKUP(K218,[2]Proposito_programa!$C$2:$E$59,3,FALSE))","v":"Propósito 5: Construir Bogotá - Región con gobierno abierto, transparente y ciudadanía consciente"},1739,null,52453351,"SANDRA LILIANA JIMENEZ LOPEZ","Persona Natural",null,null,null,null,13800000,0,1,4446667,18246667,8586667,"2022-10-18","2022-10-20","17/02/2023",90,1,29,null,null,null,null,"En ejecución",0.85]
[214,2022,"FDLCH-CCV-214-2022","https://community.secop.gov.co/Public/Tendering/OpportunityDetail/Index?noticeUID=CO1.NTC.3304435&isFromPublicArea=True&isModal=False","Otros","Selección abreviada","Subasta inversa ","Adquirir elementos logísticos para la estación segunda de policia, para el mejoramiento del servicio de policia, seguridad y convivencia en la Localidad de Chapinero.","Inversión","Un nuevo contrato social y ambiental para la Bogotá del Siglo XXI",48,{"$f":"IF(ISERROR(VLOOKUP(K219,[2]Proposito_programa!$C$2:$E$59,2,FALSE)),\" \",VLOOKUP(K219,[2]Proposito_programa!$C$2:$E$59,2,FALSE))","v":"Plataforma institucional para la seguridad y justicia"},{"$f":"IF(ISERROR(VLOOKUP(K219,[2]Proposito_programa!$C$2:$E$59,3,FALSE)),\" \",VLOOKUP(K219,[2]Proposito_programa!$C$2:$E$59,3,FALSE))","v":"Propósito 3: Inspirar confianza y legitimidad para vivir sin miedo y ser epicentro de cultura ciudadana, paz y reconciliación"},1740,4,901011888,"COLOMBIA CONSTRUCCIONES Y DISEÑOS SAS COLCONDI SAS","Persona Jurídica",null,null,null,null,237300000,0,null,null,237300000,null,"2022-10-19","2022-10-24","2023-02-23",120,null,null,null,null,null,null,"En ejecución",0.85]
[215,2022,"FDLCH-CPS-215-2022","https://community.secop.gov.co/Public/Tendering/OpportunityDetail/Index?noticeUID=CO1.NTC.3445901&isFromPublicArea=True&isModal=true&asPopupView=true","Contratos de prestación de servicios profesionales y de apoyo a la gestión","Contratación directa","Prestación de servicios profesionales y de apoyo a la gestión, o para la ejecución de trabajos artísticos que sólo puedan encomendarse a determinadas personas naturales","Prestar servicios de apoyo a la gestión para la atención integral de las víctimas del conflicto armando en el marco del proyecto \"CHAPINERO TERRITORIO DE PAZ Y LA ATENCIÓN DE LAS INSTANCIAS DE PARTICIPACIÓN LOCALES RELACIONADAS CON LA CONSTRUCCIÓN DE PAZ LOCAL\"","Inversión","Un nuevo contrato social y ambiental para la Bogotá del Siglo XXI",39,{"$f":"IF(ISERROR(VLOOKUP(K220,[2]Proposito_programa!$C$2:$E$59,2,FALSE)),\" \",VLOOKUP(K220,[2]Proposito_programa!$C$2:$E$59,2,FALSE))","v":"Bogotá territorio de paz y atención integral a las víctimas del conflicto armado"},{"$f":"IF(ISERROR(VLOOKUP(K220,[2]Proposito_programa!$C$2:$E$59,3,FALSE)),\" \",VLOOKUP(K220,[2]Proposito_programa!$C$2:$E$59,3,FALSE))","v":"Propósito 3: Inspirar confianza y legitimidad para vivir sin miedo y ser epicentro de cultura ciudadana, paz y reconciliación"},2028,null," 46362818","LUZ MARINA DIAZ DIAZ","Persona Natural",null,null,null,null,9900000,0,null,null,9900000,4950000,"2022-11-01","2022-11-01","2023-01-31",90,null,null,null,null,null,null,"En ejecución",0.9]
[217,2022,"FDLCH-CPS-217-2022","https://community.secop.gov.co/Public/Tendering/OpportunityDetail/Index?noticeUID=CO1.NTC.3423462&isFromPublicArea=True&isModal=true&asPopupView=true","Contratos de prestación de servicios profesionales y de apoyo a la gestión","Contratación directa","Prestación de servicios profesionales y de apoyo a la gestión, o para la ejecución de trabajos artísticos que sólo puedan encomendarse a determinadas personas naturales","Prestar servicios profesionales para apoyar la gestión precontractual, contractual y postcontractual que adelante el Fondo de Desarrollo Local de Chapinero.","Inversión","Un nuevo contrato social y ambiental para la Bogotá del Siglo XXI",57,{"$f":"IF(ISERROR(VLOOKUP(K221,[2]Proposito_programa!$C$2:$E$59,2,FALSE)),\" \",VLOOKUP(K221,[2]Proposito_programa!$C$2:$E$59,2,FALSE))","v":"Gestión pública local"},{"$f":"IF(ISERROR(VLOOKUP(K221,[2]Proposito_programa!$C$2:$E$59,3,FALSE)),\" \",VLOOKUP(K221,[2]Proposito_programa!$C$2:$E$59,3,FALSE))","v":"Propósito 5: Construir Bogotá - Región con gobierno abierto, transparente y ciudadanía consciente"},1741,null,1094248111,"YEINI RAQUEL BLANCO MENDOZA","Persona Natural",null,null,null,null,13750000,0,1,5500000,19250000,10083333,"2022-10-21","2022-10-21","2023-02-04",60,1,30,null,null,null,null,"En ejecución",0.85]
[218,2022,"FDLCH-CPS-218-2022","https://community.secop.gov.co/Public/Tendering/OpportunityDetail/Index?noticeUID=CO1.NTC.3424530&isFromPublicArea=True&isModal=true&asPopupView=true","Contratos de prestación de servicios profesionales y de apoyo a la gestión","Contratación directa","Prestación de servicios profesionales y de apoyo a la gestión, o para la ejecución de trabajos artísticos que sólo puedan encomendarse a determinadas personas naturales","Prestar servicios técnicos de apoyo a la gestión para el desarrollo de actividades relacionadas a la gestión del riesgo y cambio climático en la Localidad de Chapinero.","Inversión","Un nuevo contrato social y ambiental para la Bogotá del Siglo XXI",30,{"$f":"IF(ISERROR(VLOOKUP(K222,[2]Proposito_programa!$C$2:$E$59,2,FALSE)),\" \",VLOOKUP(K222,[2]Proposito_programa!$C$2:$E$59,2,FALSE))","v":"Eficiencia en la atención de emergencias"},{"$f":"IF(ISERROR(VLOOKUP(K222,[2]Proposito_programa!$C$2:$E$59,3,FALSE)),\" \",VLOOKUP(K222,[2]Proposito_programa!$C$2:$E$59,3,FALSE))","v":"Propósito 2 : Cambiar Nuestros Hábitos de Vida para Reverdecer a Bogotá y Adaptarnos y Mitigar la Crisis Climática"},1719,null,1075677917,"PAULA TATIANA MORA MENA","Persona Natural",null,null,null,null,9000000,0,1,3000000,12000000,4000000,"2022-10-21","2022-10-21","20/02/2023",90,1,30,null,null,null,null,"En ejecución",0.85]
[219,2022,"FDLCH-CPS-219-2022","https://community.secop.gov.co/Public/Tendering/OpportunityDetail/Index?noticeUID=CO1.NTC.3308543&isFromPublicArea=True&isModal=true&asPopupView=true","Contratos de prestación de servicios","Selección abreviada","Selección abreviada por menor cuantía ","Prestar servicios para realizar eventos deportivos en el marco de presupuestos participativos de la Localidad de Chapinero.","Inversión","Un nuevo contrato social y ambiental para la Bogotá del Siglo XXI",20,{"$f":"IF(ISERROR(VLOOKUP(K223,[2]Proposito_programa!$C$2:$E$59,2,FALSE)),\" \",VLOOKUP(K223,[2]Proposito_programa!$C$2:$E$59,2,FALSE))","v":"Bogotá, referente en cultura, deporte, recreación y actividad física, con parques para el desarrollo y la salud"},{"$f":"IF(ISERROR(VLOOKUP(K223,[2]Proposito_programa!$C$2:$E$59,3,FALSE)),\" \",VLOOKUP(K223,[2]Proposito_programa!$C$2:$E$59,3,FALSE))","v":"Propósito 1: Hacer un nuevo contrato social para incrementar la inclusión social, productiva y política"},1845,11,900251399,"FUNDACION WAYS OF HOPE","Persona Jurídica",null,null,null,null,174562956,0,null,null,174562956,null,"2022-10-21","2022-11-15","2023-06-14",210,null,null,null,null,null,null,"En ejecución",0.35]
[220,2022,"FDLCH-CPS-220-2022","https://community.secop.gov.co/Public/Tendering/OpportunityDetail/Index?noticeUID=CO1.NTC.3304702&isFromPublicArea=True&isModal=true&asPopupView=true","Contratos de prestación de servicios","Licitación pública","No aplica","Prestar servicios para la gestión ambiental territorial con el fin de transformar y/o potencializar situaciones ambientales conflictivas, a través de herramientas de educación ambiental y procesos de formación ambiental para la estimulación y promoción d ehábitos de consumo responsable,separación en la fuente y reciclaje en la Localidad de Chapinero.","Inversión","Un nuevo contrato social y ambiental para la Bogotá del Siglo XXI",27,{"$f":"IF(ISERROR(VLOOKUP(K224,[2]Proposito_programa!$C$2:$E$59,2,FALSE)),\" \",VLOOKUP(K224,[2]Proposito_programa!$C$2:$E$59,2,FALSE))","v":"Cambio cultural para la gestión de la crisis climática"},{"$f":"IF(ISERROR(VLOOKUP(K224,[2]Proposito_programa!$C$2:$E$59,3,FALSE)),\" \",VLOOKUP(K224,[2]Proposito_programa!$C$2:$E$59,3,FALSE))","v":"Propósito 2 : Cambiar Nuestros Hábitos de Vida para Reverdecer a Bogotá y Adaptarnos y Mitigar la Crisis Climática"},1712,12,900017592,"ASOCIACION ARKAMBIENTAL","Persona Jurídica",null,null,null,null,164429000,0,null,null,164429000,null,"2022-10-21","2022-11-21","2023-06-20",210,null,null,null,null,null,null,"En ejecución",0.35]
[220,2022,"FDLCH-CPS-220-2022","https://community.secop.gov.co/Public/Tendering/OpportunityDetail/Index?noticeUID=CO1.NTC.3304702&isFromPublicArea=True&isModal=true&asPopupView=true","Contratos de prestación de servicios","Licitación pública","No aplica","Prestar servicios para la gestión ambiental territorial con el fin de transformar y/o potencializar situaciones ambientales conflictivas, a través de herramientas de educación ambiental y procesos de formación ambiental para la estimulación y promoción d ehábitos de consumo responsable,separación en la fuente y reciclaje en la Localidad de Chapinero.","Inversión","Un nuevo contrato social y ambiental para la Bogotá del Siglo XXI",38,{"$f":"IF(ISERROR(VLOOKUP(K225,[2]Proposito_programa!$C$2:$E$59,2,FALSE)),\" \",VLOOKUP(K225,[2]Proposito_programa!$C$2:$E$59,2,FALSE))","v":"Ecoeficiencia, reciclaje, manejo de residuos e inclusión de la población recicladora"},{"$f":"IF(ISERROR(VLOOKUP(K225,[2]Proposito_programa!$C$2:$E$59,3,FALSE)),\" \",VLOOKUP(K225,[2]Proposito_programa!$C$2:$E$59,3,FALSE))","v":"Propósito 2 : Cambiar Nuestros Hábitos de Vida para Reverdecer a Bogotá y Adaptarnos y Mitigar la Crisis Climática"},1728,null,900017592,"ASOCIACION ARKAMBIENTAL","Persona Jurídica",null,null,null,null,153429000,0,null,null,153429000,0,"2022-10-21","2022-11-21","2023-06-20",null,null,null,null,null,null,null,"En ejecución",0.35]
[221,2022,"FDLCH-CPS-221-2022","https://community.secop.gov.co/Public/Tendering/OpportunityDetail/Index?noticeUID=CO1.NTC.3442063&isFromPublicArea=True&isModal=true&asPopupView=true","Contratos de prestación de servicios profesionales y de apoyo a la gestión","Contratación directa","Prestación de servicios profesionales y de apoyo a la gestión, o para la ejecución de trabajos artísticos que sólo puedan encomendarse a determinadas personas naturales","Brindar apoyo en la implementación de acciones del plan local de convivencia seguridad y justicia y el desarrollo de estrategias de dialogo, mediación convivencia y prevención de conflictividades violencias y delitos en la localidad de chapinero, para mejorar la seguridad y convivencia","Inversión","Un nuevo contrato social y ambiental para la Bogotá del Siglo XXI",48,{"$f":"IF(ISERROR(VLOOKUP(K226,[2]Proposito_programa!$C$2:$E$59,2,FALSE)),\" \",VLOOKUP(K226,[2]Proposito_programa!$C$2:$E$59,2,FALSE))","v":"Plataforma institucional para la seguridad y justicia"},{"$f":"IF(ISERROR(VLOOKUP(K226,[2]Proposito_programa!$C$2:$E$59,3,FALSE)),\" \",VLOOKUP(K226,[2]Proposito_programa!$C$2:$E$59,3,FALSE))","v":"Propósito 3: Inspirar confianza y legitimidad para vivir sin miedo y ser epicentro de cultura ciudadana, paz y reconciliación"},1738,null,1000251989,"PAULA ANDREA BERNAL SALDAÑA","Persona Natural",null,null,null,null,5000000,0,1,1250000,6250000,3750000,"2022-10-25","2022-11-01","2023-01-15",60,1,15,null,null,null,null,"En ejecución",0.9]
[223,2022,"FDLCH-CPS-223-2022","https://community.secop.gov.co/Public/Tendering/OpportunityDetail/Index?noticeUID=CO1.NTC.3436852&isFromPublicArea=True&isModal=true&asPopupView=true","Contratos de prestación de servicios profesionales y de apoyo a la gestión","Contratación directa","Prestación de servicios profesionales y de apoyo a la gestión, o para la ejecución de trabajos artísticos que sólo puedan encomendarse a determinadas personas naturales","Prestar servicios profesionales para el apoyo al área de gestión del desarrollo local de la Alcaldía Local de Chapinero en la formulación, gestión, ejecución y seguimiento de los contratos derivados del proyecto \"CHAPINERO PRODUCTIVO Y EMPRENDEDOR, LA ESTRATEGIA DE MITIGACION Y REACTIVACION ECONOMICA-EMRE LOCAL\" y la supervisión de los contratos que le sean asignados.","Inversión","Un nuevo contrato social y ambiental para la Bogotá del Siglo XXI",6,{"$f":"IF(ISERROR(VLOOKUP(K227,[2]Proposito_programa!$C$2:$E$59,2,FALSE)),\" \",VLOOKUP(K227,[2]Proposito_programa!$C$2:$E$59,2,FALSE))","v":"Sistema Distrital de Cuidado"},{"$f":"IF(ISERROR(VLOOKUP(K227,[2]Proposito_programa!$C$2:$E$59,3,FALSE)),\" \",VLOOKUP(K227,[2]Proposito_programa!$C$2:$E$59,3,FALSE))","v":"Propósito 1: Hacer un nuevo contrato social para incrementar la inclusión social, productiva y política"},1671,null,52861057,"JENNY LORENA PEÑA ORJUELA","Persona Natural",null,null,null,null,9040000,0,null,null,9040000,6780000,"2022-10-24","2022-11-01","2022-12-31",60,null,null,null,null,null,null,"Terminado",1]
[224,2022,"FDLCH-CPS-224-2022","https://community.secop.gov.co/Public/Tendering/OpportunityDetail/Index?noticeUID=CO1.NTC.3429065&isFromPublicArea=True&isModal=true&asPopupView=true","Contratos de prestación de servicios profesionales y de apoyo a la gestión","Contratación directa","Prestación de servicios profesionales y de apoyo a la gestión, o para la ejecución de trabajos artísticos que sólo puedan encomendarse a determinadas personas naturales","Prestar servicios profesionales para apoyar jurídicamente las respuestas a distintas instancias, relacionadas con solicitudes allegadas a la Alcaldía Local de Chapinero.","Inversión","Un nuevo contrato social y ambiental para la Bogotá del Siglo XXI",57,{"$f":"IF(ISERROR(VLOOKUP(K228,[2]Proposito_programa!$C$2:$E$59,2,FALSE)),\" \",VLOOKUP(K228,[2]Proposito_programa!$C$2:$E$59,2,FALSE))","v":"Gestión pública local"},{"$f":"IF(ISERROR(VLOOKUP(K228,[2]Proposito_programa!$C$2:$E$59,3,FALSE)),\" \",VLOOKUP(K228,[2]Proposito_programa!$C$2:$E$59,3,FALSE))","v":"Propósito 5: Construir Bogotá - Región con gobierno abierto, transparente y ciudadanía consciente"},1841,null,1010190690,"ADRIANA ANDREA ARCHILA MOSCOSO","Persona Natural",null,null,null,null,13800000,0,null,null,13800000,5366667,"2022-10-21","2022-10-26","2023-01-25",90,null,null,null,null,null,null,"En ejecución",0.9]
[225,2022,"FDLCH-CPS-225-2022","https://community.secop.gov.co/Public/Tendering/OpportunityDetail/Index?noticeUID=CO1.NTC.3429903&isFromPublicArea=True&isModal=true&asPopupView=true","Contratos de prestación de servicios profesionales y de apoyo a la gestión","Contratación directa","Prestación de servicios profesionales y de apoyo a la gestión, o para la ejecución de trabajos artísticos que sólo puedan encomendarse a determinadas personas naturales","Prestar servicios profesionales para apoyar la gestión precontractual, contractual y postcontractual que adelante el Fondo de Desarrollo Local de Chapinero.","Inversión","Un nuevo contrato social y ambiental para la Bogotá del Siglo XXI",57,{"$f":"IF(ISERROR(VLOOKUP(K229,[2]Proposito_programa!$C$2:$E$59,2,FALSE)),\" \",VLOOKUP(K229,[2]Proposito_programa!$C$2:$E$59,2,FALSE))","v":"Gestión pública local"},{"$f":"IF(ISERROR(VLOOKUP(K229,[2]Proposito_programa!$C$2:$E$59,3,FALSE)),\" \",VLOOKUP(K229,[2]Proposito_programa!$C$2:$E$59,3,FALSE))","v":"Propósito 5: Construir Bogotá - Región con gobierno abierto, transparente y ciudadanía consciente"},1741,null,1144193027,"JUAN FERNANDO VILLEGAS MOTOA","Persona Natural",null,null,null,null,11450000,-7328000,null,null,4122000,4122000,"2022-10-21","2022-10-21","2022-11-18",60,null,null,null,null,null,null,"Terminado",1]
[226,2022,"FDLCH-CPS-226-2022","https://community.secop.gov.co/Public/Tendering/OpportunityDetail/Index?noticeUID=CO1.NTC.3436748&isFromPublicArea=True&isModal=true&asPopupView=true","Contratos de prestación de servicios profesionales y de apoyo a la gestión","Contratación directa","Prestación de servicios profesionales y de apoyo a la gestión, o para la ejecución de trabajos artísticos que sólo puedan encomendarse a determinadas personas naturales","Prestar servicios de apoyo a la gestión del desarrollo local en las actividades y estrategias de fomento y promoción de la reactivación económica local, el fortalecimiento de los emprendimientos y de las pequeñas y medianas empresas locales.","Inversión","Un nuevo contrato social y ambiental para la Bogotá del Siglo XXI",6,{"$f":"IF(ISERROR(VLOOKUP(K230,[2]Proposito_programa!$C$2:$E$59,2,FALSE)),\" \",VLOOKUP(K230,[2]Proposito_programa!$C$2:$E$59,2,FALSE))","v":"Sistema Distrital de Cuidado"},{"$f":"IF(ISERROR(VLOOKUP(K230,[2]Proposito_programa!$C$2:$E$59,3,FALSE)),\" \",VLOOKUP(K230,[2]Proposito_programa!$C$2:$E$59,3,FALSE))","v":"Propósito 1: Hacer un nuevo contrato social para incrementar la inclusión social, productiva y política"},1671,null,80076642,"WILMAR YOBANY PARADA PEREZ","Persona Natural",null,null,null,null,6250000,0,null,null,6250000,3750000,"2022-10-24","2022-11-01","2023-01-15",60,null,null,null,null,null,null,"En ejecución",0.9]
[227,2022,"FDLCH-CPS-227-2022","https://community.secop.gov.co/Public/Tendering/OpportunityDetail/Index?noticeUID=CO1.NTC.3438672&isFromPublicArea=True&isModal=true&asPopupView=true","Contratos de prestación de servicios profesionales y de apoyo a la gestión","Contratación directa","Prestación de servicios profesionales y de apoyo a la gestión, o para la ejecución de trabajos artísticos que sólo puedan encomendarse a determinadas personas naturales","Prestar servicios de apoyo a la gestión en la ejecución de las actividades administrativas y documentales relacionadas con la gestión policiva en la Alcaldía Local de Chapinero.","Inversión","Un nuevo contrato social y ambiental para la Bogotá del Siglo XXI",57,{"$f":"IF(ISERROR(VLOOKUP(K231,[2]Proposito_programa!$C$2:$E$59,2,FALSE)),\" \",VLOOKUP(K231,[2]Proposito_programa!$C$2:$E$59,2,FALSE))","v":"Gestión pública local"},{"$f":"IF(ISERROR(VLOOKUP(K231,[2]Proposito_programa!$C$2:$E$59,3,FALSE)),\" \",VLOOKUP(K231,[2]Proposito_programa!$C$2:$E$59,3,FALSE))","v":"Propósito 5: Construir Bogotá - Región con gobierno abierto, transparente y ciudadanía consciente"},1841,null,52253361,"OLGA LUCIA OBANDO CHACA","Persona Natural",null,null,null,null,4400000,0,null,null,4400000,2200000,"2022-10-31","2022-11-01","2022-12-31",60,null,null,null,null,null,null,"Terminado",1]
[228,2022,"FDLCH-CPS-228-2022","https://community.secop.gov.co/Public/Tendering/OpportunityDetail/Index?noticeUID=CO1.NTC.3429059&isFromPublicArea=True&isModal=true&asPopupView=true","Contratos de prestación de servicios profesionales y de apoyo a la gestión","Contratación directa","Prestación de servicios profesionales y de apoyo a la gestión, o para la ejecución de trabajos artísticos que sólo puedan encomendarse a determinadas personas naturales","Prestar servicios profesionales para la gestión, desarrollo, seguimiento y evaluación jurídica pre-contractual, contractual y postcontractual del proyecto de inversión \"Chapinero modelo de movilidad inteligente” y las demás relacionadas con el proyecto.","Inversión","Un nuevo contrato social y ambiental para la Bogotá del Siglo XXI",49,{"$f":"IF(ISERROR(VLOOKUP(K232,[2]Proposito_programa!$C$2:$E$59,2,FALSE)),\" \",VLOOKUP(K232,[2]Proposito_programa!$C$2:$E$59,2,FALSE))","v":"Movilidad segura, sostenible y accesible"},{"$f":"IF(ISERROR(VLOOKUP(K232,[2]Proposito_programa!$C$2:$E$59,3,FALSE)),\" \",VLOOKUP(K232,[2]Proposito_programa!$C$2:$E$59,3,FALSE))","v":"Propósito 4: Hacer de Bogotá Región un modelo de movilidad multimodal, incluyente y sostenible"},1734,null,1057590689,"ELMER RICARDO RINCON PLAZAS","Persona Natural",null,null,null,null,15500000,0,null,null,15500000,11366667,"2022-10-21","2022-10-21","2023-01-04",60,null,null,null,null,null,null,"Terminado",1]
[229,2022,"FDLCH-CPS-229-2022","https://community.secop.gov.co/Public/Tendering/OpportunityDetail/Index?noticeUID=CO1.NTC.3440683&isFromPublicArea=True&isModal=true&asPopupView=true","Contratos de prestación de servicios profesionales y de apoyo a la gestión","Contratación directa","Prestación de servicios profesionales y de apoyo a la gestión, o para la ejecución de trabajos artísticos que sólo puedan encomendarse a determinadas personas naturales","Prestar servicios profesionales para apoyar el área de Gestión del Desarrollo Local de la Alcaldía Local de Chapinero, en la formulación, gestión, ejecución y apoyo a la supervisión de los proyectos relacionados con las estrategias y metas relacionadas con el programa Sistema Distrital de Cuidado y el proyecto Chapinero te cuida, en el marco de la política de fortalecimiento de las organizaciones de mujeres y de género.","Inversión","Un nuevo contrato social y ambiental para la Bogotá del Siglo XXI",6,{"$f":"IF(ISERROR(VLOOKUP(K233,[2]Proposito_programa!$C$2:$E$59,2,FALSE)),\" \",VLOOKUP(K233,[2]Proposito_programa!$C$2:$E$59,2,FALSE))","v":"Sistema Distrital de Cuidado"},{"$f":"IF(ISERROR(VLOOKUP(K233,[2]Proposito_programa!$C$2:$E$59,3,FALSE)),\" \",VLOOKUP(K233,[2]Proposito_programa!$C$2:$E$59,3,FALSE))","v":"Propósito 1: Hacer un nuevo contrato social para incrementar la inclusión social, productiva y política"},1855,null,1110505182,"MONICA LILIANA TOLEDO CHAVARRO","Persona Natural",null,null,null,null,12500000,0,1,6166667,18666667,8333333,"2022-10-25","2022-10-26","16/02/2023",60,1,37,null,null,null,null,"En ejecución",0.85]
[230,2022,"FDLCH-CPS-230-2022","https://community.secop.gov.co/Public/Tendering/OpportunityDetail/Index?noticeUID=CO1.NTC.3431800&isFromPublicArea=True&isModal=true&asPopupView=true","Contratos de prestación de servicios profesionales y de apoyo a la gestión","Contratación directa","Prestación de servicios profesionales y de apoyo a la gestión, o para la ejecución de trabajos artísticos que sólo puedan encomendarse a determinadas personas naturales","Apoyar al Alcalde Local de Chapinero en la atención, el fortalecimiento e inclusión de las comunidades étnicas en los diferentes procesos locales.","Inversión","Un nuevo contrato social y ambiental para la Bogotá del Siglo XXI",6,{"$f":"IF(ISERROR(VLOOKUP(K234,[2]Proposito_programa!$C$2:$E$59,2,FALSE)),\" \",VLOOKUP(K234,[2]Proposito_programa!$C$2:$E$59,2,FALSE))","v":"Sistema Distrital de Cuidado"},{"$f":"IF(ISERROR(VLOOKUP(K234,[2]Proposito_programa!$C$2:$E$59,3,FALSE)),\" \",VLOOKUP(K234,[2]Proposito_programa!$C$2:$E$59,3,FALSE))","v":"Propósito 1: Hacer un nuevo contrato social para incrementar la inclusión social, productiva y política"},2024,null,1122783927,"SANDRA CLAUDIA CHINDOY JAMIOY","Persona Natural",null,null,null,null,13542000,0,null,null,13542000,4514000,"2022-10-22","2022-11-01","2023-01-31",90,null,null,null,null,null,null,"En ejecución",0.9]
[231,2022,"FDLCH-CPS-231-2022","https://community.secop.gov.co/Public/Tendering/OpportunityDetail/Index?noticeUID=CO1.NTC.3440075&isFromPublicArea=True&isModal=true&asPopupView=true","Contratos de prestación de servicios profesionales y de apoyo a la gestión","Contratación directa","Prestación de servicios profesionales y de apoyo a la gestión, o para la ejecución de trabajos artísticos que sólo puedan encomendarse a determinadas personas naturales","Prestar servicios de apoyo a la gestión para desarrollar las actividades de radicación, gestión de correspondencia y de la documentación que expide, se allega y controla de la Alcaldía Local de Chapinero.","Inversión","Un nuevo contrato social y ambiental para la Bogotá del Siglo XXI",57,{"$f":"IF(ISERROR(VLOOKUP(K235,[2]Proposito_programa!$C$2:$E$59,2,FALSE)),\" \",VLOOKUP(K235,[2]Proposito_programa!$C$2:$E$59,2,FALSE))","v":"Gestión pública local"},{"$f":"IF(ISERROR(VLOOKUP(K235,[2]Proposito_programa!$C$2:$E$59,3,FALSE)),\" \",VLOOKUP(K235,[2]Proposito_programa!$C$2:$E$59,3,FALSE))","v":"Propósito 5: Construir Bogotá - Región con gobierno abierto, transparente y ciudadanía consciente"},1741,null,1023007285,"JENNYFER MARIA SAUCEDO FUENTES","Persona Natural",null,null,null,null,4937500,0,null,null,4937500,3357500,"2022-10-25","2022-10-25","2023-01-08",60,null,null,null,null,null,null,"Terminado",1]
[232,2022,"FDLCH-CPS-232-2022","https://community.secop.gov.co/Public/Tendering/OpportunityDetail/Index?noticeUID=CO1.NTC.3445823&isFromPublicArea=True&isModal=true&asPopupView=true","Contratos de prestación de servicios profesionales y de apoyo a la gestión","Contratación directa","Prestación de servicios profesionales y de apoyo a la gestión, o para la ejecución de trabajos artísticos que sólo puedan encomendarse a determinadas personas naturales","Prestar servicios profesionales para apoyar al area de Gestion del Desarrollo Local de la Alcaldía Local de Chapinero en la formulacion gestion ejecucion y seguimiento de los contratos derivados del proyecto de inversión Chapinero cultural y creativa y la supervision de contratos que le sean asignados.","Inversión","Un nuevo contrato social y ambiental para la Bogotá del Siglo XXI",21,{"$f":"IF(ISERROR(VLOOKUP(K236,[2]Proposito_programa!$C$2:$E$59,2,FALSE)),\" \",VLOOKUP(K236,[2]Proposito_programa!$C$2:$E$59,2,FALSE))","v":"Creación y vida cotidiana: Apropiación ciudadana del arte, la cultura y el patrimonio, para la democracia cultural"},{"$f":"IF(ISERROR(VLOOKUP(K236,[2]Proposito_programa!$C$2:$E$59,3,FALSE)),\" \",VLOOKUP(K236,[2]Proposito_programa!$C$2:$E$59,3,FALSE))","v":"Propósito 1: Hacer un nuevo contrato social para incrementar la inclusión social, productiva y política"},1848,null,55061809,"CLAUDIA YANETH FERRO DUCUARA","Persona Natural",null,null,null,null,10000000,0,1,2333333,12333333,8166667,"2022-10-26","2022-10-27","2023-01-09",60,1,14,null,null,null,null,"Terminado",1]
[233,2022,"FDLCH-CPS-233-2022","https://community.secop.gov.co/Public/Tendering/OpportunityDetail/Index?noticeUID=CO1.NTC.3445546&isFromPublicArea=True&isModal=true&asPopupView=true","Contratos de prestación de servicios profesionales y de apoyo a la gestión","Contratación directa","Prestación de servicios profesionales y de apoyo a la gestión, o para la ejecución de trabajos artísticos que sólo puedan encomendarse a determinadas personas naturales","Prestar servicios profesionales para apoyar al equipo de prensa y comunicaciones de la Alcaldía Local en la realización de productos y piezas digitales, impresas y publicitarias de gran formato y de animación gráfica, así como apoyar la producción y montaje de eventos","Inversión","Un nuevo contrato social y ambiental para la Bogotá del Siglo XXI",57,{"$f":"IF(ISERROR(VLOOKUP(K237,[2]Proposito_programa!$C$2:$E$59,2,FALSE)),\" \",VLOOKUP(K237,[2]Proposito_programa!$C$2:$E$59,2,FALSE))","v":"Gestión pública local"},{"$f":"IF(ISERROR(VLOOKUP(K237,[2]Proposito_programa!$C$2:$E$59,3,FALSE)),\" \",VLOOKUP(K237,[2]Proposito_programa!$C$2:$E$59,3,FALSE))","v":"Propósito 5: Construir Bogotá - Región con gobierno abierto, transparente y ciudadanía consciente"},1741,null,1026269094,"EIDER EMIR HERNANDEZ POLANCO","Persona Natural",null,null,null,null,9160000,0,1,4580000,13740000,7480667,"2022-10-26","2022-10-27","2023-01-26",60,1,30,null,null,null,null,"En ejecución",0.9]
[234,2022,"FDLCH-CPS-234-2022","https://community.secop.gov.co/Public/Tendering/OpportunityDetail/Index?noticeUID=CO1.NTC.3440864&isFromPublicArea=True&isModal=true&asPopupView=true","Contratos de prestación de servicios profesionales y de apoyo a la gestión","Contratación directa","Prestación de servicios profesionales y de apoyo a la gestión, o para la ejecución de trabajos artísticos que sólo puedan encomendarse a determinadas personas naturales","Prestar servicios profesionales para apoyar técnicamente las actuaciones administrativas, impulso procesal y de inspección, vigilancia y control de competencia de la Alcaldía Local de Chapinero.","Inversión","Un nuevo contrato social y ambiental para la Bogotá del Siglo XXI",57,{"$f":"IF(ISERROR(VLOOKUP(K238,[2]Proposito_programa!$C$2:$E$59,2,FALSE)),\" \",VLOOKUP(K238,[2]Proposito_programa!$C$2:$E$59,2,FALSE))","v":"Gestión pública local"},{"$f":"IF(ISERROR(VLOOKUP(K238,[2]Proposito_programa!$C$2:$E$59,3,FALSE)),\" \",VLOOKUP(K238,[2]Proposito_programa!$C$2:$E$59,3,FALSE))","v":"Propósito 5: Construir Bogotá - Región con gobierno abierto, transparente y ciudadanía consciente"},1841,null,80799927,"SALOMON RODRIGUEZ LAGUNA","Persona Natural",null,null,null,null,9800000,0,1,4900000,14700000,8330000,"2022-10-25","2022-10-25","2023-01-24",60,1,30,null,null,null,null,"En ejecución",0.9]
[235,2022,"FDLCH-CPS-235-2022","https://community.secop.gov.co/Public/Tendering/OpportunityDetail/Index?noticeUID=CO1.NTC.3440568&isFromPublicArea=True&isModal=true&asPopupView=true","Contratos de prestación de servicios profesionales y de apoyo a la gestión","Contratación directa","Prestación de servicios profesionales y de apoyo a la gestión, o para la ejecución de trabajos artísticos que sólo puedan encomendarse a determinadas personas naturales","Prestar servicios profesionales para apoyar técnicamente las actuaciones administrativas impulso procesal y de inspección vigilancia y control de competencia de la Alcaldía Local de Chapinero.","Inversión","Un nuevo contrato social y ambiental para la Bogotá del Siglo XXI",57,{"$f":"IF(ISERROR(VLOOKUP(K239,[2]Proposito_programa!$C$2:$E$59,2,FALSE)),\" \",VLOOKUP(K239,[2]Proposito_programa!$C$2:$E$59,2,FALSE))","v":"Gestión pública local"},{"$f":"IF(ISERROR(VLOOKUP(K239,[2]Proposito_programa!$C$2:$E$59,3,FALSE)),\" \",VLOOKUP(K239,[2]Proposito_programa!$C$2:$E$59,3,FALSE))","v":"Propósito 5: Construir Bogotá - Región con gobierno abierto, transparente y ciudadanía consciente"},1841,null,80825882,"CARLOS ANDRES GIL RUEDA","Persona Natural",null,null,null,null,9800000,0,1,2450000,12250000,8166667,"2022-10-25","2022-10-26","2023-01-09",60,1,15,null,null,null,null,"Terminado",1]
[236,2022,"FDLCH-CPS-236-2022","https://community.secop.gov.co/Public/Tendering/OpportunityDetail/Index?noticeUID=CO1.NTC.3437792&isFromPublicArea=True&isModal=true&asPopupView=true","Contratos de prestación de servicios profesionales y de apoyo a la gestión","Contratación directa","Prestación de servicios profesionales y de apoyo a la gestión, o para la ejecución de trabajos artísticos que sólo puedan encomendarse a determinadas personas naturales","Prestar servicios profesionales para apoyar tecnicamente las actuaciones administrativas, impulso procesar y de inspección, vigilancia y control de competencia de la Alcaldía Local de Chapinero.","Inversión","Un nuevo contrato social y ambiental para la Bogotá del Siglo XXI",57,{"$f":"IF(ISERROR(VLOOKUP(K240,[2]Proposito_programa!$C$2:$E$59,2,FALSE)),\" \",VLOOKUP(K240,[2]Proposito_programa!$C$2:$E$59,2,FALSE))","v":"Gestión pública local"},{"$f":"IF(ISERROR(VLOOKUP(K240,[2]Proposito_programa!$C$2:$E$59,3,FALSE)),\" \",VLOOKUP(K240,[2]Proposito_programa!$C$2:$E$59,3,FALSE))","v":"Propósito 5: Construir Bogotá - Región con gobierno abierto, transparente y ciudadanía consciente"},1841,null,52308262,"IRISAYDEE NOVOA MEDELLIN","Persona Natural",null,null,null,null,9800000,0,1,2450000,12250000,5716667,"2022-10-25","2022-10-26","2023-01-09",60,1,15,null,null,null,null,"Terminado",1]
[237,2022,"FDLCH-CPS-237-2022","https://community.secop.gov.co/Public/Tendering/OpportunityDetail/Index?noticeUID=CO1.NTC.3455571&isFromPublicArea=True&isModal=true&asPopupView=true","Contratos de prestación de servicios profesionales y de apoyo a la gestión","Contratación directa","Prestación de servicios profesionales y de apoyo a la gestión, o para la ejecución de trabajos artísticos que sólo puedan encomendarse a determinadas personas naturales","Prestar servicios profesionales de apoyo para la gestión formulación, desarrollo y seguimiento del proyecto de inversión no. 1715 chapinero restaurador y cuidador del territorio.","Inversión","Un nuevo contrato social y ambiental para la Bogotá del Siglo XXI",28,{"$f":"IF(ISERROR(VLOOKUP(K241,[2]Proposito_programa!$C$2:$E$59,2,FALSE)),\" \",VLOOKUP(K241,[2]Proposito_programa!$C$2:$E$59,2,FALSE))","v":"Bogotá protectora de sus recursos naturales"},{"$f":"IF(ISERROR(VLOOKUP(K241,[2]Proposito_programa!$C$2:$E$59,3,FALSE)),\" \",VLOOKUP(K241,[2]Proposito_programa!$C$2:$E$59,3,FALSE))","v":"Propósito 2 : Cambiar Nuestros Hábitos de Vida para Reverdecer a Bogotá y Adaptarnos y Mitigar la Crisis Climática"},1715,null,11442710,"TITO FABIAN RUIZ BARAJAS","Persona Natural",null,null,null,null,10000000,0,1,2500000,12500000,7333333,"2022-10-28","2022-11-02","16/01/2023",60,1,15,null,null,null,null,"En ejecución",0.9]
[238,2022,"FDLCH-CPS-238-2022","https://community.secop.gov.co/Public/Tendering/OpportunityDetail/Index?noticeUID=CO1.NTC.3468283&isFromPublicArea=True&isModal=true&asPopupView=true","Contratos de prestación de servicios profesionales y de apoyo a la gestión","Contratación directa","Prestación de servicios profesionales y de apoyo a la gestión, o para la ejecución de trabajos artísticos que sólo puedan encomendarse a determinadas personas naturales","Prestar servicios profesionales para apoyar al equipo de prensa y comunicaciones de la Alcaldía Local en la realización y publicación de contenidos de redes sociales y canales de divulgación digital (sitio web) de la Alcaldía Local.","Inversión","Un nuevo contrato social y ambiental para la Bogotá del Siglo XXI",57,{"$f":"IF(ISERROR(VLOOKUP(K242,[2]Proposito_programa!$C$2:$E$59,2,FALSE)),\" \",VLOOKUP(K242,[2]Proposito_programa!$C$2:$E$59,2,FALSE))","v":"Gestión pública local"},{"$f":"IF(ISERROR(VLOOKUP(K242,[2]Proposito_programa!$C$2:$E$59,3,FALSE)),\" \",VLOOKUP(K242,[2]Proposito_programa!$C$2:$E$59,3,FALSE))","v":"Propósito 5: Construir Bogotá - Región con gobierno abierto, transparente y ciudadanía consciente"},1741,null,1070016439,"DANIEL ANTONIO RODRIGUEZ VENEGAS","Persona Natural",null,null,null,null,10344000,0,1,5172000,15516000,7758000,"2022-11-01","2022-11-01","2023-01-31",60,1,30,null,null,null,null,"En ejecución",0.9]
[239,2022,"FDLCH-CPS-239-2022","https://community.secop.gov.co/Public/Tendering/OpportunityDetail/Index?noticeUID=CO1.NTC.3469112&isFromPublicArea=True&isModal=true&asPopupView=true","Contratos de prestación de servicios profesionales y de apoyo a la gestión","Contratación directa","Prestación de servicios profesionales y de apoyo a la gestión, o para la ejecución de trabajos artísticos que sólo puedan encomendarse a determinadas personas naturales","Prestación de servicios profesionales para la atención integral del manejo de las comisiones judiciales ordenadas por las autoridades jurisdiccionales y prestar apoyo en las actuaciones administrativas y policivas compentencia de la Alcaldía Local de Chapinero.","Inversión","Un nuevo contrato social y ambiental para la Bogotá del Siglo XXI",57,{"$f":"IF(ISERROR(VLOOKUP(K243,[2]Proposito_programa!$C$2:$E$59,2,FALSE)),\" \",VLOOKUP(K243,[2]Proposito_programa!$C$2:$E$59,2,FALSE))","v":"Gestión pública local"},{"$f":"IF(ISERROR(VLOOKUP(K243,[2]Proposito_programa!$C$2:$E$59,3,FALSE)),\" \",VLOOKUP(K243,[2]Proposito_programa!$C$2:$E$59,3,FALSE))","v":"Propósito 5: Construir Bogotá - Región con gobierno abierto, transparente y ciudadanía consciente"},1841,null,79571483,"IVAN DARIO PINZON MARTINEZ","Persona Natural",null,null,null,null,10000000,0,null,null,10000000,7000000,"2022-11-02","2022-11-03","2023-01-02",60,null,null,null,null,null,null,"Terminado",1]
[240,2022,"FDLCH-CPS-240-2022","https://community.secop.gov.co/Public/Tendering/OpportunityDetail/Index?noticeUID=CO1.NTC.3444355&isFromPublicArea=True&isModal=true&asPopupView=true","Contratos de prestación de servicios profesionales y de apoyo a la gestión","Contratación directa","Prestación de servicios profesionales y de apoyo a la gestión, o para la ejecución de trabajos artísticos que sólo puedan encomendarse a determinadas personas naturales","Prestar servicios profesionales de apoyo a la gestión para el desarrollo de actividades relacionadas con la formulación, seguimiento, terminación y cierre de proyectos de inversión relacionados con el desarrollo de la productividad rural en el marco del proyecto de inversión Chapinero rural y productivo.","Inversión","Un nuevo contrato social y ambiental para la Bogotá del Siglo XXI",23,{"$f":"IF(ISERROR(VLOOKUP(K244,[2]Proposito_programa!$C$2:$E$59,2,FALSE)),\" \",VLOOKUP(K244,[2]Proposito_programa!$C$2:$E$59,2,FALSE))","v":"Bogotá rural"},{"$f":"IF(ISERROR(VLOOKUP(K244,[2]Proposito_programa!$C$2:$E$59,3,FALSE)),\" \",VLOOKUP(K244,[2]Proposito_programa!$C$2:$E$59,3,FALSE))","v":"Propósito 1: Hacer un nuevo contrato social para incrementar la inclusión social, productiva y política"},1827,null,1024531062,"LIBARDO FERNANDEZ ALMANZA","Persona Natural",null,null,null,null,10000000,0,1,5000000,15000000,7500000,"2022-11-01","2022-11-01","2023-01-31",60,1,30,null,null,null,null,"En ejecución",0.9]
[241,2022,"FDLCH-CPS-241-2022","https://community.secop.gov.co/Public/Tendering/OpportunityDetail/Index?noticeUID=CO1.NTC.3444299&isFromPublicArea=True&isModal=true&asPopupView=true","Contratos de prestación de servicios profesionales y de apoyo a la gestión","Contratación directa","Prestación de servicios profesionales y de apoyo a la gestión, o para la ejecución de trabajos artísticos que sólo puedan encomendarse a determinadas personas naturales","Apoyar jurídicamente la ejecución de las acciones reuqeridas para la depuración de las actuaciones administrativas que cursan en la Alcaldía Local.","Inversión","Un nuevo contrato social y ambiental para la Bogotá del Siglo XXI",57,{"$f":"IF(ISERROR(VLOOKUP(K245,[2]Proposito_programa!$C$2:$E$59,2,FALSE)),\" \",VLOOKUP(K245,[2]Proposito_programa!$C$2:$E$59,2,FALSE))","v":"Gestión pública local"},{"$f":"IF(ISERROR(VLOOKUP(K245,[2]Proposito_programa!$C$2:$E$59,3,FALSE)),\" \",VLOOKUP(K245,[2]Proposito_programa!$C$2:$E$59,3,FALSE))","v":"Propósito 5: Construir Bogotá - Región con gobierno abierto, transparente y ciudadanía consciente"},1841,null,1070021566,"MAUREN DARLINE FORERO RONCANCIO","Persona Natural",null,null,null,null,11500000,0,null,null,11500000,4600000,"2022-10-31","2022-11-01","2023-01-15",60,null,null,null,null,null,null,"En ejecución",0.9]
[242,2022,"FDLCH-CPS-242-2022","https://community.secop.gov.co/Public/Tendering/OpportunityDetail/Index?noticeUID=CO1.NTC.3444357&isFromPublicArea=True&isModal=true&asPopupView=true","Contratos de prestación de servicios profesionales y de apoyo a la gestión","Contratación directa","Prestación de servicios profesionales y de apoyo a la gestión, o para la ejecución de trabajos artísticos que sólo puedan encomendarse a determinadas personas naturales","Prestar servicios profesionales de apoyo y jurídicamente el seguimiento, supervisión estrategica y sustanciaciónd e procesos de competnencia de la Alcaldía Local de Chapinero, anteriores a la entrada en vigencia de la Ley 1801 DE 2016","Inversión","Un nuevo contrato social y ambiental para la Bogotá del Siglo XXI",57,{"$f":"IF(ISERROR(VLOOKUP(K246,[2]Proposito_programa!$C$2:$E$59,2,FALSE)),\" \",VLOOKUP(K246,[2]Proposito_programa!$C$2:$E$59,2,FALSE))","v":"Gestión pública local"},{"$f":"IF(ISERROR(VLOOKUP(K246,[2]Proposito_programa!$C$2:$E$59,3,FALSE)),\" \",VLOOKUP(K246,[2]Proposito_programa!$C$2:$E$59,3,FALSE))","v":"Propósito 5: Construir Bogotá - Región con gobierno abierto, transparente y ciudadanía consciente"},1841,null,1032492446,"ALVARO JUNIOR CUBILLOS RUIZ","Persona Natural",null,null,null,null,11500000,0,null,null,11500000,6900000,"2022-11-01","2022-11-01","2023-01-15",60,null,null,null,null,null,null,"En ejecución",0.9]
[243,2022,"FDLCH-CPS-243-2022","https://community.secop.gov.co/Public/Tendering/OpportunityDetail/Index?noticeUID=CO1.NTC.3438495&isFromPublicArea=True&isModal=true&asPopupView=true","Contratos de prestación de servicios profesionales y de apoyo a la gestión","Contratación directa","Prestación de servicios profesionales y de apoyo a la gestión, o para la ejecución de trabajos artísticos que sólo puedan encomendarse a determinadas personas naturales","Prestar servicios profesionales para apoyar las liquidaciones de contratos, la gestión precontractual, contractual y postcontractual, que adelante el Fondo de Desarrollo Local de Chapinero.","Inversión","Un nuevo contrato social y ambiental para la Bogotá del Siglo XXI",57,{"$f":"IF(ISERROR(VLOOKUP(K247,[2]Proposito_programa!$C$2:$E$59,2,FALSE)),\" \",VLOOKUP(K247,[2]Proposito_programa!$C$2:$E$59,2,FALSE))","v":"Gestión pública local"},{"$f":"IF(ISERROR(VLOOKUP(K247,[2]Proposito_programa!$C$2:$E$59,3,FALSE)),\" \",VLOOKUP(K247,[2]Proposito_programa!$C$2:$E$59,3,FALSE))","v":"Propósito 5: Construir Bogotá - Región con gobierno abierto, transparente y ciudadanía consciente"},1741,null,52900762,"JENNY CAROLINA GIRON CUERVO","Persona Natural",null,null,null,null,12000000,0,1,6000000,18000000,10000000,"2022-10-25","2022-10-26","2023-01-25",60,1,30,null,null,null,null,"En ejecución",0.9]
[244,2022,"FDLCH-CPS-244-2022","https://community.secop.gov.co/Public/Tendering/OpportunityDetail/Index?noticeUID=CO1.NTC.3444217&isFromPublicArea=True&isModal=true&asPopupView=true","Contratos de prestación de servicios profesionales y de apoyo a la gestión","Contratación directa","Prestación de servicios profesionales y de apoyo a la gestión, o para la ejecución de trabajos artísticos que sólo puedan encomendarse a determinadas personas naturales","Prestar los servicios profesionales de apoyo a la gestión, desarrollo interinstitucional, seguimiento interadministrativo y acciones para la implementación del proyecto de inversión\"CHAPINERO MODELO DE MOVILIDAD INTELIGENTE\".","Inversión","Un nuevo contrato social y ambiental para la Bogotá del Siglo XXI",49,{"$f":"IF(ISERROR(VLOOKUP(K248,[2]Proposito_programa!$C$2:$E$59,2,FALSE)),\" \",VLOOKUP(K248,[2]Proposito_programa!$C$2:$E$59,2,FALSE))","v":"Movilidad segura, sostenible y accesible"},{"$f":"IF(ISERROR(VLOOKUP(K248,[2]Proposito_programa!$C$2:$E$59,3,FALSE)),\" \",VLOOKUP(K248,[2]Proposito_programa!$C$2:$E$59,3,FALSE))","v":"Propósito 4: Hacer de Bogotá Región un modelo de movilidad multimodal, incluyente y sostenible"},1734,null,1049633831,"ADRIANA MILENA FAURA PUENTES","Persona Natural",null,null,null,null,9040000,0,1,4520000,13560000,7382667,"2022-10-26","2022-10-27","2023-01-26",60,1,30,null,null,null,null,"En ejecución",0.9]
[245,2022,"FDLCH-CPS-245-2022","https://community.secop.gov.co/Public/Tendering/OpportunityDetail/Index?noticeUID=CO1.NTC.3450924&isFromPublicArea=True&isModal=False","Contratos de prestación de servicios profesionales y de apoyo a la gestión","Contratación directa","Prestación de servicios profesionales y de apoyo a la gestión, o para la ejecución de trabajos artísticos que sólo puedan encomendarse a determinadas personas naturales","Prestar servicios profesionales para la gestión, formulación, desarrollo, seguimiento y evaluación del proyecto de inversión \"CHAPINERO PRODUCTIVO Y EMPRENDEDOR LA ESTRATEGIA DE MITIGACIÓN Y REACTIVACIÓN ECONÓMICA- EMRE LOCAL\" y la supervisión de contratos que le sean asignados.","Inversión","Un nuevo contrato social y ambiental para la Bogotá del Siglo XXI",6,{"$f":"IF(ISERROR(VLOOKUP(K249,[2]Proposito_programa!$C$2:$E$59,2,FALSE)),\" \",VLOOKUP(K249,[2]Proposito_programa!$C$2:$E$59,2,FALSE))","v":"Sistema Distrital de Cuidado"},{"$f":"IF(ISERROR(VLOOKUP(K249,[2]Proposito_programa!$C$2:$E$59,3,FALSE)),\" \",VLOOKUP(K249,[2]Proposito_programa!$C$2:$E$59,3,FALSE))","v":"Propósito 1: Hacer un nuevo contrato social para incrementar la inclusión social, productiva y política"},1671,null,60256522,"NUBIA CONSTANZA MOGOLLON ACEVEDO","Persona Natural",null,null,null,null,12500000,0,null,null,12500000,7166667,"2022-11-02","2022-11-03","2023-01-17",60,null,null,null,null,null,null,"En ejecución",0.9]
[246,2022,"FDLCH-CPS-246-2022","https://community.secop.gov.co/Public/Tendering/OpportunityDetail/Index?noticeUID=CO1.NTC.3443411&isFromPublicArea=True&isModal=true&asPopupView=true","Contratos de prestación de servicios profesionales y de apoyo a la gestión","Contratación directa","Prestación de servicios profesionales y de apoyo a la gestión, o para la ejecución de trabajos artísticos que sólo puedan encomendarse a determinadas personas naturales","Prestar los servicios de apoyo necesarios para la conducción de los vehículos que conforman el parque automotor en propiedad o custodia del fondo de desarrollo local de chapinero, y el transporte de servidores públicos para la realización de las actividades misionales de la alcaldía local de chapinero","Inversión","Un nuevo contrato social y ambiental para la Bogotá del Siglo XXI",57,{"$f":"IF(ISERROR(VLOOKUP(K250,[2]Proposito_programa!$C$2:$E$59,2,FALSE)),\" \",VLOOKUP(K250,[2]Proposito_programa!$C$2:$E$59,2,FALSE))","v":"Gestión pública local"},{"$f":"IF(ISERROR(VLOOKUP(K250,[2]Proposito_programa!$C$2:$E$59,3,FALSE)),\" \",VLOOKUP(K250,[2]Proposito_programa!$C$2:$E$59,3,FALSE))","v":"Propósito 5: Construir Bogotá - Región con gobierno abierto, transparente y ciudadanía consciente"},1741,null,80012471,"LUIS GIOVANNY LOPEZ SIMIJACA","Persona Natural",null,null,null,null,5200000,0,null,null,5200000,4333333,"2022-10-25","2022-10-26","2022-12-25",60,null,null,null,null,null,null,"Terminado",1]
[247,2022,"FDLCH-CPS-247-2022","https://community.secop.gov.co/Public/Tendering/OpportunityDetail/Index?noticeUID=CO1.NTC.3469073&isFromPublicArea=True&isModal=true&asPopupView=true","Contratos de prestación de servicios profesionales y de apoyo a la gestión","Contratación directa","Prestación de servicios profesionales y de apoyo a la gestión, o para la ejecución de trabajos artísticos que sólo puedan encomendarse a determinadas personas naturales","Prestar servicios de apoyo a la gestión, para el desarrollo de estrategias que promuevan el uso adecuado del espacio público en el marco del proyecto \"CHAPINERO ES ESPACIO PUBLICO INCLUYENTE Y DEMOCRÁTICO","Inversión","Un nuevo contrato social y ambiental para la Bogotá del Siglo XXI",45,{"$f":"IF(ISERROR(VLOOKUP(K251,[2]Proposito_programa!$C$2:$E$59,2,FALSE)),\" \",VLOOKUP(K251,[2]Proposito_programa!$C$2:$E$59,2,FALSE))","v":"Espacio público más seguro y construido colectivamente"},{"$f":"IF(ISERROR(VLOOKUP(K251,[2]Proposito_programa!$C$2:$E$59,3,FALSE)),\" \",VLOOKUP(K251,[2]Proposito_programa!$C$2:$E$59,3,FALSE))","v":"Propósito 3: Inspirar confianza y legitimidad para vivir sin miedo y ser epicentro de cultura ciudadana, paz y reconciliación"},1736,null,79237228,"OMAR ORLANDO BARON VELASCO","Persona Natural",null,null,null,null,4400000,0,null,null,4400000,3226667,"2022-11-01","2022-11-01","2022-12-31",60,null,null,null,null,null,null,"Terminado",1]
[248,2022,"FDLCH-CPS-248-2022","https://community.secop.gov.co/Public/Tendering/OpportunityDetail/Index?noticeUID=CO1.NTC.3463695&isFromPublicArea=True&isModal=true&asPopupView=true","Contratos de prestación de servicios profesionales y de apoyo a la gestión","Contratación directa","Prestación de servicios profesionales y de apoyo a la gestión, o para la ejecución de trabajos artísticos que sólo puedan encomendarse a determinadas personas naturales","Prestar servicios profesionales para la gestión, formulación, desarrollo, seguimiento y evaluación del proyecto de inversión \"CHAPINERO PRODUCTIVO Y EMPRENDEDOR LA ESTRATEGIA DE MITIGACIÓN Y REACTIVACIÓN ECONÓMICA- EMRE LOCAL\" y la supervisión de contratos que le sean asignados.","Inversión","Un nuevo contrato social y ambiental para la Bogotá del Siglo XXI",6,{"$f":"IF(ISERROR(VLOOKUP(K252,[2]Proposito_programa!$C$2:$E$59,2,FALSE)),\" \",VLOOKUP(K252,[2]Proposito_programa!$C$2:$E$59,2,FALSE))","v":"Sistema Distrital de Cuidado"},{"$f":"IF(ISERROR(VLOOKUP(K252,[2]Proposito_programa!$C$2:$E$59,3,FALSE)),\" \",VLOOKUP(K252,[2]Proposito_programa!$C$2:$E$59,3,FALSE))","v":"Propósito 1: Hacer un nuevo contrato social para incrementar la inclusión social, productiva y política"},1671,null,1070704250,"WILMER ANDRES MALDONADO RAMIREZ","Persona Natural",null,null,null,null,11500000,0,null,null,11500000,6900000,"2022-10-31","2022-11-01","2023-01-15",60,null,null,null,null,null,null,"En ejecución",0.9]
[249,2022,"FDLCH-CPS-249-2022","https://community.secop.gov.co/Public/Tendering/OpportunityDetail/Index?noticeUID=CO1.NTC.3468282&isFromPublicArea=True&isModal=true&asPopupView=true","Contratos de prestación de servicios profesionales y de apoyo a la gestión","Contratación directa","Prestación de servicios profesionales y de apoyo a la gestión, o para la ejecución de trabajos artísticos que sólo puedan encomendarse a determinadas personas naturales","Prestar los servicios profesionales para apoyar el área de gestión del desarrollo local de la Alcaldía Local de Chapinero, en la formulación, gestión,, ejecución y apoyo a la supervisión de los proyectos relacionados con los temas de salud, en cumplimiento de las metas y objetivos del plan del desarrollo local.","Inversión","Un nuevo contrato social y ambiental para la Bogotá del Siglo XXI",6,{"$f":"IF(ISERROR(VLOOKUP(K253,[2]Proposito_programa!$C$2:$E$59,2,FALSE)),\" \",VLOOKUP(K253,[2]Proposito_programa!$C$2:$E$59,2,FALSE))","v":"Sistema Distrital de Cuidado"},{"$f":"IF(ISERROR(VLOOKUP(K253,[2]Proposito_programa!$C$2:$E$59,3,FALSE)),\" \",VLOOKUP(K253,[2]Proposito_programa!$C$2:$E$59,3,FALSE))","v":"Propósito 1: Hacer un nuevo contrato social para incrementar la inclusión social, productiva y política"},2024,null,53037864,"DIANA CAROLINA MORENO RINCON","Persona Natural",null,null,null,null,12500000,0,1,4166667,16666667,7333333,"2022-11-01","2022-11-02","2023-10-02",60,1,25,null,null,null,null,"En ejecución",0.25]
[250,2022,"FDLCH-CPS-250-2022","https://community.secop.gov.co/Public/Tendering/OpportunityDetail/Index?noticeUID=CO1.NTC.3442567&isFromPublicArea=True&isModal=true&asPopupView=true","Contratos de prestación de servicios profesionales y de apoyo a la gestión","Contratación directa","Prestación de servicios profesionales y de apoyo a la gestión, o para la ejecución de trabajos artísticos que sólo puedan encomendarse a determinadas personas naturales","Prestar servicios profesionales para la atención programación desarrollo seguimiento y aseguramiento de los planes, estrategias y actividades estratégicas desarrolladas por la Alcaldía Local de Chapinero.","Inversión","Un nuevo contrato social y ambiental para la Bogotá del Siglo XXI",57,{"$f":"IF(ISERROR(VLOOKUP(K254,[2]Proposito_programa!$C$2:$E$59,2,FALSE)),\" \",VLOOKUP(K254,[2]Proposito_programa!$C$2:$E$59,2,FALSE))","v":"Gestión pública local"},{"$f":"IF(ISERROR(VLOOKUP(K254,[2]Proposito_programa!$C$2:$E$59,3,FALSE)),\" \",VLOOKUP(K254,[2]Proposito_programa!$C$2:$E$59,3,FALSE))","v":"Propósito 5: Construir Bogotá - Región con gobierno abierto, transparente y ciudadanía consciente"},1741,null,80192226,"OSCAR FABIAN MAESTRE OLAYA","Persona Natural",null,null,null,null,12000000,0,1,4800000,16800000,8000000,"2022-10-25","2022-10-26","2023-09-02",60,1,30,null,null,null,null,"En ejecución",0.3]
[251,2022,"FDLCH-CPS-251-2022","https://community.secop.gov.co/Public/Tendering/OpportunityDetail/Index?noticeUID=CO1.NTC.3477905&isFromPublicArea=True&isModal=true&asPopupView=true","Contratos de prestación de servicios profesionales y de apoyo a la gestión","Contratación directa","Prestación de servicios profesionales y de apoyo a la gestión, o para la ejecución de trabajos artísticos que sólo puedan encomendarse a determinadas personas naturales","Prestar servicios profesionales para el apoyo al área de gestión de desarrollo local de la Alcaldía Local de Chapinero en la formulación, gestión, ejecución y seguimiento de los contratos derivados del \" PROYECTO CHAPINERO PRODUCTIVO Y EMPRENDEDOR, LA ESTRATEGIA DE MITIGACIÓN Y REACTIVACIÓN ECONÓMICA - EMRE LOCAL\" y la supervisión de contratos que le sean asignados.","Inversión","Un nuevo contrato social y ambiental para la Bogotá del Siglo XXI",6,{"$f":"IF(ISERROR(VLOOKUP(K255,[2]Proposito_programa!$C$2:$E$59,2,FALSE)),\" \",VLOOKUP(K255,[2]Proposito_programa!$C$2:$E$59,2,FALSE))","v":"Sistema Distrital de Cuidado"},{"$f":"IF(ISERROR(VLOOKUP(K255,[2]Proposito_programa!$C$2:$E$59,3,FALSE)),\" \",VLOOKUP(K255,[2]Proposito_programa!$C$2:$E$59,3,FALSE))","v":"Propósito 1: Hacer un nuevo contrato social para incrementar la inclusión social, productiva y política"},1671,null,1013615672,"SERGIO ANDRES VARGAS CRUZ","Persona Natural",null,null,null,null,15500000,0,null,null,15500000,8886667,"2022-11-03","2022-11-03","2023-01-17",60,null,null,null,null,null,null,"En ejecución",0.9]
[252,2022,"FDLCH-CPS-252-2022","https://community.secop.gov.co/Public/Tendering/OpportunityDetail/Index?noticeUID=CO1.NTC.3477881&isFromPublicArea=True&isModal=true&asPopupView=true","Contratos de prestación de servicios profesionales y de apoyo a la gestión","Contratación directa","Prestación de servicios profesionales y de apoyo a la gestión, o para la ejecución de trabajos artísticos que sólo puedan encomendarse a determinadas personas naturales","Prestar servicios profesionales de apoyo jurídico en la ejecución de las acciones requeridas para el trámite e impulso procesal de las actuaciones administrativas y de cobro persuasivo de competencia de la alcaldía local de chapinero.","Inversión","Un nuevo contrato social y ambiental para la Bogotá del Siglo XXI",57,{"$f":"IF(ISERROR(VLOOKUP(K256,[2]Proposito_programa!$C$2:$E$59,2,FALSE)),\" \",VLOOKUP(K256,[2]Proposito_programa!$C$2:$E$59,2,FALSE))","v":"Gestión pública local"},{"$f":"IF(ISERROR(VLOOKUP(K256,[2]Proposito_programa!$C$2:$E$59,3,FALSE)),\" \",VLOOKUP(K256,[2]Proposito_programa!$C$2:$E$59,3,FALSE))","v":"Propósito 5: Construir Bogotá - Región con gobierno abierto, transparente y ciudadanía consciente"},1841,null,1020734444,"JUAN CAMILO MENDOZA MARTINEZ","Persona Natural",null,null,null,null,9200000,0,null,null,9200000,5826667,"2022-11-03","2022-11-08","2023-01-02",60,null,null,null,null,null,null,"En ejecución",0.9]
[253,2022,"FDLCH-CPS-253-2022","https://community.secop.gov.co/Public/Tendering/OpportunityDetail/Index?noticeUID=CO1.NTC.3450916&isFromPublicArea=True&isModal=False","Contratos de prestación de servicios profesionales y de apoyo a la gestión","Contratación directa","Prestación de servicios profesionales y de apoyo a la gestión, o para la ejecución de trabajos artísticos que sólo puedan encomendarse a determinadas personas naturales","Brindar apoyo en la implementación de acciones del Plan Local de convivencia, seguridad y justicia y el desarrollo de estrategias de dialogo, mediación, convivencia y prevención de conflictivades, violencias y delitos en la Localidad de Chapinero, para mejorar la seguridad y convivencia.","Inversión","Un nuevo contrato social y ambiental para la Bogotá del Siglo XXI",45,{"$f":"IF(ISERROR(VLOOKUP(K257,[2]Proposito_programa!$C$2:$E$59,2,FALSE)),\" \",VLOOKUP(K257,[2]Proposito_programa!$C$2:$E$59,2,FALSE))","v":"Espacio público más seguro y construido colectivamente"},{"$f":"IF(ISERROR(VLOOKUP(K257,[2]Proposito_programa!$C$2:$E$59,3,FALSE)),\" \",VLOOKUP(K257,[2]Proposito_programa!$C$2:$E$59,3,FALSE))","v":"Propósito 3: Inspirar confianza y legitimidad para vivir sin miedo y ser epicentro de cultura ciudadana, paz y reconciliación"},1736,null,1022364268,"LUIS ALEJANDRO MARTINEZ MARTINEZ","Persona Natural",null,null,null,null,5000000,0,null,null,5000000,3750000,"2022-10-27","2022-11-01","2022-12-31",60,null,null,null,null,null,null,"Terminado",1]
[254,2022,"FDLCH-CPS-254-2022","https://community.secop.gov.co/Public/Tendering/OpportunityDetail/Index?noticeUID=CO1.NTC.3468206&isFromPublicArea=True&isModal=true&asPopupView=true","Contratos de prestación de servicios profesionales y de apoyo a la gestión","Contratación directa","Prestación de servicios profesionales y de apoyo a la gestión, o para la ejecución de trabajos artísticos que sólo puedan encomendarse a determinadas personas naturales","Prestar servicios profesionales para apoyar la gestión jurídica en la ejecución de las acciones requeridas para el trámite e impulso procesal de las actuaciones administrativas y de inspección, vigilancia y control de competencia de la alcaldía local de chapinero en cerros orientales, zona de reserva forestal protectora, polígonos de monitoreo, áreas de ocupación pública prioritaria, franja de adecuación y zonas de especial protección ambiental","Inversión","Un nuevo contrato social y ambiental para la Bogotá del Siglo XXI",57,{"$f":"IF(ISERROR(VLOOKUP(K258,[2]Proposito_programa!$C$2:$E$59,2,FALSE)),\" \",VLOOKUP(K258,[2]Proposito_programa!$C$2:$E$59,2,FALSE))","v":"Gestión pública local"},{"$f":"IF(ISERROR(VLOOKUP(K258,[2]Proposito_programa!$C$2:$E$59,3,FALSE)),\" \",VLOOKUP(K258,[2]Proposito_programa!$C$2:$E$59,3,FALSE))","v":"Propósito 5: Construir Bogotá - Región con gobierno abierto, transparente y ciudadanía consciente"},1841,null,80881353,"DIEGO FERNANDO LEON LEON","Persona Natural",null,null,null,null,10000000,0,null,null,10000000,4833333,"2022-11-01","2022-11-02","2023-01-01",60,null,null,null,null,null,null,"Terminado",1]
[255,2022,"FDLCH-CPS-255-2022","https://community.secop.gov.co/Public/Tendering/OpportunityDetail/Index?noticeUID=CO1.NTC.3452010&isFromPublicArea=True&isModal=true&asPopupView=true","Contratos de prestación de servicios profesionales y de apoyo a la gestión","Contratación directa","Prestación de servicios profesionales y de apoyo a la gestión, o para la ejecución de trabajos artísticos que sólo puedan encomendarse a determinadas personas naturales","PRESTAR SERVICIOS PROFESIONALES PARA LA ADMINISTRACIÓN, SOPORTE TÉCNICO Y CORRECTO FUNCIONAMIENTO DE LA INFRAESTRUCTURA TECNOLÓGICA EN PROPIEDAD O CUSTODIA DE LA ALCALDÍA LOCAL DE CHAPINERO ASÍ COMO LA FORMULACIÓN DE PROYECTOS RELACIONADOS","Inversión","Un nuevo contrato social y ambiental para la Bogotá del Siglo XXI",57,{"$f":"IF(ISERROR(VLOOKUP(K259,[2]Proposito_programa!$C$2:$E$59,2,FALSE)),\" \",VLOOKUP(K259,[2]Proposito_programa!$C$2:$E$59,2,FALSE))","v":"Gestión pública local"},{"$f":"IF(ISERROR(VLOOKUP(K259,[2]Proposito_programa!$C$2:$E$59,3,FALSE)),\" \",VLOOKUP(K259,[2]Proposito_programa!$C$2:$E$59,3,FALSE))","v":"Propósito 5: Construir Bogotá - Región con gobierno abierto, transparente y ciudadanía consciente"},1741,null,1032386167,"ESTEBAN GONZALEZ PORTILLA","Persona Natural",null,null,null,null,9160000,0,1,4580000,13740000,7328000,"2022-10-27","2022-10-28","2023-01-27",60,1,30,null,null,null,null,"En ejecución",0.9]
[256,2022,"FDLCH-CPS-256-2022","https://community.secop.gov.co/Public/Tendering/OpportunityDetail/Index?noticeUID=CO1.NTC.3456613&isFromPublicArea=True&isModal=true&asPopupView=true","Contratos de prestación de servicios profesionales y de apoyo a la gestión","Contratación directa","Prestación de servicios profesionales y de apoyo a la gestión, o para la ejecución de trabajos artísticos que sólo puedan encomendarse a determinadas personas naturales","Apoya el cubrmiiento de las actividades, cronogramas y agenda de la Alcaldía Local a nivel interno y externo, así como la genración de contenido speriodísticos.","Inversión","Un nuevo contrato social y ambiental para la Bogotá del Siglo XXI",57,{"$f":"IF(ISERROR(VLOOKUP(K260,[2]Proposito_programa!$C$2:$E$59,2,FALSE)),\" \",VLOOKUP(K260,[2]Proposito_programa!$C$2:$E$59,2,FALSE))","v":"Gestión pública local"},{"$f":"IF(ISERROR(VLOOKUP(K260,[2]Proposito_programa!$C$2:$E$59,3,FALSE)),\" \",VLOOKUP(K260,[2]Proposito_programa!$C$2:$E$59,3,FALSE))","v":"Propósito 5: Construir Bogotá - Región con gobierno abierto, transparente y ciudadanía consciente"},1741,null,1013589145,"JENNIFER AGUDELO SANCHEZ","Persona Natural",null,null,null,null,10344000,0,1,5172000,15516000,8275200,"2022-10-28","2022-10-28","2023-01-27",60,1,30,null,null,null,null,"En ejecución",0.9]
[257,2022,"FDLCH-CPS-257-2022","https://community.secop.gov.co/Public/Tendering/OpportunityDetail/Index?noticeUID=CO1.NTC.3325282&isFromPublicArea=True&isModal=true&asPopupView=true","Otros","Licitación pública","No aplica","Contratar la prestación de servicios para formar, sensibilizar y fortalecer a la comunidad en conivencia ciudadana, seguridad comunitaria y derechos humanos con el fin de realizar pedagogía, generar entornos de confianza y promover la cultura ciudadana en el marco del código nacional de seguridad y conivencia ciudadana en la Localidad de Chapinero.","Inversión","Un nuevo contrato social y ambiental para la Bogotá del Siglo XXI",43,{"$f":"IF(ISERROR(VLOOKUP(K261,[2]Proposito_programa!$C$2:$E$59,2,FALSE)),\" \",VLOOKUP(K261,[2]Proposito_programa!$C$2:$E$59,2,FALSE))","v":"Cultura ciudadana para la confianza, la convivencia y la participación desde la vida cotidiana"},{"$f":"IF(ISERROR(VLOOKUP(K261,[2]Proposito_programa!$C$2:$E$59,3,FALSE)),\" \",VLOOKUP(K261,[2]Proposito_programa!$C$2:$E$59,3,FALSE))","v":"Propósito 3: Inspirar confianza y legitimidad para vivir sin miedo y ser epicentro de cultura ciudadana, paz y reconciliación"},1735,5,901648008,"UNION TEMPORAL FESSANJOSE FDI","Persona Jurídica",null,null,null,null,200405718,0,null,null,200405718,0,"2022-11-01","2022-11-21","2023-07-20",60,null,null,null,null,null,null,"En ejecución",0.9]
[257,2022,"FDLCH-CPS-257-2022","https://community.secop.gov.co/Public/Tendering/OpportunityDetail/Index?noticeUID=CO1.NTC.3325282&isFromPublicArea=True&isModal=true&asPopupView=true","Otros","Licitación pública","No aplica","Contratar la prestación de servicios para formar, sensibilizar y fortalecer a la comunidad en conivencia ciudadana, seguridad comunitaria y derechos humanos con el fin de realizar pedagogía, generar entornos de confianza y promover la cultura ciudadana en el marco del código nacional de seguridad y conivencia ciudadana en la Localidad de Chapinero.","Inversión","Un nuevo contrato social y ambiental para la Bogotá del Siglo XXI",48,{"$f":"IF(ISERROR(VLOOKUP(K262,[2]Proposito_programa!$C$2:$E$59,2,FALSE)),\" \",VLOOKUP(K262,[2]Proposito_programa!$C$2:$E$59,2,FALSE))","v":"Plataforma institucional para la seguridad y justicia"},{"$f":"IF(ISERROR(VLOOKUP(K262,[2]Proposito_programa!$C$2:$E$59,3,FALSE)),\" \",VLOOKUP(K262,[2]Proposito_programa!$C$2:$E$59,3,FALSE))","v":"Propósito 3: Inspirar confianza y legitimidad para vivir sin miedo y ser epicentro de cultura ciudadana, paz y reconciliación"},1738,null,901648008,"UNION TEMPORAL FESSANJOSE FDI","Persona Jurídica",null,null,null,null,201641718,0,null,null,201641718,0,"2022-11-01","2022-11-21","2023-07-20",null,null,null,null,null,null,null,"En ejecución",0.9]
[258,2022,"FDLCH-CPS-258-2022","https://community.secop.gov.co/Public/Tendering/OpportunityDetail/Index?noticeUID=CO1.NTC.3469298&isFromPublicArea=True&isModal=true&asPopupView=true","Contratos de prestación de servicios profesionales y de apoyo a la gestión","Contratación directa","Prestación de servicios profesionales y de apoyo a la gestión, o para la ejecución de trabajos artísticos que sólo puedan encomendarse a determinadas personas naturales","Prestar servicios profesionales para apoyar la gestión jurídica en la ejecución d elas acciones requeridas para el trámite e impulso procesal de las actuaciones administrativas y de inspección, vigilancia y control de competencia de la Alcaldía Local de Chapinero en cerros orientales, zona de resrva forestal protectosa, polígonos d emonitoreo, áreas de ocupación pública prioritaria, franja de adecuación y zonas de especial protección ambiental.","Inversión","Un nuevo contrato social y ambiental para la Bogotá del Siglo XXI",57,{"$f":"IF(ISERROR(VLOOKUP(K263,[2]Proposito_programa!$C$2:$E$59,2,FALSE)),\" \",VLOOKUP(K263,[2]Proposito_programa!$C$2:$E$59,2,FALSE))","v":"Gestión pública local"},{"$f":"IF(ISERROR(VLOOKUP(K263,[2]Proposito_programa!$C$2:$E$59,3,FALSE)),\" \",VLOOKUP(K263,[2]Proposito_programa!$C$2:$E$59,3,FALSE))","v":"Propósito 5: Construir Bogotá - Región con gobierno abierto, transparente y ciudadanía consciente"},1841,null,1033727990,"CAROL JINETH VARGAS CLAROS","Persona Natural",null,null,null,null,9028000,0,1,2858867,11886867,6620533,"2022-11-02","2022-11-02","20/01/2023",60,1,20,null,null,null,null,"En ejecución",0.9]
[259,2022,"FDLCH-CPS-259-2022","https://community.secop.gov.co/Public/Tendering/OpportunityDetail/Index?noticeUID=CO1.NTC.3470753&isFromPublicArea=True&isModal=true&asPopupView=true","Contratos de prestación de servicios profesionales y de apoyo a la gestión","Contratación directa","Prestación de servicios profesionales y de apoyo a la gestión, o para la ejecución de trabajos artísticos que sólo puedan encomendarse a determinadas personas naturales","Prestar servicios profesionales para apoyar técnicamente las actuaciones administrativas, impulso procesal y de inspección, vigilancia y control de competencia de la Alcaldía Local de Chapinero.","Inversión","Un nuevo contrato social y ambiental para la Bogotá del Siglo XXI",57,{"$f":"IF(ISERROR(VLOOKUP(K264,[2]Proposito_programa!$C$2:$E$59,2,FALSE)),\" \",VLOOKUP(K264,[2]Proposito_programa!$C$2:$E$59,2,FALSE))","v":"Gestión pública local"},{"$f":"IF(ISERROR(VLOOKUP(K264,[2]Proposito_programa!$C$2:$E$59,3,FALSE)),\" \",VLOOKUP(K264,[2]Proposito_programa!$C$2:$E$59,3,FALSE))","v":"Propósito 5: Construir Bogotá - Región con gobierno abierto, transparente y ciudadanía consciente"},1841,null,1030625256,"ANDRES FELIPE RAMOS ARENAS","Persona Natural",null,null,null,null,12250000,0,1,4900000,17150000,7186667,"2022-11-02","2022-11-02","16/02/2023",60,1,30,null,null,null,null,"En ejecución",0.85]
[260,2022,"FDLCH-CPS-260-2022","https://community.secop.gov.co/Public/Tendering/OpportunityDetail/Index?noticeUID=CO1.NTC.3470624&isFromPublicArea=True&isModal=true&asPopupView=true","Contratos de prestación de servicios profesionales y de apoyo a la gestión","Contratación directa","Prestación de servicios profesionales y de apoyo a la gestión, o para la ejecución de trabajos artísticos que sólo puedan encomendarse a determinadas personas naturales","Prestar servicios profesionales para apoyar técnicamente las actuaciones administrativas, impulso procesal y de inspección, vigilancia y control en las zonas de especial protección de cerros orientales de compentencia de la Alcaldía Local de Chapinero.","Inversión","Un nuevo contrato social y ambiental para la Bogotá del Siglo XXI",57,{"$f":"IF(ISERROR(VLOOKUP(K265,[2]Proposito_programa!$C$2:$E$59,2,FALSE)),\" \",VLOOKUP(K265,[2]Proposito_programa!$C$2:$E$59,2,FALSE))","v":"Gestión pública local"},{"$f":"IF(ISERROR(VLOOKUP(K265,[2]Proposito_programa!$C$2:$E$59,3,FALSE)),\" \",VLOOKUP(K265,[2]Proposito_programa!$C$2:$E$59,3,FALSE))","v":"Propósito 5: Construir Bogotá - Región con gobierno abierto, transparente y ciudadanía consciente"},1841,null,1000145771,"DIANA CAROLINA ERAZO FLOREZ","Persona Natural",null,null,null,null,12250000,0,null,null,12250000,7186667,"2022-11-02","2022-11-02","2023-01-16",60,null,null,null,null,null,null,"En ejecución",0.9]
[261,2022,"FDLCH-CPS-261-2022","https://community.secop.gov.co/Public/Tendering/OpportunityDetail/Index?noticeUID=CO1.NTC.3468678&isFromPublicArea=True&isModal=true&asPopupView=true","Contratos de prestación de servicios profesionales y de apoyo a la gestión","Contratación directa","Prestación de servicios profesionales y de apoyo a la gestión, o para la ejecución de trabajos artísticos que sólo puedan encomendarse a determinadas personas naturales","Prstación de servicios profesionales para el seguimiento y verificación de las garantías contractuales derivadas de los contratos ejecutados dentro del proyecto de inversión \"CHAPINERO MODELO DE MOVILIDAD INTELIGENTE\"","Inversión","Un nuevo contrato social y ambiental para la Bogotá del Siglo XXI",49,{"$f":"IF(ISERROR(VLOOKUP(K266,[2]Proposito_programa!$C$2:$E$59,2,FALSE)),\" \",VLOOKUP(K266,[2]Proposito_programa!$C$2:$E$59,2,FALSE))","v":"Movilidad segura, sostenible y accesible"},{"$f":"IF(ISERROR(VLOOKUP(K266,[2]Proposito_programa!$C$2:$E$59,3,FALSE)),\" \",VLOOKUP(K266,[2]Proposito_programa!$C$2:$E$59,3,FALSE))","v":"Propósito 4: Hacer de Bogotá Región un modelo de movilidad multimodal, incluyente y sostenible"},1734,null,1070011854,"SANDRA PAOLA SALAMANCA RIAÑO","Persona Natural",null,null,null,null,12500000,0,1,6166667,18666667,7333333,"2022-11-01","2022-11-02","23/02/2023",60,1,37,null,null,null,null,"En ejecución",0.85]
[262,2022,"FDLCH-CPS-262-2022","https://community.secop.gov.co/Public/Tendering/OpportunityDetail/Index?noticeUID=CO1.NTC.3468587&isFromPublicArea=True&isModal=true&asPopupView=true","Contratos de prestación de servicios profesionales y de apoyo a la gestión","Contratación directa","Prestación de servicios profesionales y de apoyo a la gestión, o para la ejecución de trabajos artísticos que sólo puedan encomendarse a determinadas personas naturales","Prestar servicios profesionales para apoyar el área de gestión de desarrollo local de la Alcaldía Local de Chapinero,en formulación, gestión, ejecución y apoyo a la supervisión de los proyectos relacionados con las estrategias y metas relacionadas con el programa sistema distrital de cuidado y fortalecimiento de organizaciones sociales, comunitarias y comunales locales.","Inversión","Un nuevo contrato social y ambiental para la Bogotá del Siglo XXI",6,{"$f":"IF(ISERROR(VLOOKUP(K267,[2]Proposito_programa!$C$2:$E$59,2,FALSE)),\" \",VLOOKUP(K267,[2]Proposito_programa!$C$2:$E$59,2,FALSE))","v":"Sistema Distrital de Cuidado"},{"$f":"IF(ISERROR(VLOOKUP(K267,[2]Proposito_programa!$C$2:$E$59,3,FALSE)),\" \",VLOOKUP(K267,[2]Proposito_programa!$C$2:$E$59,3,FALSE))","v":"Propósito 1: Hacer un nuevo contrato social para incrementar la inclusión social, productiva y política"},1710,null,80092921,"FEDERICO SANTIAGO BALLESTEROS","Persona Natural",null,null,null,null,9200000,0,1,4600000,13800000,5826667,"2022-11-02","2022-11-08","2023-07-02",60,1,30,null,null,null,null,"En ejecución",0.5]
[263,2022,"FDLCH-CPS-263-2022","https://community.secop.gov.co/Public/Tendering/OpportunityDetail/Index?noticeUID=CO1.NTC.3486851&isFromPublicArea=True&isModal=true&asPopupView=true","Contratos de prestación de servicios profesionales y de apoyo a la gestión","Contratación directa","Prestación de servicios profesionales y de apoyo a la gestión, o para la ejecución de trabajos artísticos que sólo puedan encomendarse a determinadas personas naturales","Apoyar la formulación, gestión y seguimiento de actividades enfocadas a la gestión ambiental externa, encaminadas a la mitigación de los diferentes impactos ambientales y la conservación de los recursos naturales de la Localidad de Chapinero.","Inversión","Un nuevo contrato social y ambiental para la Bogotá del Siglo XXI",57,{"$f":"IF(ISERROR(VLOOKUP(K268,[2]Proposito_programa!$C$2:$E$59,2,FALSE)),\" \",VLOOKUP(K268,[2]Proposito_programa!$C$2:$E$59,2,FALSE))","v":"Gestión pública local"},{"$f":"IF(ISERROR(VLOOKUP(K268,[2]Proposito_programa!$C$2:$E$59,3,FALSE)),\" \",VLOOKUP(K268,[2]Proposito_programa!$C$2:$E$59,3,FALSE))","v":"Propósito 5: Construir Bogotá - Región con gobierno abierto, transparente y ciudadanía consciente"},1741,null,1123320414,"KAREN JOHANA CASTRO NUÑEZ","Persona Natural",null,null,null,null,11000000,0,1,5500000,16500000,7700000,"2022-11-04","2022-11-04","2023-02-03",60,1,30,null,null,null,null,"En ejecución",0.85]
[264,2022,"FDLCH-CPS-264-2022","https://community.secop.gov.co/Public/Tendering/OpportunityDetail/Index?noticeUID=CO1.NTC.3480054&isFromPublicArea=True&isModal=true&asPopupView=true","Contratos de prestación de servicios profesionales y de apoyo a la gestión","Contratación directa","Prestación de servicios profesionales y de apoyo a la gestión, o para la ejecución de trabajos artísticos que sólo puedan encomendarse a determinadas personas naturales","Prestar servicios profesionales para apoyar la gestión de los asuntos relacionados con el adecuado uso del espacio público, mediante actuaciones que propendan por el bienestar de la comunidad en la localidad de chapinero, en el marco del proyecto de inversión \"CHAPINERO ES ESPACIO PÚBLICO INCLUYENTE Y DEMOCRÁTICO\"","Inversión","Un nuevo contrato social y ambiental para la Bogotá del Siglo XXI",45,{"$f":"IF(ISERROR(VLOOKUP(K269,[2]Proposito_programa!$C$2:$E$59,2,FALSE)),\" \",VLOOKUP(K269,[2]Proposito_programa!$C$2:$E$59,2,FALSE))","v":"Espacio público más seguro y construido colectivamente"},{"$f":"IF(ISERROR(VLOOKUP(K269,[2]Proposito_programa!$C$2:$E$59,3,FALSE)),\" \",VLOOKUP(K269,[2]Proposito_programa!$C$2:$E$59,3,FALSE))","v":"Propósito 3: Inspirar confianza y legitimidad para vivir sin miedo y ser epicentro de cultura ciudadana, paz y reconciliación"},1736,null,15677463,"JOSE GREGORIO BOLAÑO MARTINEZ","Persona Natural",null,null,null,null,9028000,0,null,null,9028000,4213067,"2022-11-03","2022-11-03","2023-01-02",60,null,null,null,null,null,null,"Terminado",1]
[265,2022,"FDLCH-CPS-265-2022","https://community.secop.gov.co/Public/Tendering/OpportunityDetail/Index?noticeUID=CO1.NTC.3480220&isFromPublicArea=True&isModal=true&asPopupView=true","Contratos de prestación de servicios profesionales y de apoyo a la gestión","Contratación directa","Prestación de servicios profesionales y de apoyo a la gestión, o para la ejecución de trabajos artísticos que sólo puedan encomendarse a determinadas personas naturales","Prestar servicios de apoyo a la gestión para desarrollar las actividades de atención y orientación al ciudadano que se requieran en las instalaciones de la alcaldía local de chapinero","Inversión","Un nuevo contrato social y ambiental para la Bogotá del Siglo XXI",57,{"$f":"IF(ISERROR(VLOOKUP(K270,[2]Proposito_programa!$C$2:$E$59,2,FALSE)),\" \",VLOOKUP(K270,[2]Proposito_programa!$C$2:$E$59,2,FALSE))","v":"Gestión pública local"},{"$f":"IF(ISERROR(VLOOKUP(K270,[2]Proposito_programa!$C$2:$E$59,3,FALSE)),\" \",VLOOKUP(K270,[2]Proposito_programa!$C$2:$E$59,3,FALSE))","v":"Propósito 5: Construir Bogotá - Región con gobierno abierto, transparente y ciudadanía consciente"},1741,null,52785810,"DIANA SHIRLEY ARDILA ARDILA","Persona Natural",null,null,null,null,4000000,0,null,null,4000000,2533333,"2022-11-08","2022-11-08","2023-01-07",60,null,null,null,null,null,null,"Terminado",1]
[266,2022,"FDLCH-CPS-266-2022","https://community.secop.gov.co/Public/Tendering/OpportunityDetail/Index?noticeUID=CO1.NTC.3477944&isFromPublicArea=True&isModal=true&asPopupView=true","Contratos de prestación de servicios profesionales y de apoyo a la gestión","Contratación directa","Prestación de servicios profesionales y de apoyo a la gestión, o para la ejecución de trabajos artísticos que sólo puedan encomendarse a determinadas personas naturales","Prestar servicios asistenciales de apoyo a la gestión para el desarrollo de actividades relacionadas con la gestión ambiental local en el marco del proyecto de inversión \"Chapinero sostenible y consciente\"","Inversión","Un nuevo contrato social y ambiental para la Bogotá del Siglo XXI",38,{"$f":"IF(ISERROR(VLOOKUP(K271,[2]Proposito_programa!$C$2:$E$59,2,FALSE)),\" \",VLOOKUP(K271,[2]Proposito_programa!$C$2:$E$59,2,FALSE))","v":"Ecoeficiencia, reciclaje, manejo de residuos e inclusión de la población recicladora"},{"$f":"IF(ISERROR(VLOOKUP(K271,[2]Proposito_programa!$C$2:$E$59,3,FALSE)),\" \",VLOOKUP(K271,[2]Proposito_programa!$C$2:$E$59,3,FALSE))","v":"Propósito 2 : Cambiar Nuestros Hábitos de Vida para Reverdecer a Bogotá y Adaptarnos y Mitigar la Crisis Climática"},1728,null,1077866912,"MARIA PAULA BRAVO OROZCO","Persona Natural",null,null,null,null,7000000,0,1,3500000,10500000,5016667,"2022-11-03","2022-11-03","2023-02-02",60,1,60,null,null,null,null,"En ejecución",0.85]
[267,2022,"FDLCH-CPS-267-2022","https://community.secop.gov.co/Public/Tendering/OpportunityDetail/Index?noticeUID=CO1.NTC.3474700&isFromPublicArea=True&isModal=true&asPopupView=true","Contratos de prestación de servicios profesionales y de apoyo a la gestión","Contratación directa","Prestación de servicios profesionales y de apoyo a la gestión, o para la ejecución de trabajos artísticos que sólo puedan encomendarse a determinadas personas naturales","Prestar servicios de apoyo a la gestión en la ejecución de las actividades administrativas y documentales relacionadas con la gestión policiva en la Alcaldía Local de Chapinero.","Inversión","Un nuevo contrato social y ambiental para la Bogotá del Siglo XXI",57,{"$f":"IF(ISERROR(VLOOKUP(K272,[2]Proposito_programa!$C$2:$E$59,2,FALSE)),\" \",VLOOKUP(K272,[2]Proposito_programa!$C$2:$E$59,2,FALSE))","v":"Gestión pública local"},{"$f":"IF(ISERROR(VLOOKUP(K272,[2]Proposito_programa!$C$2:$E$59,3,FALSE)),\" \",VLOOKUP(K272,[2]Proposito_programa!$C$2:$E$59,3,FALSE))","v":"Propósito 5: Construir Bogotá - Región con gobierno abierto, transparente y ciudadanía consciente"},1841,null,39547488,"MARIA CRISTINA CRISTANCHO TRIANA","Persona Natural",null,null,null,null,5500000,0,null,null,5500000,3226667,"2022-11-02","2022-11-02","2023-01-16",60,null,null,null,null,null,null,"En ejecución",0.9]
[268,2022,"FDLCH-CPS-268-2022","https://community.secop.gov.co/Public/Tendering/OpportunityDetail/Index?noticeUID=CO1.NTC.3477767&isFromPublicArea=True&isModal=true&asPopupView=true","Contratos de prestación de servicios profesionales y de apoyo a la gestión","Contratación directa","Prestación de servicios profesionales y de apoyo a la gestión, o para la ejecución de trabajos artísticos que sólo puedan encomendarse a determinadas personas naturales","Apoyar jurídicamente la ejecución de las acciones requeridas para la depuración de las actuaciones administrativas que cursan en la Alcaldía Local.","Inversión","Un nuevo contrato social y ambiental para la Bogotá del Siglo XXI",57,{"$f":"IF(ISERROR(VLOOKUP(K273,[2]Proposito_programa!$C$2:$E$59,2,FALSE)),\" \",VLOOKUP(K273,[2]Proposito_programa!$C$2:$E$59,2,FALSE))","v":"Gestión pública local"},{"$f":"IF(ISERROR(VLOOKUP(K273,[2]Proposito_programa!$C$2:$E$59,3,FALSE)),\" \",VLOOKUP(K273,[2]Proposito_programa!$C$2:$E$59,3,FALSE))","v":"Propósito 5: Construir Bogotá - Región con gobierno abierto, transparente y ciudadanía consciente"},1841,null,1075247785,"KATHERINE RODRIGUEZ QUINTERO","Persona Natural",null,null,null,null,11500000,0,null,null,11500000,6440000,"2022-11-03","2022-11-04","2023-01-18",60,null,null,null,null,null,null,"En ejecución",0.9]
[269,2022,"FDLCH-CPS-269-2022","https://community.secop.gov.co/Public/Tendering/OpportunityDetail/Index?noticeUID=CO1.NTC.3487477&isFromPublicArea=True&isModal=true&asPopupView=true","Contratos de prestación de servicios profesionales y de apoyo a la gestión","Contratación directa","Prestación de servicios profesionales y de apoyo a la gestión, o para la ejecución de trabajos artísticos que sólo puedan encomendarse a determinadas personas naturales","Prestar servicios profesionales de apoyo a la gestión para el desarrollo de actividades relacionads con la formulación, seguimiento, terminación y ciere de proyectos de inversión relacionados con la gestión del riesgo y elcambio climático en laLocalidad de Chapinero.","Inversión","Un nuevo contrato social y ambiental para la Bogotá del Siglo XXI",30,{"$f":"IF(ISERROR(VLOOKUP(K274,[2]Proposito_programa!$C$2:$E$59,2,FALSE)),\" \",VLOOKUP(K274,[2]Proposito_programa!$C$2:$E$59,2,FALSE))","v":"Eficiencia en la atención de emergencias"},{"$f":"IF(ISERROR(VLOOKUP(K274,[2]Proposito_programa!$C$2:$E$59,3,FALSE)),\" \",VLOOKUP(K274,[2]Proposito_programa!$C$2:$E$59,3,FALSE))","v":"Propósito 2 : Cambiar Nuestros Hábitos de Vida para Reverdecer a Bogotá y Adaptarnos y Mitigar la Crisis Climática"},1719,null,1032460215,"EDWARD STIVEN BARRERA GONZALEZ","Persona Natural",null,null,null,null,10000000,0,1,1000000,11000000,7000000,"2022-11-04","2022-11-04","2023-01-09",60,1,6,null,null,null,null,"Terminado",1]
[270,2022,"FDLCH-CPS-270-2022","https://community.secop.gov.co/Public/Tendering/OpportunityDetail/Index?noticeUID=CO1.NTC.3498123&isFromPublicArea=True&isModal=true&asPopupView=true","Contratos de prestación de servicios profesionales y de apoyo a la gestión","Contratación directa","Prestación de servicios profesionales y de apoyo a la gestión, o para la ejecución de trabajos artísticos que sólo puedan encomendarse a determinadas personas naturales","Prestar servicios profesionales para apoyar técnicamente las distintas etaspas de los procesos de competencia de las inspecciones de policia de la localidad de chapinero según reparto","Inversión","Un nuevo contrato social y ambiental para la Bogotá del Siglo XXI",57,{"$f":"IF(ISERROR(VLOOKUP(K275,[2]Proposito_programa!$C$2:$E$59,2,FALSE)),\" \",VLOOKUP(K275,[2]Proposito_programa!$C$2:$E$59,2,FALSE))","v":"Gestión pública local"},{"$f":"IF(ISERROR(VLOOKUP(K275,[2]Proposito_programa!$C$2:$E$59,3,FALSE)),\" \",VLOOKUP(K275,[2]Proposito_programa!$C$2:$E$59,3,FALSE))","v":"Propósito 5: Construir Bogotá - Región con gobierno abierto, transparente y ciudadanía consciente"},1841,null,80429650,"EXCELINO ROMERO CASTAÑEDA","Persona Natural",null,null,null,null,10360000,0,null,null,10360000,6388667,"2022-11-09","2022-11-09","2023-01-08",60,null,null,null,null,null,null,"Terminado",1]
[271,2022,"FDLCH-CPS-271-2022","https://community.secop.gov.co/Public/Tendering/OpportunityDetail/Index?noticeUID=CO1.NTC.3498055&isFromPublicArea=True&isModal=true&asPopupView=true","Contratos de prestación de servicios profesionales y de apoyo a la gestión","Contratación directa","Prestación de servicios profesionales y de apoyo a la gestión, o para la ejecución de trabajos artísticos que sólo puedan encomendarse a determinadas personas naturales","Prestar servicios profesionaes para apoyar técnicamente las distintas etapas de los procesos de competencia de las inspecciones de policia de la localidad de chapinero según reparto.","Inversión","Un nuevo contrato social y ambiental para la Bogotá del Siglo XXI",57,{"$f":"IF(ISERROR(VLOOKUP(K276,[2]Proposito_programa!$C$2:$E$59,2,FALSE)),\" \",VLOOKUP(K276,[2]Proposito_programa!$C$2:$E$59,2,FALSE))","v":"Gestión pública local"},{"$f":"IF(ISERROR(VLOOKUP(K276,[2]Proposito_programa!$C$2:$E$59,3,FALSE)),\" \",VLOOKUP(K276,[2]Proposito_programa!$C$2:$E$59,3,FALSE))","v":"Propósito 5: Construir Bogotá - Región con gobierno abierto, transparente y ciudadanía consciente"},1841,null,80926066,"OMAR DAVID LAVERDE CABRERA","Persona Natural",null,null,null,null,10360000,0,null,null,10360000,6216000,"2022-11-09","2022-11-10","2023-01-09",60,null,null,null,null,null,null,"Terminado",1]
[272,2022,"FDLCH-CPS-272-2022","https://community.secop.gov.co/Public/Tendering/OpportunityDetail/Index?noticeUID=CO1.NTC.3486889&isFromPublicArea=True&isModal=true&asPopupView=true","Contratos de prestación de servicios profesionales y de apoyo a la gestión","Contratación directa","Prestación de servicios profesionales y de apoyo a la gestión, o para la ejecución de trabajos artísticos que sólo puedan encomendarse a determinadas personas naturales","Prestar servicios de apoyo logístico asistencial para el desarrollo de actividades y eventos locales en el marco de la ejecución del plan de desarrollo local.","Inversión","Un nuevo contrato social y ambiental para la Bogotá del Siglo XXI",57,{"$f":"IF(ISERROR(VLOOKUP(K277,[2]Proposito_programa!$C$2:$E$59,2,FALSE)),\" \",VLOOKUP(K277,[2]Proposito_programa!$C$2:$E$59,2,FALSE))","v":"Gestión pública local"},{"$f":"IF(ISERROR(VLOOKUP(K277,[2]Proposito_programa!$C$2:$E$59,3,FALSE)),\" \",VLOOKUP(K277,[2]Proposito_programa!$C$2:$E$59,3,FALSE))","v":"Propósito 5: Construir Bogotá - Región con gobierno abierto, transparente y ciudadanía consciente"},1741,null,1071166907,"WILSON FERNANDO ORJUELA CHAVES","Persona Natural",null,null,null,null,4400000,0,1,2200000,6600000,3080000,"2022-11-04","2022-11-04","2023-03-02",60,1,30,null,null,null,null,"En ejecución",0.75]
[273,2022,"FDLCH-CPS-273-2022","https://community.secop.gov.co/Public/Tendering/OpportunityDetail/Index?noticeUID=CO1.NTC.3487272&isFromPublicArea=True&isModal=true&asPopupView=true","Contratos de prestación de servicios profesionales y de apoyo a la gestión","Contratación directa","Prestación de servicios profesionales y de apoyo a la gestión, o para la ejecución de trabajos artísticos que sólo puedan encomendarse a determinadas personas naturales","Prestar servicios de apoyo logístico asistencial para el desarrollo de actividades y eventos locales en el marco de la ejecución del plan de desarrollo local.","Inversión","Un nuevo contrato social y ambiental para la Bogotá del Siglo XXI",57,{"$f":"IF(ISERROR(VLOOKUP(K278,[2]Proposito_programa!$C$2:$E$59,2,FALSE)),\" \",VLOOKUP(K278,[2]Proposito_programa!$C$2:$E$59,2,FALSE))","v":"Gestión pública local"},{"$f":"IF(ISERROR(VLOOKUP(K278,[2]Proposito_programa!$C$2:$E$59,3,FALSE)),\" \",VLOOKUP(K278,[2]Proposito_programa!$C$2:$E$59,3,FALSE))","v":"Propósito 5: Construir Bogotá - Región con gobierno abierto, transparente y ciudadanía consciente"},1741,null,80410411,"CARLOS JULIO MARTINEZ RIPE","Persona Natural",null,null,null,null,4400000,0,1,2200000,6600000,3080000,"2022-11-04","2022-11-04","2023-03-02",60,1,30,null,null,null,null,"En ejecución",0.75]
[274,2022,"FDLCH-CPS-274-2022","https://community.secop.gov.co/Public/Tendering/OpportunityDetail/Index?noticeUID=CO1.NTC.3477853&isFromPublicArea=True&isModal=true&asPopupView=true","Contratos de prestación de servicios profesionales y de apoyo a la gestión","Contratación directa","Prestación de servicios profesionales y de apoyo a la gestión, o para la ejecución de trabajos artísticos que sólo puedan encomendarse a determinadas personas naturales","Prestar servicios profesionales para la gestion formulacion desarrollo seguimiento y evaluación del Proyecto Justicia accesible y oportuna para Chapinero.","Inversión","Un nuevo contrato social y ambiental para la Bogotá del Siglo XXI",48,{"$f":"IF(ISERROR(VLOOKUP(K279,[2]Proposito_programa!$C$2:$E$59,2,FALSE)),\" \",VLOOKUP(K279,[2]Proposito_programa!$C$2:$E$59,2,FALSE))","v":"Plataforma institucional para la seguridad y justicia"},{"$f":"IF(ISERROR(VLOOKUP(K279,[2]Proposito_programa!$C$2:$E$59,3,FALSE)),\" \",VLOOKUP(K279,[2]Proposito_programa!$C$2:$E$59,3,FALSE))","v":"Propósito 3: Inspirar confianza y legitimidad para vivir sin miedo y ser epicentro de cultura ciudadana, paz y reconciliación"},1738,null,1010219432,"SANTIAGO ALEJANDRO CARDENAS CABALLERO","Persona Natural",null,null,null,null,9046667,0,1,2146668,11193335,6593333,"2022-11-02","2022-11-03","2023-01-15",60,1,14,null,null,null,null,"En ejecución",0.9]
[275,2022,"FDLCH-CPS-275-2022","https://community.secop.gov.co/Public/Tendering/OpportunityDetail/Index?noticeUID=CO1.NTC.3482383&isFromPublicArea=True&isModal=true&asPopupView=true","Contratos de prestación de servicios profesionales y de apoyo a la gestión","Contratación directa","Prestación de servicios profesionales y de apoyo a la gestión, o para la ejecución de trabajos artísticos que sólo puedan encomendarse a determinadas personas naturales","Prestar servicios profesionales para la atención integral de las víctimas del conflicto armado; la gestión, formulación, desarrollo, seguimiento y evaluación del proyecto \"Chapinero territorio de paz\" y la atención de las instacias de participación locales relacionadas con la construcción de paz local.","Inversión","Un nuevo contrato social y ambiental para la Bogotá del Siglo XXI",39,{"$f":"IF(ISERROR(VLOOKUP(K280,[2]Proposito_programa!$C$2:$E$59,2,FALSE)),\" \",VLOOKUP(K280,[2]Proposito_programa!$C$2:$E$59,2,FALSE))","v":"Bogotá territorio de paz y atención integral a las víctimas del conflicto armado"},{"$f":"IF(ISERROR(VLOOKUP(K280,[2]Proposito_programa!$C$2:$E$59,3,FALSE)),\" \",VLOOKUP(K280,[2]Proposito_programa!$C$2:$E$59,3,FALSE))","v":"Propósito 3: Inspirar confianza y legitimidad para vivir sin miedo y ser epicentro de cultura ciudadana, paz y reconciliación"},2028,null,1014284420,"LAURA DANIELA GONZALEZ PACHECO","Persona Natural",null,null,null,null,9200000,0,1,920000,10120000,5826667,"2022-11-03","2022-11-08","13/01/2023",60,1,6,null,null,null,null,"En ejecución",0.9]
[276,2022,"FDLCH-CPS-276-2022","https://community.secop.gov.co/Public/Tendering/OpportunityDetail/Index?noticeUID=CO1.NTC.3483051&isFromPublicArea=True&isModal=true&asPopupView=true","Contratos de prestación de servicios profesionales y de apoyo a la gestión","Contratación directa","Prestación de servicios profesionales y de apoyo a la gestión, o para la ejecución de trabajos artísticos que sólo puedan encomendarse a determinadas personas naturales","Prestar los servicios técnicos de apoyo para la operación, seguimiento y cumplmiento de los procesos y procedimientos del servicio, apoyos económicos TIPO C, requeridos para el oportuno y adecuado registro, cruce y reporte de los datos en el sistema misional SIRBE, que contribuyan a la garantía de los derechos de la población mayor en el marco de la política pública social para el envejecimeinto y la vejez en el distrito capital a cargo de la Alcaldía Local.","Inversión","Un nuevo contrato social y ambiental para la Bogotá del Siglo XXI",1,{"$f":"IF(ISERROR(VLOOKUP(K281,[2]Proposito_programa!$C$2:$E$59,2,FALSE)),\" \",VLOOKUP(K281,[2]Proposito_programa!$C$2:$E$59,2,FALSE))","v":"Subsidios y transferencias para la equidad"},{"$f":"IF(ISERROR(VLOOKUP(K281,[2]Proposito_programa!$C$2:$E$59,3,FALSE)),\" \",VLOOKUP(K281,[2]Proposito_programa!$C$2:$E$59,3,FALSE))","v":"Propósito 1: Hacer un nuevo contrato social para incrementar la inclusión social, productiva y política"},1815,null,80449648,"JUAN CARLOS AREVALO","Persona Natural",null,null,null,null,9000000,0,1,2250000,{"$f":"+W281+X281+Z281","v":11250000},6300000,"2022-11-04","2022-11-04","2023-01-18",60,1,15,null,null,null,null,"En ejecución",0.9]
[277,2022,"FDLCH-CPS-277-2022","https://community.secop.gov.co/Public/Tendering/OpportunityDetail/Index?noticeUID=CO1.NTC.3482736&isFromPublicArea=True&isModal=true&asPopupView=true","Contratos de prestación de servicios profesionales y de apoyo a la gestión","Contratación directa","Prestación de servicios profesionales y de apoyo a la gestión, o para la ejecución de trabajos artísticos que sólo puedan encomendarse a determinadas personas naturales","Prestar servicios profesionales para apoyar al Alcalde Local en l apromoción, articulación, acompañamiento, y seguimiento para al atención y protección de los animales domésticos y silvestres de la localidad.","Inversión","Un nuevo contrato social y ambiental para la Bogotá del Siglo XXI",34,{"$f":"IF(ISERROR(VLOOKUP(K282,[2]Proposito_programa!$C$2:$E$59,2,FALSE)),\" \",VLOOKUP(K282,[2]Proposito_programa!$C$2:$E$59,2,FALSE))","v":"Bogotá protectora de los animales"},{"$f":"IF(ISERROR(VLOOKUP(K282,[2]Proposito_programa!$C$2:$E$59,3,FALSE)),\" \",VLOOKUP(K282,[2]Proposito_programa!$C$2:$E$59,3,FALSE))","v":"Propósito 2 : Cambiar Nuestros Hábitos de Vida para Reverdecer a Bogotá y Adaptarnos y Mitigar la Crisis Climática"},1731,null,33366680,"FRANCY PAOLA MONROY ALVAREZ","Persona Natural",null,null,null,null,10324000,null,1,4645800,14969800,7226800,"2022-11-03","2022-11-04","2023-01-30",60,1,27,null,null,null,null,"En ejecución",0.9]
[278,2022,"FDLCH-CPS-278-2022","https://community.secop.gov.co/Public/Tendering/OpportunityDetail/Index?noticeUID=CO1.NTC.3484112&isFromPublicArea=True&isModal=true&asPopupView=true","Contratos de prestación de servicios profesionales y de apoyo a la gestión","Contratación directa","Prestación de servicios profesionales y de apoyo a la gestión, o para la ejecución de trabajos artísticos que sólo puedan encomendarse a determinadas personas naturales","Prestar servicios profesionales para apoyar la gestión, formulación, desarrollo, seguimiento y evaluación del proyecto de inversión chapinero promueve y genera confianza ciudadana y realizar los apoyos a la supervisión de los contratos que de él se deriven.","Inversión","Un nuevo contrato social y ambiental para la Bogotá del Siglo XXI",43,{"$f":"IF(ISERROR(VLOOKUP(K283,[2]Proposito_programa!$C$2:$E$59,2,FALSE)),\" \",VLOOKUP(K283,[2]Proposito_programa!$C$2:$E$59,2,FALSE))","v":"Cultura ciudadana para la confianza, la convivencia y la participación desde la vida cotidiana"},{"$f":"IF(ISERROR(VLOOKUP(K283,[2]Proposito_programa!$C$2:$E$59,3,FALSE)),\" \",VLOOKUP(K283,[2]Proposito_programa!$C$2:$E$59,3,FALSE))","v":"Propósito 3: Inspirar confianza y legitimidad para vivir sin miedo y ser epicentro de cultura ciudadana, paz y reconciliación"},1735,null,1026568660,"CRISTIAN ANDRES MONROY CARANTON","Persona Natural",null,null,null,null,9200000,0,1,1993333,11193333,6440000,"2022-11-03","2022-11-04","16/01/2023",60,1,13,null,null,null,null,"En ejecución",0.9]
[279,2022,"FDLCH-CPS-279-2022","https://community.secop.gov.co/Public/Tendering/OpportunityDetail/Index?noticeUID=CO1.NTC.3497261&isFromPublicArea=True&isModal=true&asPopupView=true","Contratos de prestación de servicios profesionales y de apoyo a la gestión","Contratación directa","Prestación de servicios profesionales y de apoyo a la gestión, o para la ejecución de trabajos artísticos que sólo puedan encomendarse a determinadas personas naturales","Prestar servicios profesionales para apoyar el área de gestión del desarrollo local de la Alcaldía Local de Chapinero, en la gestión, formulación, desarrollo, seguimiento y evaluación de los temas relacionados con educación superior en la localidad de chapinero, enmarcados en el proyecto de inversión “Chapinero construye futuro y realizar el apoyo a la supervisión de los contratos y/o convenios que de el se deriven”","Inversión","Un nuevo contrato social y ambiental para la Bogotá del Siglo XXI",17,{"$f":"IF(ISERROR(VLOOKUP(K284,[2]Proposito_programa!$C$2:$E$59,2,FALSE)),\" \",VLOOKUP(K284,[2]Proposito_programa!$C$2:$E$59,2,FALSE))","v":"Jóvenes con capacidades: Proyecto de vida para la ciudadanía, la innovación y el trabajo del siglo XXI"},{"$f":"IF(ISERROR(VLOOKUP(K284,[2]Proposito_programa!$C$2:$E$59,3,FALSE)),\" \",VLOOKUP(K284,[2]Proposito_programa!$C$2:$E$59,3,FALSE))","v":"Propósito 1: Hacer un nuevo contrato social para incrementar la inclusión social, productiva y política"},1743,null,7724577,"JUAN CARLOS DUSSAN ZULETA","Persona Natural",null,null,null,null,9600000,0,null,null,9600000,5920000,"2022-11-08","2022-11-09","2023-01-08",60,null,null,null,null,null,null,"Terminado",1]
[280,2022,"FDLCH-CPS-280-2022","https://community.secop.gov.co/Public/Tendering/OpportunityDetail/Index?noticeUID=CO1.NTC.3497927&isFromPublicArea=True&isModal=true&asPopupView=true","Contratos de prestación de servicios profesionales y de apoyo a la gestión","Contratación directa","Prestación de servicios profesionales y de apoyo a la gestión, o para la ejecución de trabajos artísticos que sólo puedan encomendarse a determinadas personas naturales","Prestar los servicios profesionales de apoyo a la gestión para la formulación, desarrollo y seguimiento del proyecto de inversión \"Chapinero modelo de moviidad inteligente\"","Inversión","Un nuevo contrato social y ambiental para la Bogotá del Siglo XXI",49,{"$f":"IF(ISERROR(VLOOKUP(K285,[2]Proposito_programa!$C$2:$E$59,2,FALSE)),\" \",VLOOKUP(K285,[2]Proposito_programa!$C$2:$E$59,2,FALSE))","v":"Movilidad segura, sostenible y accesible"},{"$f":"IF(ISERROR(VLOOKUP(K285,[2]Proposito_programa!$C$2:$E$59,3,FALSE)),\" \",VLOOKUP(K285,[2]Proposito_programa!$C$2:$E$59,3,FALSE))","v":"Propósito 4: Hacer de Bogotá Región un modelo de movilidad multimodal, incluyente y sostenible"},1734,null,1014240563,"DIEGO MANUEL SALGADO GUTIERREZ","Persona Natural",null,null,null,null,12500000,0,1,3500000,16000000,6166667,"2022-11-08","2022-11-09","2023-02-14",60,1,21,1015471441,"RICARDO ANDRES SANCHEZ VARGAS","28/12/2022",7833333,"En ejecución",0.85]
[281,2022,"FDLCH-CPS-281-2022","https://community.secop.gov.co/Public/Tendering/OpportunityDetail/Index?noticeUID=CO1.NTC.3498124&isFromPublicArea=True&isModal=true&asPopupView=true","Contratos de prestación de servicios profesionales y de apoyo a la gestión","Contratación directa","Prestación de servicios profesionales y de apoyo a la gestión, o para la ejecución de trabajos artísticos que sólo puedan encomendarse a determinadas personas naturales","Prestar los servicios profesionales para la gestión, formulación, desarrollo y seguimiento del proyecto de inversión \"Chapinero espacio para hábitos saludables\"","Inversión","Un nuevo contrato social y ambiental para la Bogotá del Siglo XXI",33,{"$f":"IF(ISERROR(VLOOKUP(K286,[2]Proposito_programa!$C$2:$E$59,2,FALSE)),\" \",VLOOKUP(K286,[2]Proposito_programa!$C$2:$E$59,2,FALSE))","v":"Más árboles y más y mejor espacio público"},{"$f":"IF(ISERROR(VLOOKUP(K286,[2]Proposito_programa!$C$2:$E$59,3,FALSE)),\" \",VLOOKUP(K286,[2]Proposito_programa!$C$2:$E$59,3,FALSE))","v":"Propósito 2 : Cambiar Nuestros Hábitos de Vida para Reverdecer a Bogotá y Adaptarnos y Mitigar la Crisis Climática"},1723,null,1018461926,"FABIAN ANDRES CARDONA MARTINEZ","Persona Natural",null,null,null,null,12500000,0,1,6166667,18666667,6166667,"2022-11-08","2022-11-09","28/02/2023",60,1,37,null,null,null,null,"En ejecución",0.85]
[282,2022,"FDLCH-CPS-282-2022","https://community.secop.gov.co/Public/Tendering/OpportunityDetail/Index?noticeUID=CO1.NTC.3498274&isFromPublicArea=True&isModal=true&asPopupView=true","Contratos de prestación de servicios profesionales y de apoyo a la gestión","Contratación directa","Prestación de servicios profesionales y de apoyo a la gestión, o para la ejecución de trabajos artísticos que sólo puedan encomendarse a determinadas personas naturales","Prestar los servicios técnicos de apoyo a la gestión, acciones administrativas y seguimiento de las actividades derivadas del proyecto de inversión \"Chapinero modelo de movilidad inteligente\"","Inversión","Un nuevo contrato social y ambiental para la Bogotá del Siglo XXI",49,{"$f":"IF(ISERROR(VLOOKUP(K287,[2]Proposito_programa!$C$2:$E$59,2,FALSE)),\" \",VLOOKUP(K287,[2]Proposito_programa!$C$2:$E$59,2,FALSE))","v":"Movilidad segura, sostenible y accesible"},{"$f":"IF(ISERROR(VLOOKUP(K287,[2]Proposito_programa!$C$2:$E$59,3,FALSE)),\" \",VLOOKUP(K287,[2]Proposito_programa!$C$2:$E$59,3,FALSE))","v":"Propósito 4: Hacer de Bogotá Región un modelo de movilidad multimodal, incluyente y sostenible"},1734,null,1022388528,"JHON FREDDY VALERO MAYA","Persona Natural",null,null,null,null,7995000,0,1,3944200,11939200,3944200,"2022-11-08","2022-11-09","2023-02-28",60,1,37,null,null,null,null,"En ejecución",0.85]
[283,2022,"FDLCH-CPS-283-2022","https://community.secop.gov.co/Public/Tendering/OpportunityDetail/Index?noticeUID=CO1.NTC.3497096&isFromPublicArea=True&isModal=true&asPopupView=true","Contratos de prestación de servicios profesionales y de apoyo a la gestión","Contratación directa","Prestación de servicios profesionales y de apoyo a la gestión, o para la ejecución de trabajos artísticos que sólo puedan encomendarse a determinadas personas naturales","Prestar los servicios de apoyo a la gestión administrativa y asistencial a las Inspecciones de Policía de la Localidad","Inversión","Un nuevo contrato social y ambiental para la Bogotá del Siglo XXI",57,{"$f":"IF(ISERROR(VLOOKUP(K288,[2]Proposito_programa!$C$2:$E$59,2,FALSE)),\" \",VLOOKUP(K288,[2]Proposito_programa!$C$2:$E$59,2,FALSE))","v":"Gestión pública local"},{"$f":"IF(ISERROR(VLOOKUP(K288,[2]Proposito_programa!$C$2:$E$59,3,FALSE)),\" \",VLOOKUP(K288,[2]Proposito_programa!$C$2:$E$59,3,FALSE))","v":"Propósito 5: Construir Bogotá - Región con gobierno abierto, transparente y ciudadanía consciente"},1841,null,1032462820,"JENNIFER VANNESA NIÑO DIAZ","Persona Natural",null,null,null,null,4400000,0,null,null,4400000,1613333,"2022-11-08","2022-11-09","2023-01-08",60,null,null,null,null,null,null,"Terminado",1]
[284,2022,"FDLCH-CPS-284-2022","https://community.secop.gov.co/Public/Tendering/OpportunityDetail/Index?noticeUID=CO1.NTC.3497414&isFromPublicArea=True&isModal=true&asPopupView=true","Contratos de prestación de servicios profesionales y de apoyo a la gestión","Contratación directa","Prestación de servicios profesionales y de apoyo a la gestión, o para la ejecución de trabajos artísticos que sólo puedan encomendarse a determinadas personas naturales","Prestar servicios de apoyo a la gestión, para apoyar al área de gestión del desarrollo local de la alcaldía local de chapinero, en la gestión, desarrollo, seguimiento y evaluación del proyecto de inversión chapinero es primera infancia del programa educación inicial: bases sólidas para la vida","Inversión","Un nuevo contrato social y ambiental para la Bogotá del Siglo XXI",12,{"$f":"IF(ISERROR(VLOOKUP(K289,[2]Proposito_programa!$C$2:$E$59,2,FALSE)),\" \",VLOOKUP(K289,[2]Proposito_programa!$C$2:$E$59,2,FALSE))","v":"Educación inicial: Bases sólidas para la vida."},{"$f":"IF(ISERROR(VLOOKUP(K289,[2]Proposito_programa!$C$2:$E$59,3,FALSE)),\" \",VLOOKUP(K289,[2]Proposito_programa!$C$2:$E$59,3,FALSE))","v":"Propósito 1: Hacer un nuevo contrato social para incrementar la inclusión social, productiva y política"},1830,null,1031138150,"DIANA PAOLA AGUDELO CABRERA","Persona Natural",null,null,null,null,6800000,0,1,3354667,10154667,3354667,"2022-11-08","2022-11-09","2023-02-03",60,1,37,null,null,null,null,"En ejecución",0.85]
[285,2022,"FDLCH-CPS-285-2022","https://community.secop.gov.co/Public/Tendering/OpportunityDetail/Index?noticeUID=CO1.NTC.3503410&isFromPublicArea=True&isModal=true&asPopupView=true","Contratos de prestación de servicios profesionales y de apoyo a la gestión","Contratación directa","Prestación de servicios profesionales y de apoyo a la gestión, o para la ejecución de trabajos artísticos que sólo puedan encomendarse a determinadas personas naturales","Apoyar en las tareas operativas de carácter archivístico desarrolladas en la Alcaldía Lcoal de Chapinero para garantizar la aplicación correcta de los procedimientos técnicos.","Inversión","Un nuevo contrato social y ambiental para la Bogotá del Siglo XXI",57,{"$f":"IF(ISERROR(VLOOKUP(K290,[2]Proposito_programa!$C$2:$E$59,2,FALSE)),\" \",VLOOKUP(K290,[2]Proposito_programa!$C$2:$E$59,2,FALSE))","v":"Gestión pública local"},{"$f":"IF(ISERROR(VLOOKUP(K290,[2]Proposito_programa!$C$2:$E$59,3,FALSE)),\" \",VLOOKUP(K290,[2]Proposito_programa!$C$2:$E$59,3,FALSE))","v":"Propósito 5: Construir Bogotá - Región con gobierno abierto, transparente y ciudadanía consciente"},1741,null,53054241,"GINNA PAOLA FONSECA CASAS","Persona Natural",null,null,null,null,6414000,0,1,3207000,9621000,3848400,"2022-11-09","2022-11-10","2023-09-02",60,1,30,null,null,null,null,"En ejecución",0.3]
[286,2022,"FDLCH-CPS-286-2022","https://community.secop.gov.co/Public/Tendering/OpportunityDetail/Index?noticeUID=CO1.NTC.3502968&isFromPublicArea=True&isModal=true&asPopupView=true","Contratos de prestación de servicios profesionales y de apoyo a la gestión","Contratación directa","Prestación de servicios profesionales y de apoyo a la gestión, o para la ejecución de trabajos artísticos que sólo puedan encomendarse a determinadas personas naturales","Prestar servicios asistenciales para apoyar al Alcalde Local en la promoción, articulación, acompañamiento y seguimiento para la atención y protección de los animales domésticos y silvestres de la localidad.","Inversión","Un nuevo contrato social y ambiental para la Bogotá del Siglo XXI",34,{"$f":"IF(ISERROR(VLOOKUP(K291,[2]Proposito_programa!$C$2:$E$59,2,FALSE)),\" \",VLOOKUP(K291,[2]Proposito_programa!$C$2:$E$59,2,FALSE))","v":"Bogotá protectora de los animales"},{"$f":"IF(ISERROR(VLOOKUP(K291,[2]Proposito_programa!$C$2:$E$59,3,FALSE)),\" \",VLOOKUP(K291,[2]Proposito_programa!$C$2:$E$59,3,FALSE))","v":"Propósito 2 : Cambiar Nuestros Hábitos de Vida para Reverdecer a Bogotá y Adaptarnos y Mitigar la Crisis Climática"},1731,null,53161037,"YURY MATOMA MENDEZ","Persona Natural",null,null,null,null,4400000,0,null,null,4400000,1466667,"2022-11-09","2022-11-10","2023-01-09",60,null,null,null,null,null,null,"Terminado",1]
[287,2022,"FDLCH-CPS-287-2022","https://community.secop.gov.co/Public/Tendering/OpportunityDetail/Index?noticeUID=CO1.NTC.3503617&isFromPublicArea=True&isModal=true&asPopupView=true","Contratos de prestación de servicios profesionales y de apoyo a la gestión","Contratación directa","Prestación de servicios profesionales y de apoyo a la gestión, o para la ejecución de trabajos artísticos que sólo puedan encomendarse a determinadas personas naturales","Prestar servicios asistenciales de apoyo para la gestión y desarrollo del proyecto de inversión No. 1715 \"Chapinero restaurasdor y cuidador del territorio\".","Inversión","Un nuevo contrato social y ambiental para la Bogotá del Siglo XXI",28,{"$f":"IF(ISERROR(VLOOKUP(K292,[2]Proposito_programa!$C$2:$E$59,2,FALSE)),\" \",VLOOKUP(K292,[2]Proposito_programa!$C$2:$E$59,2,FALSE))","v":"Bogotá protectora de sus recursos naturales"},{"$f":"IF(ISERROR(VLOOKUP(K292,[2]Proposito_programa!$C$2:$E$59,3,FALSE)),\" \",VLOOKUP(K292,[2]Proposito_programa!$C$2:$E$59,3,FALSE))","v":"Propósito 2 : Cambiar Nuestros Hábitos de Vida para Reverdecer a Bogotá y Adaptarnos y Mitigar la Crisis Climática"},1715,null,52131900,"MAGDA LUCIA RIVERA JOYA","Persona Natural",null,null,null,null,4400000,0,null,null,4400000,1466667,"2022-11-10","2022-11-11","2023-01-10",60,null,null,null,null,null,null,"En ejecución",0.9]
[288,2022,"FDLCH-CPS-288-2022","https://community.secop.gov.co/Public/Tendering/OpportunityDetail/Index?noticeUID=CO1.NTC.3506918&isFromPublicArea=True&isModal=true&asPopupView=true","Contratos de prestación de servicios profesionales y de apoyo a la gestión","Contratación directa","Prestación de servicios profesionales y de apoyo a la gestión, o para la ejecución de trabajos artísticos que sólo puedan encomendarse a determinadas personas naturales","Prestar sus servicios profesionales para la implementación de las acciones y lineamientos técnicos surtidos del programa de gestión documental y demás instrumentos técnicos archivísticos.","Inversión","Un nuevo contrato social y ambiental para la Bogotá del Siglo XXI",57,{"$f":"IF(ISERROR(VLOOKUP(K293,[2]Proposito_programa!$C$2:$E$59,2,FALSE)),\" \",VLOOKUP(K293,[2]Proposito_programa!$C$2:$E$59,2,FALSE))","v":"Gestión pública local"},{"$f":"IF(ISERROR(VLOOKUP(K293,[2]Proposito_programa!$C$2:$E$59,3,FALSE)),\" \",VLOOKUP(K293,[2]Proposito_programa!$C$2:$E$59,3,FALSE))","v":"Propósito 5: Construir Bogotá - Región con gobierno abierto, transparente y ciudadanía consciente"},1741,null,52423626,"DIANA PAOLA OVALLE RODRIGUEZ","Persona Natural",null,null,null,null,12930000,0,1,5172000,18102000,6206400,"2022-11-10","2022-11-10","2023-02-24",60,1,30,null,null,null,null,"En ejecución",0.85]
[289,2022,"FDLCH-CPS-289-2022","https://community.secop.gov.co/Public/Tendering/OpportunityDetail/Index?noticeUID=CO1.NTC.3515914&isFromPublicArea=True&isModal=true&asPopupView=true","Contratos de prestación de servicios profesionales y de apoyo a la gestión","Contratación directa","Prestación de servicios profesionales y de apoyo a la gestión, o para la ejecución de trabajos artísticos que sólo puedan encomendarse a determinadas personas naturales","Prestar servicios técnicos de apoyo a la gestión, para el desarrollo de los procesos de formación y transformación ambiental en la localidad en el marco en el proyecto 1712 \"Chapinero consiencte y resilente con el cambio climático\".","Inversión","Un nuevo contrato social y ambiental para la Bogotá del Siglo XXI",27,{"$f":"IF(ISERROR(VLOOKUP(K294,[2]Proposito_programa!$C$2:$E$59,2,FALSE)),\" \",VLOOKUP(K294,[2]Proposito_programa!$C$2:$E$59,2,FALSE))","v":"Cambio cultural para la gestión de la crisis climática"},{"$f":"IF(ISERROR(VLOOKUP(K294,[2]Proposito_programa!$C$2:$E$59,3,FALSE)),\" \",VLOOKUP(K294,[2]Proposito_programa!$C$2:$E$59,3,FALSE))","v":"Propósito 2 : Cambiar Nuestros Hábitos de Vida para Reverdecer a Bogotá y Adaptarnos y Mitigar la Crisis Climática"},1712,null,1019127835,"NATALIA PUERTO GONZALEZ","Persona Natural",null,null,null,null,7000000,0,1,3500000,10500000,3616667,"2022-11-11","2022-11-15","14/02/2023",60,1,30,null,null,null,null,"Terminado",0]
[290,2022,"FDLCH-CPS-290-2022","https://community.secop.gov.co/Public/Tendering/OpportunityDetail/Index?noticeUID=CO1.NTC.3515785&isFromPublicArea=True&isModal=true&asPopupView=true","Contratos de prestación de servicios profesionales y de apoyo a la gestión","Contratación directa","Prestación de servicios profesionales y de apoyo a la gestión, o para la ejecución de trabajos artísticos que sólo puedan encomendarse a determinadas personas naturales","Apoyar jurídicamente la ejecución de las acciones requeridas para la depuración de las actuaciones administrativas que cursan en la Alcaldía Local.","Inversión","Un nuevo contrato social y ambiental para la Bogotá del Siglo XXI",57,{"$f":"IF(ISERROR(VLOOKUP(K295,[2]Proposito_programa!$C$2:$E$59,2,FALSE)),\" \",VLOOKUP(K295,[2]Proposito_programa!$C$2:$E$59,2,FALSE))","v":"Gestión pública local"},{"$f":"IF(ISERROR(VLOOKUP(K295,[2]Proposito_programa!$C$2:$E$59,3,FALSE)),\" \",VLOOKUP(K295,[2]Proposito_programa!$C$2:$E$59,3,FALSE))","v":"Propósito 5: Construir Bogotá - Región con gobierno abierto, transparente y ciudadanía consciente"},1841,null,1026267438,"SERGIO GEOVANNY TOCANCIPA ARIZA","Persona Natural",null,null,null,null,9200000,0,null,null,9200000,2453333,"2022-11-11","2022-11-15","2023-01-14",60,null,null,null,null,null,null,"En ejecución",0.9]
[291,2022,"FDLCH-CPS-291-2022","https://community.secop.gov.co/Public/Tendering/OpportunityDetail/Index?noticeUID=CO1.NTC.3531724&isFromPublicArea=True&isModal=true&asPopupView=true","Contratos de prestación de servicios profesionales y de apoyo a la gestión","Contratación directa","Prestación de servicios profesionales y de apoyo a la gestión, o para la ejecución de trabajos artísticos que sólo puedan encomendarse a determinadas personas naturales","Prestar servicios profesionales para la gestión, formulación, desarrollo y seguimiento del proyecto de inversión proyecto chapinero sostenible y consciente.","Inversión","Un nuevo contrato social y ambiental para la Bogotá del Siglo XXI",38,{"$f":"IF(ISERROR(VLOOKUP(K296,[2]Proposito_programa!$C$2:$E$59,2,FALSE)),\" \",VLOOKUP(K296,[2]Proposito_programa!$C$2:$E$59,2,FALSE))","v":"Ecoeficiencia, reciclaje, manejo de residuos e inclusión de la población recicladora"},{"$f":"IF(ISERROR(VLOOKUP(K296,[2]Proposito_programa!$C$2:$E$59,3,FALSE)),\" \",VLOOKUP(K296,[2]Proposito_programa!$C$2:$E$59,3,FALSE))","v":"Propósito 2 : Cambiar Nuestros Hábitos de Vida para Reverdecer a Bogotá y Adaptarnos y Mitigar la Crisis Climática"},1728,null,1019031184,"RAYMOND ALEXANDER JIMENEZ ARTEAGA","Persona Natural",null,null,null,null,10000000,0,1,2000000,12000000,2166667,"2022-11-17","2022-11-18","29/01/2023",60,1,12,null,null,null,null,"En ejecución",0.9]
[292,2022,"FDLCH-CPS-292-2022","https://community.secop.gov.co/Public/Tendering/OpportunityDetail/Index?noticeUID=CO1.NTC.3525521&isFromPublicArea=True&isModal=true&asPopupView=true","Contratos de prestación de servicios profesionales y de apoyo a la gestión","Contratación directa","Prestación de servicios profesionales y de apoyo a la gestión, o para la ejecución de trabajos artísticos que sólo puedan encomendarse a determinadas personas naturales","Apoyar juridicamente la ejecución de las acciones requeridas para el trámite e impulso procesal de las actuaciones contravencionales y/o querellas que cursen en las inspecciones de policia de la Alcaldía Local de Chapinero.","Inversión","Un nuevo contrato social y ambiental para la Bogotá del Siglo XXI",57,{"$f":"IF(ISERROR(VLOOKUP(K297,[2]Proposito_programa!$C$2:$E$59,2,FALSE)),\" \",VLOOKUP(K297,[2]Proposito_programa!$C$2:$E$59,2,FALSE))","v":"Gestión pública local"},{"$f":"IF(ISERROR(VLOOKUP(K297,[2]Proposito_programa!$C$2:$E$59,3,FALSE)),\" \",VLOOKUP(K297,[2]Proposito_programa!$C$2:$E$59,3,FALSE))","v":"Propósito 5: Construir Bogotá - Región con gobierno abierto, transparente y ciudadanía consciente"},1841,null,1010161720,"LIZETH NOHELIA BALLESTEROS TORRES","Persona Natural",null,null,null,null,9200000,0,null,null,9200000,4600000,"2022-11-15","2022-11-16","2023-01-15",60,null,null,null,null,null,null,"En ejecución",0.9]
[293,2022,"FDLCH-CPS-293-2022","https://community.secop.gov.co/Public/Tendering/OpportunityDetail/Index?noticeUID=CO1.NTC.3525191&isFromPublicArea=True&isModal=true&asPopupView=true","Contratos de prestación de servicios profesionales y de apoyo a la gestión","Contratación directa","Prestación de servicios profesionales y de apoyo a la gestión, o para la ejecución de trabajos artísticos que sólo puedan encomendarse a determinadas personas naturales","Apoyar juridicamente la ejecución de las acciones requeridas para el trámite e impulso procesal de las actuaciones contravencionales y/o querellas que cursen en las inspecciones de policia de la Alcaldía Local de Chapinero.","Inversión","Un nuevo contrato social y ambiental para la Bogotá del Siglo XXI",57,{"$f":"IF(ISERROR(VLOOKUP(K298,[2]Proposito_programa!$C$2:$E$59,2,FALSE)),\" \",VLOOKUP(K298,[2]Proposito_programa!$C$2:$E$59,2,FALSE))","v":"Gestión pública local"},{"$f":"IF(ISERROR(VLOOKUP(K298,[2]Proposito_programa!$C$2:$E$59,3,FALSE)),\" \",VLOOKUP(K298,[2]Proposito_programa!$C$2:$E$59,3,FALSE))","v":"Propósito 5: Construir Bogotá - Región con gobierno abierto, transparente y ciudadanía consciente"},1841,null,1026275441,"INGRID SORAIDA CLAVIJO CRUZ","Persona Natural",null,null,null,null,9200000,0,null,null,9200000,4600000,"2022-11-15","2022-11-16","2023-01-15",60,null,null,null,null,null,null,"En ejecución",0.9]
[294,2022,"FDLCH-CPS-294-2022","https://community.secop.gov.co/Public/Tendering/OpportunityDetail/Index?noticeUID=CO1.NTC.3550840&isFromPublicArea=True&isModal=true&asPopupView=true","Contratos de prestación de servicios profesionales y de apoyo a la gestión","Contratación directa","Prestación de servicios profesionales y de apoyo a la gestión, o para la ejecución de trabajos artísticos que sólo puedan encomendarse a determinadas personas naturales","Prestar servicios de apoyo a la gestión en la ejecución de las actividades administrativa sy documentales relacionadas con la gestión policiva en la Alcaldía Local de Chapinero.","Inversión","Un nuevo contrato social y ambiental para la Bogotá del Siglo XXI",57,{"$f":"IF(ISERROR(VLOOKUP(K299,[2]Proposito_programa!$C$2:$E$59,2,FALSE)),\" \",VLOOKUP(K299,[2]Proposito_programa!$C$2:$E$59,2,FALSE))","v":"Gestión pública local"},{"$f":"IF(ISERROR(VLOOKUP(K299,[2]Proposito_programa!$C$2:$E$59,3,FALSE)),\" \",VLOOKUP(K299,[2]Proposito_programa!$C$2:$E$59,3,FALSE))","v":"Propósito 5: Construir Bogotá - Región con gobierno abierto, transparente y ciudadanía consciente"},1741,null,52965668,"SONIA ALEXIS MELO CAÑON","Persona Natural",null,null,null,null,3300000,0,null,null,3300000,1246667,"2022-11-23","2022-11-29","2023-01-12",60,null,null,null,null,null,null,"En ejecución",0.9]
[295,2022,"FDLCH-CPS-295-2022","https://community.secop.gov.co/Public/Tendering/OpportunityDetail/Index?noticeUID=CO1.NTC.3550545&isFromPublicArea=True&isModal=true&asPopupView=true","Contratos de prestación de servicios profesionales y de apoyo a la gestión","Contratación directa","Prestación de servicios profesionales y de apoyo a la gestión, o para la ejecución de trabajos artísticos que sólo puedan encomendarse a determinadas personas naturales","Prestar servicios profesionales de apoyo a la gestión para el desarrollo de actividades relacionadas con la formulación, seguimiento, terminación y cierre de proyectos de inversión relacionados con la gestión ambiental local en el marco del proyecto de inversión Chapinero Siempra Esperanza.","Inversión","Un nuevo contrato social y ambiental para la Bogotá del Siglo XXI",24,{"$f":"IF(ISERROR(VLOOKUP(K300,[2]Proposito_programa!$C$2:$E$59,2,FALSE)),\" \",VLOOKUP(K300,[2]Proposito_programa!$C$2:$E$59,2,FALSE))","v":"Bogotá región emprendedora e innovadora"},{"$f":"IF(ISERROR(VLOOKUP(K300,[2]Proposito_programa!$C$2:$E$59,3,FALSE)),\" \",VLOOKUP(K300,[2]Proposito_programa!$C$2:$E$59,3,FALSE))","v":"Propósito 1: Hacer un nuevo contrato social para incrementar la inclusión social, productiva y política"},1631,null,1033773200,"PAULA ROCIO VELOZA MARTINEZ","Persona Natural",null,null,null,null,5000000,0,1,2500000,7500000,3833333,"2022-11-22","2022-11-23","2023-01-06",30,1,15,null,null,null,null,"Terminado",1]
[296,2022,"FDLCH-CPS-296-2022","https://community.secop.gov.co/Public/Tendering/OpportunityDetail/Index?noticeUID=CO1.NTC.3558035&isFromPublicArea=True&isModal=true&asPopupView=true","Contratos de prestación de servicios profesionales y de apoyo a la gestión","Contratación directa","Prestación de servicios profesionales y de apoyo a la gestión, o para la ejecución de trabajos artísticos que sólo puedan encomendarse a determinadas personas naturales","Prestar servicios asistenciales de apoyo a la gestión para el desarrollo de actividades relacionadas con la asistencia administrativa, seguimiento, terminación y cierre de proyectos de inversión relacionados con la gestión ambiental local en el marco del proyecto de inversión\" Chapinero siembra esperanza\".","Inversión","Un nuevo contrato social y ambiental para la Bogotá del Siglo XXI",24,{"$f":"IF(ISERROR(VLOOKUP(K301,[2]Proposito_programa!$C$2:$E$59,2,FALSE)),\" \",VLOOKUP(K301,[2]Proposito_programa!$C$2:$E$59,2,FALSE))","v":"Bogotá región emprendedora e innovadora"},{"$f":"IF(ISERROR(VLOOKUP(K301,[2]Proposito_programa!$C$2:$E$59,3,FALSE)),\" \",VLOOKUP(K301,[2]Proposito_programa!$C$2:$E$59,3,FALSE))","v":"Propósito 1: Hacer un nuevo contrato social para incrementar la inclusión social, productiva y política"},1631,null,1024569859,"YEISON JESUS SANCHEZ WALDO","Persona Natural",null,null,null,null,4400000,0,1,2200000,6600000,1100000,"2022-11-24","2022-12-01","28/02/2023",60,1,30,null,null,null,null,"En ejecución",0.85]
[297,2022,"FDLCH-CPS-297-2022","https://community.secop.gov.co/Public/Tendering/OpportunityDetail/Index?noticeUID=CO1.NTC.3559368&isFromPublicArea=True&isModal=true&asPopupView=true","Contratos de prestación de servicios profesionales y de apoyo a la gestión","Contratación directa","Prestación de servicios profesionales y de apoyo a la gestión, o para la ejecución de trabajos artísticos que sólo puedan encomendarse a determinadas personas naturales","Prestar servicios técnicos de apoyo a la gestión en la implementación, atención, verificación, soporte y acompañamiento de los procesos y/o actuaciones administrativas de registro y seguimiento a la propiedad horizontal y protección al consumidor en los aplicativos y/o herramientas virtuales en la Localidad de Chapinero","Inversión","Un nuevo contrato social y ambiental para la Bogotá del Siglo XXI",57,{"$f":"IF(ISERROR(VLOOKUP(K302,[2]Proposito_programa!$C$2:$E$59,2,FALSE)),\" \",VLOOKUP(K302,[2]Proposito_programa!$C$2:$E$59,2,FALSE))","v":"Gestión pública local"},{"$f":"IF(ISERROR(VLOOKUP(K302,[2]Proposito_programa!$C$2:$E$59,3,FALSE)),\" \",VLOOKUP(K302,[2]Proposito_programa!$C$2:$E$59,3,FALSE))","v":"Propósito 5: Construir Bogotá - Región con gobierno abierto, transparente y ciudadanía consciente"},1741,null,1026595076,"VALENTINA SALGADO RODRIGUEZ","Persona Natural",null,null,null,null,4500000,0,null,{"$f":"648088+1551912","v":2200000},6700000,2300000,"2022-11-23","2022-11-23","28/01/2023",30,1,22,null,null,null,null,"En ejecución",0.9]
[298,2022,"FDLCH-CI-298-2022","https://www.contratos.gov.co/consultas/detalleProceso.do?numConstancia=22-22-51852&g-recaptcha-response=03AEkXODBiwzG2fiAkN0BWhvA6js09_4XFAmem6pSVZfwCkuXSIzT9rThcnsRutPvSTxjADjMFVjuekBhaMQ5PGmmxcvIZVncrJViovaeye-14cQYjDumuVARBHdFb9SwRVVhYKCjvscBL32RJnbLCfSlr9L_NZ1WDXY3bVPNrkLsTzvpS8EuE8ZrjxkjgKkj7AYoKD9RgqFYhxTtg8KJcwMOrW0yCCpnTKgcoFNM2ZjljQB1vNqLvMLeRtwv1mSZ6Qg7e1CrRjQfkonib-kXtA9J9E6ULSeNriN1f-TAYCTWEI1fW2SCpSNQYbdDeJSuUDsMA1TiHxlnwbpARa3jrIfmhr7rHgUe3NPPAykl8lkxBA0c5MzH5rPZwfjK8heY3AK7ILep_5U7lL6W8ZJrsf1Gx9XXJjub2-8ozqrnMAKBN7lMLYFQ-Pk6OF1bhQva3s9FXlb_qMoLXoMoO28huvVMhiX5XBMz9OBsLBBMiFWwbyozqEfQL1MsKjmiKPMJVlBE7gPC6Z64qjqP5nrX3LxVuwFqK5Zmk_g","Convenios/Contratos interadministrativos","Contratación directa","Contratos interadministrativos","Prestar los servicios de planeación, ejecución y divulgación de las actividades a desarrollarse en el marco de la acción de ciudad NAVIDAD 2022, relacionadas con la generación de los entornos lumínicos y difusión de los actos principales que harán parte de la estrategia comunicacional a cargo de la Oficina Consejería de Comunicaciones de la Secretaría General de Alcaldía Mayor de Bogotá.","Inversión","Un nuevo contrato social y ambiental para la Bogotá del Siglo XXI",21,{"$f":"IF(ISERROR(VLOOKUP(K303,[2]Proposito_programa!$C$2:$E$59,2,FALSE)),\" \",VLOOKUP(K303,[2]Proposito_programa!$C$2:$E$59,2,FALSE))","v":"Creación y vida cotidiana: Apropiación ciudadana del arte, la cultura y el patrimonio, para la democracia cultural"},{"$f":"IF(ISERROR(VLOOKUP(K303,[2]Proposito_programa!$C$2:$E$59,3,FALSE)),\" \",VLOOKUP(K303,[2]Proposito_programa!$C$2:$E$59,3,FALSE))","v":"Propósito 1: Hacer un nuevo contrato social para incrementar la inclusión social, productiva y política"},1848,null,830012587,"CANAL CAPITAL","Persona Jurídica",null,null,null,null,100000000,0,null,null,100000000,50000000,"2022-10-28","2022-11-24","2023-03-31",120,null,null,null,null,null,null,"En ejecución",0.75]
[299,2022,"FDLCH-CPS-299-2022","https://community.secop.gov.co/Public/Tendering/OpportunityDetail/Index?noticeUID=CO1.NTC.3575332&isFromPublicArea=True&isModal=true&asPopupView=true","Contratos de prestación de servicios profesionales y de apoyo a la gestión","Contratación directa","Prestación de servicios profesionales y de apoyo a la gestión, o para la ejecución de trabajos artísticos que sólo puedan encomendarse a determinadas personas naturales","Prestar los servicios como  \"SABEDORES(AS) ANCESTRALES\" para desarrollar acciones que permitan identificar, visibilizar y reconocer los saberes ancestrales para el cuidado de la salud de los grupos étnicos presentes en la Localidad de Chapinero.","Inversión","Un nuevo contrato social y ambiental para la Bogotá del Siglo XXI",6,{"$f":"IF(ISERROR(VLOOKUP(K304,[2]Proposito_programa!$C$2:$E$59,2,FALSE)),\" \",VLOOKUP(K304,[2]Proposito_programa!$C$2:$E$59,2,FALSE))","v":"Sistema Distrital de Cuidado"},{"$f":"IF(ISERROR(VLOOKUP(K304,[2]Proposito_programa!$C$2:$E$59,3,FALSE)),\" \",VLOOKUP(K304,[2]Proposito_programa!$C$2:$E$59,3,FALSE))","v":"Propósito 1: Hacer un nuevo contrato social para incrementar la inclusión social, productiva y política"},2024,null,286182,"ALVARO IBAÑEZ GARCIA","Persona Natural",null,null,null,null,3600000,0,null,null,3600000,0,"2022-11-25","2022-12-02","2023-03-04",60,null,null,null,null,null,null,"En ejecución",0.75]
[300,2022,"FDLCH-CPS-300-2022","https://community.secop.gov.co/Public/Tendering/OpportunityDetail/Index?noticeUID=CO1.NTC.3575177&isFromPublicArea=True&isModal=true&asPopupView=true","Contratos de prestación de servicios profesionales y de apoyo a la gestión","Contratación directa","Prestación de servicios profesionales y de apoyo a la gestión, o para la ejecución de trabajos artísticos que sólo puedan encomendarse a determinadas personas naturales","Prestar los servicios como  \"SABEDORES(AS) ANCESTRALES\" para desarrollar acciones que permitan identificar, visibilizar y reconocer los saberes ancestrales para el cuidado de la salud de los grupos étnicos presentes en la Localidad de Chapinero.","Inversión","Un nuevo contrato social y ambiental para la Bogotá del Siglo XXI",6,{"$f":"IF(ISERROR(VLOOKUP(K305,[2]Proposito_programa!$C$2:$E$59,2,FALSE)),\" \",VLOOKUP(K305,[2]Proposito_programa!$C$2:$E$59,2,FALSE))","v":"Sistema Distrital de Cuidado"},{"$f":"IF(ISERROR(VLOOKUP(K305,[2]Proposito_programa!$C$2:$E$59,3,FALSE)),\" \",VLOOKUP(K305,[2]Proposito_programa!$C$2:$E$59,3,FALSE))","v":"Propósito 1: Hacer un nuevo contrato social para incrementar la inclusión social, productiva y política"},2024,null,80420343,"HERMEN ANACONA UNI","Persona Natural",null,null,null,null,3600000,0,null,null,3600000,0,"2022-11-25","2022-12-02","2023-03-04",60,null,null,null,null,null,null,"En ejecución",0.75]
[301,2022,"FDLCH-CPS-301-2022","https://community.secop.gov.co/Public/Tendering/OpportunityDetail/Index?noticeUID=CO1.NTC.3575621&isFromPublicArea=True&isModal=true&asPopupView=true","Contratos de prestación de servicios profesionales y de apoyo a la gestión","Contratación directa","Prestación de servicios profesionales y de apoyo a la gestión, o para la ejecución de trabajos artísticos que sólo puedan encomendarse a determinadas personas naturales","Prestar los servicios como  \"SABEDORES(AS) ANCESTRALES\" para desarrollar acciones que permitan identificar, visibilizar y reconocer los saberes ancestrales para el cuidado de la salud de los grupos étnicos presentes en la Localidad de Chapinero.","Inversión","Un nuevo contrato social y ambiental para la Bogotá del Siglo XXI",6,{"$f":"IF(ISERROR(VLOOKUP(K306,[2]Proposito_programa!$C$2:$E$59,2,FALSE)),\" \",VLOOKUP(K306,[2]Proposito_programa!$C$2:$E$59,2,FALSE))","v":"Sistema Distrital de Cuidado"},{"$f":"IF(ISERROR(VLOOKUP(K306,[2]Proposito_programa!$C$2:$E$59,3,FALSE)),\" \",VLOOKUP(K306,[2]Proposito_programa!$C$2:$E$59,3,FALSE))","v":"Propósito 1: Hacer un nuevo contrato social para incrementar la inclusión social, productiva y política"},2024,null,1026260280,"ANGELA JULYET JUAGIBIOY JUAJIBIOY","Persona Natural",null,null,null,null,3600000,0,null,null,3600000,0,"2022-11-26","2022-12-02","2023-03-04",60,null,null,null,null,null,null,"En ejecución",0.75]
[302,2022,"FDLCH-CPS-302-2022","https://community.secop.gov.co/Public/Tendering/OpportunityDetail/Index?noticeUID=CO1.NTC.3575624&isFromPublicArea=True&isModal=true&asPopupView=true","Contratos de prestación de servicios profesionales y de apoyo a la gestión","Contratación directa","Prestación de servicios profesionales y de apoyo a la gestión, o para la ejecución de trabajos artísticos que sólo puedan encomendarse a determinadas personas naturales","Prestar los servicios como  \"SABEDORES(AS) ANCESTRALES\" para desarrollar acciones que permitan identificar, visibilizar y reconocer los saberes ancestrales para el cuidado de la salud de los grupos étnicos presentes en la Localidad de Chapinero.","Inversión","Un nuevo contrato social y ambiental para la Bogotá del Siglo XXI",6,{"$f":"IF(ISERROR(VLOOKUP(K307,[2]Proposito_programa!$C$2:$E$59,2,FALSE)),\" \",VLOOKUP(K307,[2]Proposito_programa!$C$2:$E$59,2,FALSE))","v":"Sistema Distrital de Cuidado"},{"$f":"IF(ISERROR(VLOOKUP(K307,[2]Proposito_programa!$C$2:$E$59,3,FALSE)),\" \",VLOOKUP(K307,[2]Proposito_programa!$C$2:$E$59,3,FALSE))","v":"Propósito 1: Hacer un nuevo contrato social para incrementar la inclusión social, productiva y política"},2024,null,1061224654,"IRMA LICENIA MANQUILLO CHANTRE","Persona Natural",null,null,null,null,3600000,0,null,null,3600000,0,"2022-11-25","2022-12-02","2023-03-04",60,null,null,null,null,null,null,"En ejecución",0.75]
[303,2022,"FDLCH-CPS-303-2022","https://community.secop.gov.co/Public/Tendering/OpportunityDetail/Index?noticeUID=CO1.NTC.3575185&isFromPublicArea=True&isModal=true&asPopupView=true","Contratos de prestación de servicios profesionales y de apoyo a la gestión","Contratación directa","Prestación de servicios profesionales y de apoyo a la gestión, o para la ejecución de trabajos artísticos que sólo puedan encomendarse a determinadas personas naturales","Prestar los servicios como  \"SABEDORES(AS) ANCESTRALES\" para desarrollar acciones que permitan identificar, visibilizar y reconocer los saberes ancestrales para el cuidado de la salud de los grupos étnicos presentes en la Localidad de Chapinero.","Inversión","Un nuevo contrato social y ambiental para la Bogotá del Siglo XXI",6,{"$f":"IF(ISERROR(VLOOKUP(K308,[2]Proposito_programa!$C$2:$E$59,2,FALSE)),\" \",VLOOKUP(K308,[2]Proposito_programa!$C$2:$E$59,2,FALSE))","v":"Sistema Distrital de Cuidado"},{"$f":"IF(ISERROR(VLOOKUP(K308,[2]Proposito_programa!$C$2:$E$59,3,FALSE)),\" \",VLOOKUP(K308,[2]Proposito_programa!$C$2:$E$59,3,FALSE))","v":"Propósito 1: Hacer un nuevo contrato social para incrementar la inclusión social, productiva y política"},2024,null,53103781,"DIANA MIREYA QUIÑONES ESTUPIÑAN","Persona Natural",null,null,null,null,3600000,0,null,null,3600000,0,"2022-11-25","2022-12-02","2023-03-04",60,null,null,null,null,null,null,"En ejecución",0.75]
[304,2022,"FDLCH-CPS-304-2022","https://community.secop.gov.co/Public/Tendering/OpportunityDetail/Index?noticeUID=CO1.NTC.3575190&isFromPublicArea=True&isModal=true&asPopupView=true","Contratos de prestación de servicios profesionales y de apoyo a la gestión","Contratación directa","Prestación de servicios profesionales y de apoyo a la gestión, o para la ejecución de trabajos artísticos que sólo puedan encomendarse a determinadas personas naturales","Prestar los servicios como  \"SABEDORES(AS) ANCESTRALES\" para desarrollar acciones que permitan identificar, visibilizar y reconocer los saberes ancestrales para el cuidado de la salud de los grupos étnicos presentes en la Localidad de Chapinero.","Inversión","Un nuevo contrato social y ambiental para la Bogotá del Siglo XXI",6,{"$f":"IF(ISERROR(VLOOKUP(K309,[2]Proposito_programa!$C$2:$E$59,2,FALSE)),\" \",VLOOKUP(K309,[2]Proposito_programa!$C$2:$E$59,2,FALSE))","v":"Sistema Distrital de Cuidado"},{"$f":"IF(ISERROR(VLOOKUP(K309,[2]Proposito_programa!$C$2:$E$59,3,FALSE)),\" \",VLOOKUP(K309,[2]Proposito_programa!$C$2:$E$59,3,FALSE))","v":"Propósito 1: Hacer un nuevo contrato social para incrementar la inclusión social, productiva y política"},2024,null,1061223282,"MARIA CICELA HIO ECUE","Persona Natural",null,null,null,null,3600000,0,null,null,3600000,0,"2022-11-25","2022-12-01","2023-03-04",60,null,null,null,null,null,null,"En ejecución",0.75]
[305,2022,"FDLCH-CPS-305-2022","https://community.secop.gov.co/Public/Tendering/OpportunityDetail/Index?noticeUID=CO1.NTC.3575556&isFromPublicArea=True&isModal=true&asPopupView=true","Contratos de prestación de servicios profesionales y de apoyo a la gestión","Contratación directa","Prestación de servicios profesionales y de apoyo a la gestión, o para la ejecución de trabajos artísticos que sólo puedan encomendarse a determinadas personas naturales","Prestar los servicios como  \"SABEDORES(AS) ANCESTRALES\" para desarrollar acciones que permitan identificar, visibilizar y reconocer los saberes ancestrales para el cuidado de la salud de los grupos étnicos presentes en la Localidad de Chapinero.","Inversión","Un nuevo contrato social y ambiental para la Bogotá del Siglo XXI",6,{"$f":"IF(ISERROR(VLOOKUP(K310,[2]Proposito_programa!$C$2:$E$59,2,FALSE)),\" \",VLOOKUP(K310,[2]Proposito_programa!$C$2:$E$59,2,FALSE))","v":"Sistema Distrital de Cuidado"},{"$f":"IF(ISERROR(VLOOKUP(K310,[2]Proposito_programa!$C$2:$E$59,3,FALSE)),\" \",VLOOKUP(K310,[2]Proposito_programa!$C$2:$E$59,3,FALSE))","v":"Propósito 1: Hacer un nuevo contrato social para incrementar la inclusión social, productiva y política"},2024,null,52902744,"LAURA PATRICIA SUAREZ HERNANDEZ","Persona Natural",null,null,null,null,3600000,0,null,null,3600000,0,"2022-11-25","2022-12-02","2023-03-04",60,null,null,null,null,null,null,"En ejecución",0.75]
[306,2022,"FDLCH-CPS-306-2022","https://community.secop.gov.co/Public/Tendering/OpportunityDetail/Index?noticeUID=CO1.NTC.3575562&isFromPublicArea=True&isModal=true&asPopupView=true","Contratos de prestación de servicios profesionales y de apoyo a la gestión","Contratación directa","Contratos para el desarrollo de actividades científicas y tecnológicas","Prestar los servicios como  \"SABEDORES(AS) ANCESTRALES\" para desarrollar acciones que permitan identificar, visibilizar y reconocer los saberes ancestrales para el cuidado de la salud de los grupos étnicos presentes en la Localidad de Chapinero.","Inversión","Un nuevo contrato social y ambiental para la Bogotá del Siglo XXI",6,{"$f":"IF(ISERROR(VLOOKUP(K311,[2]Proposito_programa!$C$2:$E$59,2,FALSE)),\" \",VLOOKUP(K311,[2]Proposito_programa!$C$2:$E$59,2,FALSE))","v":"Sistema Distrital de Cuidado"},{"$f":"IF(ISERROR(VLOOKUP(K311,[2]Proposito_programa!$C$2:$E$59,3,FALSE)),\" \",VLOOKUP(K311,[2]Proposito_programa!$C$2:$E$59,3,FALSE))","v":"Propósito 1: Hacer un nuevo contrato social para incrementar la inclusión social, productiva y política"},2024,null,41182920,"ROSA DEL PILAR JARAMILLO CHICUNQUE","Persona Natural",null,null,null,null,3600000,0,null,null,3600000,0,"2022-11-25","2022-12-02","2023-03-04",60,null,null,null,null,null,null,"En ejecución",0.75]
[307,2022,"FDLCH-CPS-307-2022","https://community.secop.gov.co/Public/Tendering/OpportunityDetail/Index?noticeUID=CO1.NTC.3575460&isFromPublicArea=True&isModal=true&asPopupView=true","Contratos de prestación de servicios profesionales y de apoyo a la gestión","Contratación directa","Prestación de servicios profesionales y de apoyo a la gestión, o para la ejecución de trabajos artísticos que sólo puedan encomendarse a determinadas personas naturales","Prestar los servicios como  \"SABEDORES(AS) ANCESTRALES\" para desarrollar acciones que permitan identificar, visibilizar y reconocer los saberes ancestrales para el cuidado de la salud de los grupos étnicos presentes en la Localidad de Chapinero.","Inversión","Un nuevo contrato social y ambiental para la Bogotá del Siglo XXI",6,{"$f":"IF(ISERROR(VLOOKUP(K312,[2]Proposito_programa!$C$2:$E$59,2,FALSE)),\" \",VLOOKUP(K312,[2]Proposito_programa!$C$2:$E$59,2,FALSE))","v":"Sistema Distrital de Cuidado"},{"$f":"IF(ISERROR(VLOOKUP(K312,[2]Proposito_programa!$C$2:$E$59,3,FALSE)),\" \",VLOOKUP(K312,[2]Proposito_programa!$C$2:$E$59,3,FALSE))","v":"Propósito 1: Hacer un nuevo contrato social para incrementar la inclusión social, productiva y política"},2024,null,10300556,"HEIDER ALBERTO LACERA OROZCO","Persona Natural",null,null,null,null,3600000,0,null,null,3600000,0,"2022-11-25","2022-12-01","2023-03-04",60,null,null,null,null,null,null,"En ejecución",0.75]
[308,2022,"FDLCH-CPS-308-2022","https://community.secop.gov.co/Public/Tendering/OpportunityDetail/Index?noticeUID=CO1.NTC.3606115&isFromPublicArea=True&isModal=true&asPopupView=true","Contratos de prestación de servicios profesionales y de apoyo a la gestión","Contratación directa","Prestación de servicios profesionales y de apoyo a la gestión, o para la ejecución de trabajos artísticos que sólo puedan encomendarse a determinadas personas naturales","Prestar los servicios de apoyo a la gestiòn para la orientaciòn de seiones de actividad fìsica y recreaciòn en la localidad, como del acompañamiento,atenciòn y de ejecuciòn de actividades recreo deportivas derivadas del proyecto de inversiòn \"CHAPINERO EPICENTRO DEL DEPORTE Y LA RECREACIÓN\".","Inversión","Un nuevo contrato social y ambiental para la Bogotá del Siglo XXI",20,{"$f":"IF(ISERROR(VLOOKUP(K313,[2]Proposito_programa!$C$2:$E$59,2,FALSE)),\" \",VLOOKUP(K313,[2]Proposito_programa!$C$2:$E$59,2,FALSE))","v":"Bogotá, referente en cultura, deporte, recreación y actividad física, con parques para el desarrollo y la salud"},{"$f":"IF(ISERROR(VLOOKUP(K313,[2]Proposito_programa!$C$2:$E$59,3,FALSE)),\" \",VLOOKUP(K313,[2]Proposito_programa!$C$2:$E$59,3,FALSE))","v":"Propósito 1: Hacer un nuevo contrato social para incrementar la inclusión social, productiva y política"},1845,null,1006323299,"ROBERTO JULIO GRAJALES AGUDELO","Persona Natural",null,null,null,null,2821500,0,null,null,2821500,0,"2022-12-03","2022-12-06","2023-01-20",30,null,null,null,null,null,null,"En ejecución",0.9]
[309,2022,"FDLCH-CPS-309-2022","https://community.secop.gov.co/Public/Tendering/OpportunityDetail/Index?noticeUID=CO1.NTC.3589124&isFromPublicArea=True&isModal=true&asPopupView=true","Contratos de prestación de servicios profesionales y de apoyo a la gestión","Contratación directa","Prestación de servicios profesionales y de apoyo a la gestión, o para la ejecución de trabajos artísticos que sólo puedan encomendarse a determinadas personas naturales","Prestar servicios de apoyo asistencial al proyecto \"1855 CHAPINERO TE CUIDA para la implementación de la estrategia de la tropa de cuidado local en la localidad de Chapinero, desarrollando actividades de cuidado indirecto dirigido a las mujeres cuidadoras con el propósito de aliviar la carga de cuidado y facilitar prácticas de autocuidado.","Inversión","Un nuevo contrato social y ambiental para la Bogotá del Siglo XXI",6,{"$f":"IF(ISERROR(VLOOKUP(K314,Proposito_programa!$C$2:$E$59,2,FALSE)),\" \",VLOOKUP(K314,Proposito_programa!$C$2:$E$59,2,FALSE))","v":"Sistema Distrital de Cuidado"},{"$f":"IF(ISERROR(VLOOKUP(K314,Proposito_programa!$C$2:$E$59,3,FALSE)),\" \",VLOOKUP(K314,Proposito_programa!$C$2:$E$59,3,FALSE))","v":"Propósito 1: Hacer un nuevo contrato social para incrementar la inclusión social, productiva y política"},1855,null,51837683,"ANA MARGARITA RODRIGUEZ GOMEZ","Persona Natural",null,null,null,null,3760000,0,null,null,3760000,0,"2022-12-02","2022-12-02","2023-02-01",60,null,null,null,null,null,null,"En ejecución",0.85]
[310,2022,"FDLCH-CPS-310-2022","https://community.secop.gov.co/Public/Tendering/OpportunityDetail/Index?noticeUID=CO1.NTC.3589161&isFromPublicArea=True&isModal=true&asPopupView=true","Contratos de prestación de servicios profesionales y de apoyo a la gestión","Contratación directa","Prestación de servicios profesionales y de apoyo a la gestión, o para la ejecución de trabajos artísticos que sólo puedan encomendarse a determinadas personas naturales","Prestar servicios de apoyo asistencial proyecto 1855 CHAPINERO TE CUIDA para la implementación de la estrategia de la tropa de cuidado local en la localidad de Chapinero, desarrollando actividades de cuidado indirecto dirigido a las mujeres cuidadoras con el propósito de aliviar la carga de cuidado y facilitar prácticas de autocuidado.","Inversión","Un nuevo contrato social y ambiental para la Bogotá del Siglo XXI",6,{"$f":"IF(ISERROR(VLOOKUP(K315,Proposito_programa!$C$2:$E$59,2,FALSE)),\" \",VLOOKUP(K315,Proposito_programa!$C$2:$E$59,2,FALSE))","v":"Sistema Distrital de Cuidado"},{"$f":"IF(ISERROR(VLOOKUP(K315,Proposito_programa!$C$2:$E$59,3,FALSE)),\" \",VLOOKUP(K315,Proposito_programa!$C$2:$E$59,3,FALSE))","v":"Propósito 1: Hacer un nuevo contrato social para incrementar la inclusión social, productiva y política"},1855,null,52100842,"BETTY JANETH VARGAS BARRETO","Persona Natural",null,null,null,null,3760000,0,null,null,3760000,0,"2022-11-30","2022-12-01","2023-01-31",60,null,null,null,null,null,null,"En ejecución",0.9]
[196,2022,"FDLCH-CCV-196-2022","https://colombiacompra.gov.co/tienda-virtual-del-estado-colombiano/ordenes-compra/95666","Suministro","Contratación mínima cuantia","No aplica","Adquirir todos los insumos de papelería, papelería y elementos de oficina, necesarios para suplir las necesidades del Fondo de Desarrollo Local de Chapinero, Junta Administradora Local e Inspecciones de Policía","Funcionamiento","Un nuevo contrato social y ambiental para la Bogotá del Siglo XXI","No aplica",{"$f":"IF(ISERROR(VLOOKUP(K316,[2]Proposito_programa!$C$2:$E$59,2,FALSE)),\" \",VLOOKUP(K316,[2]Proposito_programa!$C$2:$E$59,2,FALSE))","v":" "},{"$f":"IF(ISERROR(VLOOKUP(K316,[2]Proposito_programa!$C$2:$E$59,3,FALSE)),\" \",VLOOKUP(K316,[2]Proposito_programa!$C$2:$E$59,3,FALSE))","v":" "},null,null,830037946,"PANAMERICANA LIBRERIA Y PAPELERIA SA","Persona Jurídica",null,null,null,null,10541044,0,null,null,10541044,10541044,"2022-09-07","2022-09-12","2022-10-11",30,null,null,null,null,null,null,"Terminado",1]
[312,2022,"FDLCH-CPS-312-2022","https://community.secop.gov.co/Public/Tendering/OpportunityDetail/Index?noticeUID=CO1.NTC.3592621&isFromPublicArea=True&isModal=true&asPopupView=true","Contratos de prestación de servicios profesionales y de apoyo a la gestión","Contratación directa","Prestación de servicios profesionales y de apoyo a la gestión, o para la ejecución de trabajos artísticos que sólo puedan encomendarse a determinadas personas naturales","Prestar servicios de apoyo asistencial proyecto 1855 CHAPINERO TE CUIDA para la implementación de la estrategia de la tropa de cuidado local en la localidad de Chapinero, desarrollando actividades de cuidado indirecto dirigido a las mujeres cuidadoras con el propósito de aliviar la carga de cuidado y facilitar prácticas de autocuidado.","Inversión","Un nuevo contrato social y ambiental para la Bogotá del Siglo XXI",6,{"$f":"IF(ISERROR(VLOOKUP(K317,Proposito_programa!$C$2:$E$59,2,FALSE)),\" \",VLOOKUP(K317,Proposito_programa!$C$2:$E$59,2,FALSE))","v":"Sistema Distrital de Cuidado"},{"$f":"IF(ISERROR(VLOOKUP(K317,Proposito_programa!$C$2:$E$59,3,FALSE)),\" \",VLOOKUP(K317,Proposito_programa!$C$2:$E$59,3,FALSE))","v":"Propósito 1: Hacer un nuevo contrato social para incrementar la inclusión social, productiva y política"},1855,null,1018464260,"ERIKA KATHERINNE LOPEZ MILAN","Persona Natural",null,null,null,null,3760000,0,null,null,3760000,0,"2022-12-01","2022-12-02","2023-02-01",60,null,null,null,null,null,null,"En ejecución",0.85]
[313,2022,"FDLCH-CPS-313-2022","https://community.secop.gov.co/Public/Tendering/OpportunityDetail/Index?noticeUID=CO1.NTC.3602798&isFromPublicArea=True&isModal=true&asPopupView=true","Contratos de prestación de servicios profesionales y de apoyo a la gestión","Contratación directa","Prestación de servicios profesionales y de apoyo a la gestión, o para la ejecución de trabajos artísticos que sólo puedan encomendarse a determinadas personas naturales","Prestar servicios de apoyo asistencias al proyecto 1855 \"CHAPINERO TE CUIDA PARA LA IMPLEMENTACIÓN DE LA ESTRATEGIA DE LA TROPA DE CUIDADO LOCAL EN LA LOCALIDAD DE CHAPINERO, desarrollando actividades de cuidado indirecto dirigido a las mujeres cuidadoras con el pròposito de aliviar la carga de cuidado y facilitar pràcticas de autocuidado.","Inversión","Un nuevo contrato social y ambiental para la Bogotá del Siglo XXI",6,{"$f":"IF(ISERROR(VLOOKUP(K318,Proposito_programa!$C$2:$E$59,2,FALSE)),\" \",VLOOKUP(K318,Proposito_programa!$C$2:$E$59,2,FALSE))","v":"Sistema Distrital de Cuidado"},{"$f":"IF(ISERROR(VLOOKUP(K318,Proposito_programa!$C$2:$E$59,3,FALSE)),\" \",VLOOKUP(K318,Proposito_programa!$C$2:$E$59,3,FALSE))","v":"Propósito 1: Hacer un nuevo contrato social para incrementar la inclusión social, productiva y política"},1855,null,1018471726,"LUZ KATHERINE MILA GRANDE","Persona Natural",null,null,null,null,3760000,0,null,null,3760000,0,"2022-12-02","2022-12-06","2023-02-05",60,null,null,null,null,null,null,"En ejecución",0.85]
[314,2022,"FDLCH-CPS-314-2022","https://community.secop.gov.co/Public/Tendering/OpportunityDetail/Index?noticeUID=CO1.NTC.3604810&isFromPublicArea=True&isModal=true&asPopupView=true","Contratos de prestación de servicios profesionales y de apoyo a la gestión","Contratación directa","Prestación de servicios profesionales y de apoyo a la gestión, o para la ejecución de trabajos artísticos que sólo puedan encomendarse a determinadas personas naturales","Prestar servicios de apoyo asistencial al proyecto 1855 \"CHAPINERO TE CUIDA PARA LA IMPLEMENTACIÓN DE LA ESTRATEGIA DE LA TROPA DE CUIDADO LOCAL EN LA LOCALIDAD DE CHAPINERO”, desarrollando actividades de cuidado indirecto dirigido a las mujeres cuidadoras con el propósito de aliviar la carga de cuidado y facilitar prácticas de autocuidado.","Inversión","Un nuevo contrato social y ambiental para la Bogotá del Siglo XXI",6,{"$f":"IF(ISERROR(VLOOKUP(K319,Proposito_programa!$C$2:$E$59,2,FALSE)),\" \",VLOOKUP(K319,Proposito_programa!$C$2:$E$59,2,FALSE))","v":"Sistema Distrital de Cuidado"},{"$f":"IF(ISERROR(VLOOKUP(K319,Proposito_programa!$C$2:$E$59,3,FALSE)),\" \",VLOOKUP(K319,Proposito_programa!$C$2:$E$59,3,FALSE))","v":"Propósito 1: Hacer un nuevo contrato social para incrementar la inclusión social, productiva y política"},1855,null,1023870928,"NAZLY MAYERLY PUENTES MEDINA","Persona Natural",null,null,null,null,3760000,0,null,null,3760000,0,"2022-12-02","2022-12-07","2023-02-06",60,null,null,null,null,null,null,"En ejecución",0.85]
[315,2022,"FDLCH-CPS-315-2022","https://community.secop.gov.co/Public/Tendering/OpportunityDetail/Index?noticeUID=CO1.NTC.3604176&isFromPublicArea=True&isModal=true&asPopupView=true","Contratos de prestación de servicios profesionales y de apoyo a la gestión","Contratación directa","Prestación de servicios profesionales y de apoyo a la gestión, o para la ejecución de trabajos artísticos que sólo puedan encomendarse a determinadas personas naturales","Prestar servicios de apoyo asistencial al proyecto 1855 \"CHAPINERO TE CUIDA PARA LA IMPLEMENTACIÓN DE LA ESTRATEGIA DE LA TROPA DE CUIDADO LOCAL EN LA LOCALIDAD DE CHAPINERO”, desarrollando actividades de cuidado indirecto dirigido a las mujeres cuidadoras con el propósito de aliviar la carga de cuidado y facilitar prácticas de autocuidado.","Inversión","Un nuevo contrato social y ambiental para la Bogotá del Siglo XXI",6,{"$f":"IF(ISERROR(VLOOKUP(K320,Proposito_programa!$C$2:$E$59,2,FALSE)),\" \",VLOOKUP(K320,Proposito_programa!$C$2:$E$59,2,FALSE))","v":"Sistema Distrital de Cuidado"},{"$f":"IF(ISERROR(VLOOKUP(K320,Proposito_programa!$C$2:$E$59,3,FALSE)),\" \",VLOOKUP(K320,Proposito_programa!$C$2:$E$59,3,FALSE))","v":"Propósito 1: Hacer un nuevo contrato social para incrementar la inclusión social, productiva y política"},1855,null,1001062118,"LUISA FERNANDA RINCON GARCIA","Persona Natural",null,null,null,null,3760000,0,null,null,3760000,0,"2022-12-02","2022-12-06","2023-02-05",60,null,null,null,null,null,null,"En ejecución",0.85]
[317,2022,"FDLCH-CPS-317-2022","https://community.secop.gov.co/Public/Tendering/OpportunityDetail/Index?noticeUID=CO1.NTC.3438598&isFromPublicArea=True&isModal=true&asPopupView=true","Otros","Licitación pública","No aplica","Prestar servicios para desarrollar unidades productivas  del sector rural, urbano y periurbano a travès de la impelementaciòn de acciones de fomento en agricultura urbana y periurbana, asistencia tènica, agropecuaria y/o ambiental en el marco de la extendiòn rural y la agroecologìa.","Inversión","Un nuevo contrato social y ambiental para la Bogotá del Siglo XXI",23,{"$f":"IF(ISERROR(VLOOKUP(K321,Proposito_programa!$C$2:$E$59,2,FALSE)),\" \",VLOOKUP(K321,Proposito_programa!$C$2:$E$59,2,FALSE))","v":"Bogotá rural"},{"$f":"IF(ISERROR(VLOOKUP(K321,Proposito_programa!$C$2:$E$59,3,FALSE)),\" \",VLOOKUP(K321,Proposito_programa!$C$2:$E$59,3,FALSE))","v":"Propósito 1: Hacer un nuevo contrato social para incrementar la inclusión social, productiva y política"},1827,8,901391468,"CORPORACION GRUPO LUNA","Persona Jurídica",null,null,null,null,216137912,0,null,null,216137912,0,"2022-12-09","2022-12-16","2023-09-15",270,null,null,null,null,null,null,"En ejecución",0.4]
[317,2022,"FDLCH-CPS-317-2022","https://community.secop.gov.co/Public/Tendering/OpportunityDetail/Index?noticeUID=CO1.NTC.3438598&isFromPublicArea=True&isModal=true&asPopupView=true","Otros","Licitación pública","No aplica","Prestar servicios para desarrollar unidades productivas  del sector rural, urbano y periurbano a travès de la impelementaciòn de acciones de fomento en agricultura urbana y periurbana, asistencia tènica, agropecuaria y/o ambiental en el marco de la extendiòn rural y la agroecologìa.","Inversión","Un nuevo contrato social y ambiental para la Bogotá del Siglo XXI",24,{"$f":"IF(ISERROR(VLOOKUP(K322,Proposito_programa!$C$2:$E$59,2,FALSE)),\" \",VLOOKUP(K322,Proposito_programa!$C$2:$E$59,2,FALSE))","v":"Bogotá región emprendedora e innovadora"},{"$f":"IF(ISERROR(VLOOKUP(K322,Proposito_programa!$C$2:$E$59,3,FALSE)),\" \",VLOOKUP(K322,Proposito_programa!$C$2:$E$59,3,FALSE))","v":"Propósito 1: Hacer un nuevo contrato social para incrementar la inclusión social, productiva y política"},1631,null,901391468,"CORPORACION GRUPO LUNA","Persona Jurídica",null,null,null,null,181100000,0,null,null,181100000,0,"2022-12-09","2022-12-16","2023-09-15",null,null,null,null,null,null,null,"En ejecución",0.4]
[318,2022,"FDLCH-CPS-318-2022","https://community.secop.gov.co/Public/Tendering/OpportunityDetail/Index?noticeUID=CO1.NTC.3629253&isFromPublicArea=True&isModal=true&asPopupView=true","Contratos de prestación de servicios profesionales y de apoyo a la gestión","Contratación directa","Prestación de servicios profesionales y de apoyo a la gestión, o para la ejecución de trabajos artísticos que sólo puedan encomendarse a determinadas personas naturales","Prestar los servicios de apoyo a la gestiòn para la orientaciòn de sesiones de actividad fìsica musicalizada y no musicalizada en la Localidad como del acompañamiento, atenciòn y de ejecuciòn de actividades recreo deportivas y recreaciòn derevids del  proyecto de inversiòn \"CHAPINERO EPICENTRO DEL DEPORTE\"","Inversión","Un nuevo contrato social y ambiental para la Bogotá del Siglo XXI",20,{"$f":"IF(ISERROR(VLOOKUP(K323,[2]Proposito_programa!$C$2:$E$59,2,FALSE)),\" \",VLOOKUP(K323,[2]Proposito_programa!$C$2:$E$59,2,FALSE))","v":"Bogotá, referente en cultura, deporte, recreación y actividad física, con parques para el desarrollo y la salud"},{"$f":"IF(ISERROR(VLOOKUP(K323,[2]Proposito_programa!$C$2:$E$59,3,FALSE)),\" \",VLOOKUP(K323,[2]Proposito_programa!$C$2:$E$59,3,FALSE))","v":"Propósito 1: Hacer un nuevo contrato social para incrementar la inclusión social, productiva y política"},1845,null,1032485087,"JUAN PABLO ROA CUERVO","Persona Natural",null,null,null,null,4090500,null,null,null,4090500,null,"2022-12-09","2022-12-12","2023-01-26",30,null,null,null,null,null,null,"En ejecución",0.9]
[319,2022,"FDLCH-CPS-319-2022","https://community.secop.gov.co/Public/Tendering/OpportunityDetail/Index?noticeUID=CO1.NTC.3642119&isFromPublicArea=True&isModal=true&asPopupView=true","Contratos de prestación de servicios profesionales y de apoyo a la gestión","Contratación directa","Prestación de servicios profesionales y de apoyo a la gestión, o para la ejecución de trabajos artísticos que sólo puedan encomendarse a determinadas personas naturales","Brindar apoyo en la implementación de acciones del plan local de convivencia seguridad y justicia y el desarrollo de estrategias de dialogo mediación convivencia y prevención de conflictividades violencias y delitos en la localidad de chapinero para mejorar la seguridad y convivencia","Inversión","Un nuevo contrato social y ambiental para la Bogotá del Siglo XXI",45,{"$f":"IF(ISERROR(VLOOKUP(K324,Proposito_programa!$C$2:$E$59,2,FALSE)),\" \",VLOOKUP(K324,Proposito_programa!$C$2:$E$59,2,FALSE))","v":"Espacio público más seguro y construido colectivamente"},{"$f":"IF(ISERROR(VLOOKUP(K324,Proposito_programa!$C$2:$E$59,3,FALSE)),\" \",VLOOKUP(K324,Proposito_programa!$C$2:$E$59,3,FALSE))","v":"Propósito 3: Inspirar confianza y legitimidad para vivir sin miedo y ser epicentro de cultura ciudadana, paz y reconciliación"},1736,null,1024535007,"JOAQUIN ANDRES MURILLO RAMIREZ","Persona Natural",null,null,null,null,2500000,0,null,null,2500000,0,"2022-12-14","2022-12-15","2023-01-14",30,null,null,null,null,null,null,"En ejecución",0.9]
[320,2022,"FDLCH-CPS-320-2022","https://community.secop.gov.co/Public/Tendering/OpportunityDetail/Index?noticeUID=CO1.NTC.3511009&isFromPublicArea=True&isModal=true&asPopupView=true","Contratos de prestación de servicios",null,"No aplica","Prestar servicios para el desarrollo de acciones, actividades y eventos que contribuyan al fotalecimiento y revitalización de mipymes y/o emprendimeintos de la Localidad de Chapinero.","Inversión","Un nuevo contrato social y ambiental para la Bogotá del Siglo XXI",6,{"$f":"IF(ISERROR(VLOOKUP(K325,Proposito_programa!$C$2:$E$59,2,FALSE)),\" \",VLOOKUP(K325,Proposito_programa!$C$2:$E$59,2,FALSE))","v":"Sistema Distrital de Cuidado"},{"$f":"IF(ISERROR(VLOOKUP(K325,Proposito_programa!$C$2:$E$59,3,FALSE)),\" \",VLOOKUP(K325,Proposito_programa!$C$2:$E$59,3,FALSE))","v":"Propósito 1: Hacer un nuevo contrato social para incrementar la inclusión social, productiva y política"},1671,20,900251399,"FUNDACION AYS OF HOPE","Persona Jurídica",null,null,null,null,515087457,0,null,null,515087457,null,"2022-12-20","28/12/2022","27/08/2023",240,null,null,null,null,null,null,"En ejecución",0.2]
[197,2022,"FDLCH-CCV-197-2022","https://colombiacompra.gov.co/tienda-virtual-del-estado-colombiano/ordenes-compra/95667","Suministro","Contratación mínima cuantia","No aplica","Adquirir todos los insumos de papelería, papelería y elementos de oficina, necesarios para suplir las necesidades del Fondo de Desarrollo Local de Chapinero, Junta Administradora Local e Inspecciones de Policía","Funcionamiento","Un nuevo contrato social y ambiental para la Bogotá del Siglo XXI","No aplica",{"$f":"IF(ISERROR(VLOOKUP(K326,[2]Proposito_programa!$C$2:$E$59,2,FALSE)),\" \",VLOOKUP(K326,[2]Proposito_programa!$C$2:$E$59,2,FALSE))","v":" "},{"$f":"IF(ISERROR(VLOOKUP(K326,[2]Proposito_programa!$C$2:$E$59,3,FALSE)),\" \",VLOOKUP(K326,[2]Proposito_programa!$C$2:$E$59,3,FALSE))","v":" "},null,null,860007336,"CAJA COLOMBIANA DE SUBSIDIO FAMILIAR COLSUBSIDIO","Persona Jurídica",null,null,null,null,7490370,0,null,null,7490370,7490370,"2022-09-07","2022-09-12","2022-10-11",null,null,null,null,null,null,null,"Terminado",1]
[200,2022,"FDLCH-COP-200-2022","https://community.secop.gov.co/Public/Tendering/OpportunityDetail/Index?noticeUID=CO1.NTC.3192830&isFromPublicArea=True&isModal=true&asPopupView=true","Otros","Selección abreviada","Selección abreviada por menor cuantía ","Realizar el mantenimiento preventivo y correctivo, así como las reparaciones locativas y actividades emergentes, a las instalaciones a cargo de la Alcaldía Local de Chapinero.","Funcionamiento","Un nuevo contrato social y ambiental para la Bogotá del Siglo XXI","No aplica",{"$f":"IF(ISERROR(VLOOKUP(K327,[2]Proposito_programa!$C$2:$E$59,2,FALSE)),\" \",VLOOKUP(K327,[2]Proposito_programa!$C$2:$E$59,2,FALSE))","v":" "},{"$f":"IF(ISERROR(VLOOKUP(K327,[2]Proposito_programa!$C$2:$E$59,3,FALSE)),\" \",VLOOKUP(K327,[2]Proposito_programa!$C$2:$E$59,3,FALSE))","v":" "},null,16,12370591,"FRANCISCO JAVIER VILLANUEVA TOVAR","Persona Natural",null,null,null,null,130000000,0,1,63999990,193999990,39998712,"2022-09-27","2022-10-03","2023-08-04",300,null,null,null,null,null,null,"En ejecución",0.5]
[210,2020,"CS-210-2020","https://community.secop.gov.co/Public/Tendering/OpportunityDetail/Index?noticeUID=CO1.NTC.1475553&isFromPublicArea=True&isModal=False","Seguros","Selección abreviada","Selección abreviada por menor cuantía ","CONTRATAR EL SEGURO DE VIDA GRUPO QUE AMPARE LOS EDILES DEL FONDO DE DESARROLLO LOCAL DE CHAPINERO","Funcionamiento","Un nuevo contrato social y ambiental para la Bogotá del Siglo XXI","No aplica",{"$f":"IF(ISERROR(VLOOKUP(K328,Proposito_programa!$C$2:$E$59,2,FALSE)),\" \",VLOOKUP(K328,Proposito_programa!$C$2:$E$59,2,FALSE))","v":" "},{"$f":"IF(ISERROR(VLOOKUP(K328,Proposito_programa!$C$2:$E$59,3,FALSE)),\" \",VLOOKUP(K328,Proposito_programa!$C$2:$E$59,3,FALSE))","v":" "},null,4,860067013,"COMPAÑIA MUNDIAL DE SEGUROS SA","Persona Jurídica",null,null,null,null,null,null,null,255279,255279,255279,"2022-04-07","2020-10-19",null,null,null,null,null,null,null,null,"Terminado",1]
[210,2022,"CI-210-2022","https://community.secop.gov.co/Public/Tendering/OpportunityDetail/Index?noticeUID=CO1.NTC.3398810&isFromPublicArea=True&isModal=true&asPopupView=true","Convenios/Contratos interadministrativos","Contratación directa","Contratos interadministrativos","Prestar el servicio de mansajería y correo certificado para la Alcaldía Local de Chapinero.","Funcionamiento","Un nuevo contrato social y ambiental para la Bogotá del Siglo XXI","No aplica",null,null,null,null,900062917,"SERVICIOS POSTALES NACIONALES SAS",null,null,null,null,null,22063000,null,null,null,22063000,5024176]
[306,2021,"FDLCH-CPS-306-2021","https://community.secop.gov.co/Public/Tendering/OpportunityDetail/Index?noticeUID=CO1.NTC.2468952&isFromPublicArea=True&isModal=true&asPopupView=true","Contratos de prestación de servicios","Contratación mínima cuantia","No aplica","Realizar las reparaciones locativas y actividades emergentes necesarias, a las instalaciones de la Alcaldia Local de Chapinero a monto agotable.","Funcionamiento","Un nuevo contrato social y ambiental para la Bogotá del Siglo XXI","No aplica",{"$f":"IF(ISERROR(VLOOKUP(K330,Proposito_programa!$C$2:$E$59,2,FALSE)),\" \",VLOOKUP(K330,Proposito_programa!$C$2:$E$59,2,FALSE))","v":" "},{"$f":"IF(ISERROR(VLOOKUP(K330,Proposito_programa!$C$2:$E$59,3,FALSE)),\" \",VLOOKUP(K330,Proposito_programa!$C$2:$E$59,3,FALSE))","v":" "},null,null,901434039,"GRUPO CONSTRUCTORES INTELIGENTES SAS","Persona Jurídica",null,null,null,null,null,null,null,8480146,8480146,8480146,"2022-05-19","2022-02-22",null,null,null,null,null,null,null,null,"Terminado",1]
[311,2022,"FDLCH-CSE-311-2022","https://community.secop.gov.co/Public/Tendering/OpportunityDetail/Index?noticeUID=CO1.NTC.3509442&isFromPublicArea=True&isModal=true&asPopupView=true","Seguro","Selección abreviada","Selección abreviada por menor cuantía ","Contratar el seguro de responsabilidad civil para servidores publicos que ampare los intereses patrimoniales del Fondo de Desarrollo Local de Chapinero.","Funcionamiento","Un nuevo contrato social y ambiental para la Bogotá del Siglo XXI","No aplica",{"$f":"IF(ISERROR(VLOOKUP(K331,Proposito_programa!$C$2:$E$59,2,FALSE)),\" \",VLOOKUP(K331,Proposito_programa!$C$2:$E$59,2,FALSE))","v":" "},{"$f":"IF(ISERROR(VLOOKUP(K331,Proposito_programa!$C$2:$E$59,3,FALSE)),\" \",VLOOKUP(K331,Proposito_programa!$C$2:$E$59,3,FALSE))","v":" "},null,1,860524654,"ASEGURADORA SOLIDARIA DE COLOMBIA ENTIDAD COOPERATIVA","Persona Jurídica",null,null,null,null,51765000,0,null,null,51765000,0,"2022-12-01","2022-12-02","2023-12-02",360,null,null,null,null,null,null,"En ejecución",0.1]
[327,2022,"FDLCH-CCV-327-2022","https://colombiacompra.gov.co/tienda-virtual-del-estado-colombiano/ordenes-compra/103018","Suministro","Contratación mínima cuantia","No aplica","Adquirir los insumos de papelería y elementos de oficina","Funcionamiento","Un nuevo contrato social y ambiental para la Bogotá del Siglo XXI","No aplica",{"$f":"IF(ISERROR(VLOOKUP(K332,Proposito_programa!$C$2:$E$59,2,FALSE)),\" \",VLOOKUP(K332,Proposito_programa!$C$2:$E$59,2,FALSE))","v":" "},{"$f":"IF(ISERROR(VLOOKUP(K332,Proposito_programa!$C$2:$E$59,3,FALSE)),\" \",VLOOKUP(K332,Proposito_programa!$C$2:$E$59,3,FALSE))","v":" "},null,null,860007336,"CAJA COLOMBIANA DE SUBSIDIO FAMILIAR COLSUBSIDIO","Persona Jurídica",null,null,null,null,8006300,0,null,null,8006300,0,"2022-12-20","26/12/2022","25/02/2023",null,null,null,null,null,null,null,"En ejecución",0.2]
[null,2022,null,null,"Otros","Otros","No aplica","Transferencia","Inversión","Un nuevo contrato social y ambiental para la Bogotá del Siglo XXI",1,{"$f":"IF(ISERROR(VLOOKUP(K333,[2]Proposito_programa!$C$2:$E$59,2,FALSE)),\" \",VLOOKUP(K333,[2]Proposito_programa!$C$2:$E$59,2,FALSE))","v":"Subsidios y transferencias para la equidad"},{"$f":"IF(ISERROR(VLOOKUP(K333,[2]Proposito_programa!$C$2:$E$59,3,FALSE)),\" \",VLOOKUP(K333,[2]Proposito_programa!$C$2:$E$59,3,FALSE))","v":"Propósito 1: Hacer un nuevo contrato social para incrementar la inclusión social, productiva y política"},1815,null,899999061,"FONDO DESARROLLO LOCAL CHAPINERO","Persona Jurídica",null,null,null,null,1820795901,0,null,null,1820795901,1820795901,null,null,null,null,null,null,null,null,null,null,"En ejecución",1]
[null,2022,null,null,"Otros","Otros","No aplica","Resolución subsidio Tipo C","Inversión","Un nuevo contrato social y ambiental para la Bogotá del Siglo XXI",1,{"$f":"IF(ISERROR(VLOOKUP(K334,[2]Proposito_programa!$C$2:$E$59,2,FALSE)),\" \",VLOOKUP(K334,[2]Proposito_programa!$C$2:$E$59,2,FALSE))","v":"Subsidios y transferencias para la equidad"},{"$f":"IF(ISERROR(VLOOKUP(K334,[2]Proposito_programa!$C$2:$E$59,3,FALSE)),\" \",VLOOKUP(K334,[2]Proposito_programa!$C$2:$E$59,3,FALSE))","v":"Propósito 1: Hacer un nuevo contrato social para incrementar la inclusión social, productiva y política"},1815,null,860066942,"CAJA DE COMPENSACION FAMILIAR COMPENSAR","Persona Jurídica",null,null,null,null,280150000,-130000,null,null,280020000,280020000,null,null,null,null,null,null,null,null,null,null,"En ejecución",1]
[null,2022,null,null,"Otros","Otros","No aplica","Resolución subsidio Tipo C","Inversión","Un nuevo contrato social y ambiental para la Bogotá del Siglo XXI",1,{"$f":"IF(ISERROR(VLOOKUP(K335,[2]Proposito_programa!$C$2:$E$59,2,FALSE)),\" \",VLOOKUP(K335,[2]Proposito_programa!$C$2:$E$59,2,FALSE))","v":"Subsidios y transferencias para la equidad"},{"$f":"IF(ISERROR(VLOOKUP(K335,[2]Proposito_programa!$C$2:$E$59,3,FALSE)),\" \",VLOOKUP(K335,[2]Proposito_programa!$C$2:$E$59,3,FALSE))","v":"Propósito 1: Hacer un nuevo contrato social para incrementar la inclusión social, productiva y política"},1815,null,860066942,"CAJA DE COMPENSACION FAMILIAR COMPENSAR","Persona Jurídica",null,null,null,null,4173000,-361230,null,null,3811770,3811770,null,null,null,null,null,null,null,null,null,null,"En ejecución",1]
[null,2022,null,null,"Otros","Otros","No aplica","Resolución subsidio Tipo C","Inversión","Un nuevo contrato social y ambiental para la Bogotá del Siglo XXI",1,{"$f":"IF(ISERROR(VLOOKUP(K336,[2]Proposito_programa!$C$2:$E$59,2,FALSE)),\" \",VLOOKUP(K336,[2]Proposito_programa!$C$2:$E$59,2,FALSE))","v":"Subsidios y transferencias para la equidad"},{"$f":"IF(ISERROR(VLOOKUP(K336,[2]Proposito_programa!$C$2:$E$59,3,FALSE)),\" \",VLOOKUP(K336,[2]Proposito_programa!$C$2:$E$59,3,FALSE))","v":"Propósito 1: Hacer un nuevo contrato social para incrementar la inclusión social, productiva y política"},1815,null,860066942,"CAJA DE COMPENSACION FAMILIAR COMPENSAR","Persona Jurídica",null,null,null,null,392210000,0,null,null,392210000,336180000,null,null,null,null,null,null,null,null,null,null,"En ejecución",1]
[null,2022,null,null,"Otros","Otros","No aplica","Resolución subsidio Tipo C","Inversión","Un nuevo contrato social y ambiental para la Bogotá del Siglo XXI",1,{"$f":"IF(ISERROR(VLOOKUP(K337,[2]Proposito_programa!$C$2:$E$59,2,FALSE)),\" \",VLOOKUP(K337,[2]Proposito_programa!$C$2:$E$59,2,FALSE))","v":"Subsidios y transferencias para la equidad"},{"$f":"IF(ISERROR(VLOOKUP(K337,[2]Proposito_programa!$C$2:$E$59,3,FALSE)),\" \",VLOOKUP(K337,[2]Proposito_programa!$C$2:$E$59,3,FALSE))","v":"Propósito 1: Hacer un nuevo contrato social para incrementar la inclusión social, productiva y política"},1815,null,860066942,"CAJA DE COMPENSACION FAMILIAR COMPENSAR","Persona Jurídica",null,null,null,null,5842200,0,null,null,5842200,3865357,null,null,null,null,null,null,null,null,null,null,"En ejecución",1]
[null,2022,null,null,"Otros","Otros","No aplica","Transferencia","Inversión","Un nuevo contrato social y ambiental para la Bogotá del Siglo XXI",1,{"$f":"IF(ISERROR(VLOOKUP(K338,[2]Proposito_programa!$C$2:$E$59,2,FALSE)),\" \",VLOOKUP(K338,[2]Proposito_programa!$C$2:$E$59,2,FALSE))","v":"Subsidios y transferencias para la equidad"},{"$f":"IF(ISERROR(VLOOKUP(K338,[2]Proposito_programa!$C$2:$E$59,3,FALSE)),\" \",VLOOKUP(K338,[2]Proposito_programa!$C$2:$E$59,3,FALSE))","v":"Propósito 1: Hacer un nuevo contrato social para incrementar la inclusión social, productiva y política"},1815,null,899999061,"FONDO DESARROLLO LOCAL CHAPINERO","Persona Natural",null,null,null,null,1614631099,0,null,null,1614631099,1614631099,null,null,null,null,null,null,null,null,null,null,"En ejecución",1]
[328,2022,"FDLCH-CPS-328-2022","https://community.secop.gov.co/Public/Tendering/OpportunityDetail/Index?noticeUID=CO1.NTC.3636244&isFromPublicArea=True&isModal=true&asPopupView=true","Contratos de prestación de servicios","Selección abreviada","Selección abreviada por menor cuantía ","Prestar servicios para el desarrollo de estrategias de buen trato, prevención de violencia intrafamiliar sexual y otras vulneraciones así como la promoción de los derechos de niñas, niños y adolescentes y demás grupos poblacionales de la Localidad de Chapinero.","Inversión","Un nuevo contrato social y ambiental para la Bogotá del Siglo XXI",6,{"$f":"IF(ISERROR(VLOOKUP(K339,Proposito_programa!$C$2:$E$59,2,FALSE)),\" \",VLOOKUP(K339,Proposito_programa!$C$2:$E$59,2,FALSE))","v":"Sistema Distrital de Cuidado"},{"$f":"IF(ISERROR(VLOOKUP(K339,Proposito_programa!$C$2:$E$59,3,FALSE)),\" \",VLOOKUP(K339,Proposito_programa!$C$2:$E$59,3,FALSE))","v":"Propósito 1: Hacer un nuevo contrato social para incrementar la inclusión social, productiva y política"},1710,null,900094963,"FUNDACION PARA EL DESARROLLO INFANTIL SOCIAL Y CULTURAL IWOKE","Persona Jurídica",null,null,null,null,255720000,null,null,null,255720000,null,"2022-12-29",null,null,60,0,0,null,null,null,null,"En ejecución",1]
[329,2022,"FDLCH-CCV-329-2022","https://community.secop.gov.co/Public/Tendering/OpportunityDetail/Index?noticeUID=CO1.NTC.3617762&isFromPublicArea=True&isModal=true&asPopupView=true","Compraventa de bienes muebles","Selección abreviada","Subasta inversa ","Realizar la compraventa a monto agotable para la dotación de bienes destinados al fortalecimiento organizacional de la Alcaldia Local de Chapinero.","Funcionamiento","Un nuevo contrato social y ambiental para la Bogotá del Siglo XXI","No aplica",{"$f":"IF(ISERROR(VLOOKUP(K340,Proposito_programa!$C$2:$E$59,2,FALSE)),\" \",VLOOKUP(K340,Proposito_programa!$C$2:$E$59,2,FALSE))","v":" "},{"$f":"IF(ISERROR(VLOOKUP(K340,Proposito_programa!$C$2:$E$59,3,FALSE)),\" \",VLOOKUP(K340,Proposito_programa!$C$2:$E$59,3,FALSE))","v":" "},null,10,900171311,"TECHNOLOGY WORLD GROUP SAS","Persona Jurídica",null,null,null,null,37039000,null,null,null,37039000,0,"2022-12-28","2022-02-22",null,90,null,null,null,null,null,null,"En ejecución",0]
[null,2022,null,null,"Otros gastos","Otros","No aplica","HONORARIO EDILES","Funcionamiento","Un nuevo contrato social y ambiental para la Bogotá del Siglo XXI","No aplica",{"$f":"IF(ISERROR(VLOOKUP(K341,Proposito_programa!$C$2:$E$59,2,FALSE)),\" \",VLOOKUP(K341,Proposito_programa!$C$2:$E$59,2,FALSE))","v":" "},{"$f":"IF(ISERROR(VLOOKUP(K341,Proposito_programa!$C$2:$E$59,3,FALSE)),\" \",VLOOKUP(K341,Proposito_programa!$C$2:$E$59,3,FALSE))","v":" "},null,null,899999061,"FONDO DESARROLLO LOCAL CHAPINERO","Persona Jurídica",null,null,null,null,680515604,null,null,null,680515604,677647689,null,null,null,null,null,null,null,null,null,null,"Terminado",1]
[326,2022,"FDLCH-CCV-324-2022","https://community.secop.gov.co/Public/Tendering/OpportunityDetail/Index?noticeUID=CO1.NTC.3617198&isFromPublicArea=True&isModal=true&asPopupView=true","Compraventa de bienes muebles","Selección abreviada","Subasta inversa ","Realizar la compraventa a monto agotable de la dotación de bienes destinados a las aulas de primera infancia (JARDÍN Y TRANSICIÓN) de los colegios distritales de laLocalidad de Chapinero y al Centro de Desarrollo Comunitario \"TITOS GARZÓN\"","Inversión","Un nuevo contrato social y ambiental para la Bogotá del Siglo XXI",6,{"$f":"IF(ISERROR(VLOOKUP(K342,Proposito_programa!$C$2:$E$59,2,FALSE)),\" \",VLOOKUP(K342,Proposito_programa!$C$2:$E$59,2,FALSE))","v":"Sistema Distrital de Cuidado"},{"$f":"IF(ISERROR(VLOOKUP(K342,Proposito_programa!$C$2:$E$59,3,FALSE)),\" \",VLOOKUP(K342,Proposito_programa!$C$2:$E$59,3,FALSE))","v":"Propósito 1: Hacer un nuevo contrato social para incrementar la inclusión social, productiva y política"},1710,null,900280686,"GRUPO EMPRESARIAL SOLUCIONES CUATRO EN UNO SAS","Persona Jurídica",null,null,null,null,111248926,null,null,null,111248926,null,"2022-12-29",null,null,60,0,0,null,null,null,null,"En ejecución",1]
[316,2022,"FDLCH-CPS-316-2022","https://community.secop.gov.co/Public/Tendering/OpportunityDetail/Index?noticeUID=CO1.NTC.3443346&isFromPublicArea=True&isModal=true&asPopupView=true","Contratos de prestación de servicios","Licitación pública","Prestación de servicios profesionales y de apoyo a la gestión, o para la ejecución de trabajos artísticos que sólo puedan encomendarse a determinadas personas naturales","Prestar servicios para el fotalecimiento de capacidades y la dignificaciòn de las mujeres en: Construcciòn de ciudadanìa, estrategìa de cuidado a cuidadoras, prevenciòn del feminicidio, violencias basadas en gènero Y/O Violencias contra las muejres en la Localidad de Chapinero\".","Inversión","Un nuevo contrato social y ambiental para la Bogotá del Siglo XXI",6,{"$f":"IF(ISERROR(VLOOKUP(K343,Proposito_programa!$C$2:$E$59,2,FALSE)),\" \",VLOOKUP(K343,Proposito_programa!$C$2:$E$59,2,FALSE))","v":"Sistema Distrital de Cuidado"},{"$f":"IF(ISERROR(VLOOKUP(K343,Proposito_programa!$C$2:$E$59,3,FALSE)),\" \",VLOOKUP(K343,Proposito_programa!$C$2:$E$59,3,FALSE))","v":"Propósito 1: Hacer un nuevo contrato social para incrementar la inclusión social, productiva y política"},1855,10,900693739,"GD GERENCIA Y DIRECCION DE PROYECTOS SAS","Persona Jurídica",null,null,null,null,157110363,0,null,null,157110363,0,"2022-12-09",null,null,180,null,null,null,null,null,null,"En ejecución",0]
[322,2022,"FDLCH-CPS-322-2022","https://community.secop.gov.co/Public/Tendering/OpportunityDetail/Index?noticeUID=CO1.NTC.3575460&isFromPublicArea=True&isModal=true&asPopupView=true","Contratos de prestación de servicios profesionales y de apoyo a la gestión","Contratación mínima cuantia","No aplica","Suministrar a monto agotable elementos e insumos para el reconocimiento y promoción de los saberes ancestrales en mediciona en la Localidad de Chapinero.","Inversión","Un nuevo contrato social y ambiental para la Bogotá del Siglo XXI",6,{"$f":"IF(ISERROR(VLOOKUP(K344,[2]Proposito_programa!$C$2:$E$59,2,FALSE)),\" \",VLOOKUP(K344,[2]Proposito_programa!$C$2:$E$59,2,FALSE))","v":"Sistema Distrital de Cuidado"},{"$f":"IF(ISERROR(VLOOKUP(K344,[2]Proposito_programa!$C$2:$E$59,3,FALSE)),\" \",VLOOKUP(K344,[2]Proposito_programa!$C$2:$E$59,3,FALSE))","v":"Propósito 1: Hacer un nuevo contrato social para incrementar la inclusión social, productiva y política"},2024,null,900244364,"ASAFROSCOL4","Persona Jurídica",null,null,null,null,17000000,0,null,null,17000000,0,"2022-12-22",null,null,90,null,null,null,null,null,null,"En ejecución",0]
[323,2022,"CIA-323-2022","https://community.secop.gov.co/Public/Tendering/OpportunityDetail/Index?noticeUID=CO1.NTC.3672224&isFromPublicArea=True&isModal=true&asPopupView=true","Convenios/Contratos interadministrativos","Contratación directa","No aplica","Promoción y la prevención en salud desde un enfoque diferencial y de derechos de la Localidad de Chapinero.","Inversión","Un nuevo contrato social y ambiental para la Bogotá del Siglo XXI",6,{"$f":"IF(ISERROR(VLOOKUP(K345,[2]Proposito_programa!$C$2:$E$59,2,FALSE)),\" \",VLOOKUP(K345,[2]Proposito_programa!$C$2:$E$59,2,FALSE))","v":"Sistema Distrital de Cuidado"},{"$f":"IF(ISERROR(VLOOKUP(K345,[2]Proposito_programa!$C$2:$E$59,3,FALSE)),\" \",VLOOKUP(K345,[2]Proposito_programa!$C$2:$E$59,3,FALSE))","v":"Propósito 1: Hacer un nuevo contrato social para incrementar la inclusión social, productiva y política"},2024,null,900971006,"SUBRED INTEGRADA DE SERVICIOS DE SALUD NORTE E.S.E","Persona Jurídica",null,null,null,null,313190339,0,null,null,{"$f":"+W345+X345+Z345","v":313190339},0,"2022-12-23",null,null,210,null,null,null,null,null,null,"En ejecución",0]
[325,2022,"FDLCH-CPS-325-2022","https://community.secop.gov.co/Public/Tendering/OpportunityDetail/Index?noticeUID=CO1.NTC.3618523&isFromPublicArea=True&isModal=true&asPopupView=true","Contratos de prestación de servicios","Selección abreviada","No aplica","Prestar servicios para realizar acciones de prevención del consumo de sustancias psicoactivas en el marco de los dispositivos de base comunitaria en la Localidad de Chapienro.","Inversión","Un nuevo contrato social y ambiental para la Bogotá del Siglo XXI",6,{"$f":"IF(ISERROR(VLOOKUP(K346,[2]Proposito_programa!$C$2:$E$59,2,FALSE)),\" \",VLOOKUP(K346,[2]Proposito_programa!$C$2:$E$59,2,FALSE))","v":"Sistema Distrital de Cuidado"},{"$f":"IF(ISERROR(VLOOKUP(K346,[2]Proposito_programa!$C$2:$E$59,3,FALSE)),\" \",VLOOKUP(K346,[2]Proposito_programa!$C$2:$E$59,3,FALSE))","v":"Propósito 1: Hacer un nuevo contrato social para incrementar la inclusión social, productiva y política"},2024,3,900360948,"CORPORACIÓN COLECTIVO DIGERATI","Persona Jurídica",null,null,null,null,75615691,0,null,null,75615691,0,"2022-12-27",null,null,90,null,null,null,null,null,null,"En ejecución",0]
[324,2022,"FDLCH-CCV-324-2022","https://community.secop.gov.co/Public/Tendering/OpportunityDetail/Index?noticeUID=CO1.NTC.3617198&isFromPublicArea=True&isModal=true&asPopupView=true","Compraventa de bienes muebles","Selección abreviada","Subasta inversa ","Realizar la compraventa a monto agotable de la dotación de bienes destinados a las aulas de primera infancia (JARDÍN Y TRANSICIÓN) de los colegios distritales de laLocalidad de Chapinero y al Centro de Desarrollo Comunitario \"TITOS GARZÓN\"","Inversión","Un nuevo contrato social y ambiental para la Bogotá del Siglo XXI",12,{"$f":"IF(ISERROR(VLOOKUP(K347,[2]Proposito_programa!$C$2:$E$59,2,FALSE)),\" \",VLOOKUP(K347,[2]Proposito_programa!$C$2:$E$59,2,FALSE))","v":"Educación inicial: Bases sólidas para la vida."},{"$f":"IF(ISERROR(VLOOKUP(K347,[2]Proposito_programa!$C$2:$E$59,3,FALSE)),\" \",VLOOKUP(K347,[2]Proposito_programa!$C$2:$E$59,3,FALSE))","v":"Propósito 1: Hacer un nuevo contrato social para incrementar la inclusión social, productiva y política"},1830,2,900280686,"GRUPO EMPRESARIAL SOLUCIONES CUATRO EN UNO SAS","Persona Jurídica",null,null,null,null,169710696,0,null,null,169710696,0,"2022-12-23",null,null,90,null,null,null,null,null,null,"En ejecución",0]
[110,2022,"FDLCH-CPS-110-2022","https://community.secop.gov.co/Public/Tendering/OpportunityDetail/Index?noticeUID=CO1.NTC.2708476&isFromPublicArea=True&isModal=true&asPopupView=true","Contratos de prestación de servicios profesionales y de apoyo a la gestión","Contratación directa","Prestación de servicios profesionales y de apoyo a la gestión, o para la ejecución de trabajos artísticos que sólo puedan encomendarse a determinadas personas naturales","Prestar servicios asistenciales de apoyo a la gestión para el desarrollo de actividades relacionadas con la gestión ambiental local en el marco del proyecto de inversión \"Chapinero sostenible y consciente\"","Inversión","Un nuevo contrato social y ambiental para la Bogotá del Siglo XXI",27,{"$f":"IF(ISERROR(VLOOKUP(K348,[2]Proposito_programa!$C$2:$E$59,2,FALSE)),\" \",VLOOKUP(K348,[2]Proposito_programa!$C$2:$E$59,2,FALSE))","v":"Cambio cultural para la gestión de la crisis climática"},{"$f":"IF(ISERROR(VLOOKUP(K348,[2]Proposito_programa!$C$2:$E$59,3,FALSE)),\" \",VLOOKUP(K348,[2]Proposito_programa!$C$2:$E$59,3,FALSE))","v":"Propósito 2 : Cambiar Nuestros Hábitos de Vida para Reverdecer a Bogotá y Adaptarnos y Mitigar la Crisis Climática"},1712,null,1077866912,"MARIA PAULA BRAVO OROZCO","Persona Natural",null,null,null,null,0,0,1,6000000,6000000,6000000,"2022-01-25","2022-02-01","2022-10-31",180,1,90,null,null,null,null,"Terminado",1]
[332,2022,"FDLCH-CIA-332-2022","https://community.secop.gov.co/Public/Tendering/OpportunityDetail/Index?noticeUID=CO1.NTC.3688909&isFromPublicArea=True&isModal=true&asPopupView=true","Convenios/Contratos interadministrativos","Contratación directa","Contratos interadministrativos","Prestar servicios asistenciales de apoyo para la gestión y desarrollo del proyecto de inversión No. 1715 \"Chapinero restaurasdor y cuidador del territorio\".","Inversión","Un nuevo contrato social y ambiental para la Bogotá del Siglo XXI",28,{"$f":"IF(ISERROR(VLOOKUP(K349,[2]Proposito_programa!$C$2:$E$59,2,FALSE)),\" \",VLOOKUP(K349,[2]Proposito_programa!$C$2:$E$59,2,FALSE))","v":"Bogotá protectora de sus recursos naturales"},{"$f":"IF(ISERROR(VLOOKUP(K349,[2]Proposito_programa!$C$2:$E$59,3,FALSE)),\" \",VLOOKUP(K349,[2]Proposito_programa!$C$2:$E$59,3,FALSE))","v":"Propósito 2 : Cambiar Nuestros Hábitos de Vida para Reverdecer a Bogotá y Adaptarnos y Mitigar la Crisis Climática"},1715,null,830128286,"AGUAS DE BOGOTA SA ESP","Persona Jurídica",null,null,null,null,170300000,0,null,null,170300000,0,"2022-12-29",null,null,60,null,null,null,null,null,null,"En ejecución",0]
[213,2022,"FDLCH-CPS-213-2022","https://community.secop.gov.co/Public/Tendering/OpportunityDetail/Index?noticeUID=CO1.NTC.3314601&isFromPublicArea=True&isModal=true&asPopupView=true","Contratos de prestación de servicios","Selección abreviada","Selección abreviada por menor cuantía ","Prestar servicios para el fortalecimiento de las capacidades locales para la respuesta a emergencias y desastres en la Localidad de Chapinero.","Inversión","Un nuevo contrato social y ambiental para la Bogotá del Siglo XXI",30,{"$f":"IF(ISERROR(VLOOKUP(K350,[2]Proposito_programa!$C$2:$E$59,2,FALSE)),\" \",VLOOKUP(K350,[2]Proposito_programa!$C$2:$E$59,2,FALSE))","v":"Eficiencia en la atención de emergencias"},{"$f":"IF(ISERROR(VLOOKUP(K350,[2]Proposito_programa!$C$2:$E$59,3,FALSE)),\" \",VLOOKUP(K350,[2]Proposito_programa!$C$2:$E$59,3,FALSE))","v":"Propósito 2 : Cambiar Nuestros Hábitos de Vida para Reverdecer a Bogotá y Adaptarnos y Mitigar la Crisis Climática"},1719,7,900017592,"ASOCIACIÓN ARKAMBIENTAL","Persona Jurídica",null,null,null,null,197707320,0,null,null,197707320,null,"2022-10-18","2022-10-20","2023-05-19",210,null,null,null,null,null,null,"En ejecución",0]
[289,2021,"FDLCH-COP-289-2021",null,"Obra pública","Licitación pública","No aplica","ADICIÓN AL CONTRATO FDLCH-COP-289-2021 CONTRATAR A PRECIOS UNITARIOS FIJOS. SIN FORMULA DE AJUSTE A MONTO AGOTABLE. ACTIVIDADES PARA LACONSTRUCCION Y DOTACION DE LOS PARQUES VECINALES Y DE BOLSILLO DE LALOCALIDAD DE CHAPINERO EN BOGOTA.D.C.","Inversión","Un nuevo contrato social y ambiental para la Bogotá del Siglo XXI",33,{"$f":"IF(ISERROR(VLOOKUP(K351,[2]Proposito_programa!$C$2:$E$59,2,FALSE)),\" \",VLOOKUP(K351,[2]Proposito_programa!$C$2:$E$59,2,FALSE))","v":"Más árboles y más y mejor espacio público"},{"$f":"IF(ISERROR(VLOOKUP(K351,[2]Proposito_programa!$C$2:$E$59,3,FALSE)),\" \",VLOOKUP(K351,[2]Proposito_programa!$C$2:$E$59,3,FALSE))","v":"Propósito 2 : Cambiar Nuestros Hábitos de Vida para Reverdecer a Bogotá y Adaptarnos y Mitigar la Crisis Climática"},1723,null,900053011,"CONSTRUCTORA VALHER S.A.S","Persona Jurídica",null,null,null,null,144106739,0,null,null,144106739,null,"2022-11-23",null,null,null,1,37,null,null,null,null,"En ejecución",0.85]
[321,2022,"FDLCH-CPS-321-2022","https://community.secop.gov.co/Public/Tendering/OpportunityDetail/Index?noticeUID=CO1.NTC.3617500&isFromPublicArea=True&isModal=true&asPopupView=true","Contratos de prestación de servicios","Selección abreviada","Selección abreviada por menor cuantía ","Prestar servicios para las actividades de construcción de memori, paz y reconciliación con las víctimas del conflicto armando y la comunidad de la Localidad de Chapinero.","Inversión","Un nuevo contrato social y ambiental para la Bogotá del Siglo XXI",39,{"$f":"IF(ISERROR(VLOOKUP(K352,[2]Proposito_programa!$C$2:$E$59,2,FALSE)),\" \",VLOOKUP(K352,[2]Proposito_programa!$C$2:$E$59,2,FALSE))","v":"Bogotá territorio de paz y atención integral a las víctimas del conflicto armado"},{"$f":"IF(ISERROR(VLOOKUP(K352,[2]Proposito_programa!$C$2:$E$59,3,FALSE)),\" \",VLOOKUP(K352,[2]Proposito_programa!$C$2:$E$59,3,FALSE))","v":"Propósito 3: Inspirar confianza y legitimidad para vivir sin miedo y ser epicentro de cultura ciudadana, paz y reconciliación"},2028,null,830133329,"FUNDACIÒN PARA EL DESARROLLO SOCIOCULTURAL, DEPORTIVO, COMUNITARIO, AGROPECUARIO Y/O AMBIENTAL-FUNDESCO","Persona Jurídica",null,null,null,null,159611908,0,null,null,159611908,null,"2022-12-23",null,null,150,null,null,null,null,null,null,"En ejecución",0]
[316,2022,"FDLCH-CPS-316-2022","https://community.secop.gov.co/Public/Tendering/OpportunityDetail/Index?noticeUID=CO1.NTC.3443346&isFromPublicArea=True&isModal=true&asPopupView=true","Contratos de prestación de servicios","Licitación pública","Prestación de servicios profesionales y de apoyo a la gestión, o para la ejecución de trabajos artísticos que sólo puedan encomendarse a determinadas personas naturales","Prestar servicios para el fotalecimiento de capacidades y la dignificaciòn de las mujeres en: Construcciòn de ciudadanìa, estrategìa de cuidado a cuidadoras, prevenciòn del feminicidio, violencias basadas en gènero Y/O Violencias contra las muejres en la Localidad de Chapinero\".","Inversión","Un nuevo contrato social y ambiental para la Bogotá del Siglo XXI",40,{"$f":"IF(ISERROR(VLOOKUP(K353,Proposito_programa!$C$2:$E$59,2,FALSE)),\" \",VLOOKUP(K353,Proposito_programa!$C$2:$E$59,2,FALSE))","v":"Más mujeres viven una vida libre de violencias, se sienten seguras y acceden con confianza al sistema de justicia"},{"$f":"IF(ISERROR(VLOOKUP(K353,[2]Proposito_programa!$C$2:$E$59,3,FALSE)),\" \",VLOOKUP(K353,[2]Proposito_programa!$C$2:$E$59,3,FALSE))","v":"Propósito 3: Inspirar confianza y legitimidad para vivir sin miedo y ser epicentro de cultura ciudadana, paz y reconciliación"},2035,10,900693739,"GD GERENCIA Y DIRECCION DE PROYECTOS SAS","Persona Jurídica",null,null,null,null,427567000,0,null,null,427567000,0,"2022-12-09",null,null,180,null,null,null,null,null,null,"En ejecución",0]
[326,2022,"FDLCH-CPS-326-2022","https://community.secop.gov.co/Public/Tendering/OpportunityDetail/Index?noticeUID=CO1.NTC.3624002&isFromPublicArea=True&isModal=true&asPopupView=true","Contratos de prestación de servicios","Selección abreviada","Selección abreviada por menor cuantía ","Prestar servicios para sensibilizar y promover la formalización de vendedores informales y del uso adecuado del espacio público en la Localidad de Chapinero.","Inversión","Un nuevo contrato social y ambiental para la Bogotá del Siglo XXI",45,{"$f":"IF(ISERROR(VLOOKUP(K354,Proposito_programa!$C$2:$E$59,2,FALSE)),\" \",VLOOKUP(K354,Proposito_programa!$C$2:$E$59,2,FALSE))","v":"Espacio público más seguro y construido colectivamente"},{"$f":"IF(ISERROR(VLOOKUP(K354,Proposito_programa!$C$2:$E$59,3,FALSE)),\" \",VLOOKUP(K354,Proposito_programa!$C$2:$E$59,3,FALSE))","v":"Propósito 3: Inspirar confianza y legitimidad para vivir sin miedo y ser epicentro de cultura ciudadana, paz y reconciliación"},1736,7,811022703,"IKALA  EMPRESA PARA EL DESARROLLO SOCIAL SAS","Persona Natural",null,null,null,null,116672000,0,null,null,116672000,null,"2022-12-27",null,null,150,null,null,null,null,null,null,"En ejecución",0]
[308,2021,"FDLCH-CI-308-2021",null,"Interventoría","Concurso de méritos","No aplica","ADICION Y PRORROGA DEL CONTRATO DE INTERVENTORIA No 308 - 2021 -REALIZAR LA INTERVENTORIA TECNICA, ADMINISTRATIVA, FINANCIER, SOCIAL, AMBIENTAL Y SISTEMA DE SEGURIDAD Y SALUD EN EL TRABAJO - SG-S ST. DEL CONTRATO DE OBRA QUE SE DERIVE DE LA LICITACION PUBLICA O LA QUE HAGA SUS VECES. QUE REFIERE A EJECUTAR A MONTO AGOTABLE, POR PRECIOS UNITARIOS FIJOS OBRAS Y ACTIVIDADES PARA LA CONSERVACION DE LA INFRAESTRUCTURA VIAL RURAL DE LA LOCALIDAD DE CHAPINERO,EN BOGOTA.D.C.","Inversión","Un nuevo contrato social y ambiental para la Bogotá del Siglo XXI",49,{"$f":"IF(ISERROR(VLOOKUP(K355,[2]Proposito_programa!$C$2:$E$59,2,FALSE)),\" \",VLOOKUP(K355,[2]Proposito_programa!$C$2:$E$59,2,FALSE))","v":"Movilidad segura, sostenible y accesible"},{"$f":"IF(ISERROR(VLOOKUP(K355,[2]Proposito_programa!$C$2:$E$59,3,FALSE)),\" \",VLOOKUP(K355,[2]Proposito_programa!$C$2:$E$59,3,FALSE))","v":"Propósito 4: Hacer de Bogotá Región un modelo de movilidad multimodal, incluyente y sostenible"},1734,null,901551951,"CONSORCIO IB INTERVENTORES 2021","Persona Jurídica",null,null,null,null,null,0,1,45000000,45000000,null,null,null,null,60,1,37,null,null,null,null,"En ejecución"]
[304,2021,"FDLCH-COP-304-2021",null,"Obra pública","Licitación pública","No aplica","ADICION Y PRORROGA CONTRATO DE OBRA No 304-2021 -EJECUTAR A MONTO AGOTABLE,POR PRECIOS UNITARIOS FIJOS OBRAS Y ACTIVIDADES PARA LA CONSERVACION DE LA INFRAESTRUCTURA VIAL RURAL DE LA LOCALIDAD DE CHAPINERO. EN BOGOTA. D.C.","Inversión","Un nuevo contrato social y ambiental para la Bogotá del Siglo XXI",49,{"$f":"IF(ISERROR(VLOOKUP(K356,[2]Proposito_programa!$C$2:$E$59,2,FALSE)),\" \",VLOOKUP(K356,[2]Proposito_programa!$C$2:$E$59,2,FALSE))","v":"Movilidad segura, sostenible y accesible"},{"$f":"IF(ISERROR(VLOOKUP(K356,[2]Proposito_programa!$C$2:$E$59,3,FALSE)),\" \",VLOOKUP(K356,[2]Proposito_programa!$C$2:$E$59,3,FALSE))","v":"Propósito 4: Hacer de Bogotá Región un modelo de movilidad multimodal, incluyente y sostenible"},1734,null,901551341,"UNION TEMPORAL BCC CHAPINERO 2021","Persona Jurídica",null,null,null,null,null,0,1,365357016,365357016,null,null,null,null,60,1,37,null,null,null,null,"En ejecución"]
[331,2022,"FDLCH-CPS-331-2022","https://community.secop.gov.co/Public/Tendering/OpportunityDetail/Index?noticeUID=CO1.NTC.3630801&isFromPublicArea=True&isModal=true&asPopupView=true","Contratos de prestación de servicios","Selección abreviada","Selección abreviada por menor cuantía ","Prestar servicios para el fortalecimiento y la formación a las organizaciones sociales comunitarias e instancias de participación ciudadana en la Localidad de Chapinero.","Inversión","Un nuevo contrato social y ambiental para la Bogotá del Siglo XXI",55,{"$f":"IF(ISERROR(VLOOKUP(K357,[2]Proposito_programa!$C$2:$E$59,2,FALSE)),\" \",VLOOKUP(K357,[2]Proposito_programa!$C$2:$E$59,2,FALSE))","v":"Fortalecimiento de cultura ciudadana y su institucionalidad"},{"$f":"IF(ISERROR(VLOOKUP(K357,[2]Proposito_programa!$C$2:$E$59,3,FALSE)),\" \",VLOOKUP(K357,[2]Proposito_programa!$C$2:$E$59,3,FALSE))","v":"Propósito 5: Construir Bogotá - Región con gobierno abierto, transparente y ciudadanía consciente"},1739,10,900175374,"ASOCIACIÓN DE HOGARES SI A LA VIDA","Persona Jurídica",null,null,null,null,280000000,0,null,null,280000000,0,"2022-12-27",null,null,180,null,null,null,null,null,null,"En ejecución",0]
[330,2022,"FDLCH-CCV-330-2022","https://community.secop.gov.co/Public/Tendering/OpportunityDetail/Index?noticeUID=CO1.NTC.3617762&isFromPublicArea=True&isModal=true&asPopupView=true","Compraventa de bienes muebles","Selección abreviada","Subasta inversa ","Realizar la comprventa a monto agotable para la dotación de bienes destinados al fortalecimiento organizacional de la Alcaldía Local de Chapienro.","Inversión","Un nuevo contrato social y ambiental para la Bogotá del Siglo XXI",57,{"$f":"IF(ISERROR(VLOOKUP(K358,[2]Proposito_programa!$C$2:$E$59,2,FALSE)),\" \",VLOOKUP(K358,[2]Proposito_programa!$C$2:$E$59,2,FALSE))","v":"Gestión pública local"},{"$f":"IF(ISERROR(VLOOKUP(K358,[2]Proposito_programa!$C$2:$E$59,3,FALSE)),\" \",VLOOKUP(K358,[2]Proposito_programa!$C$2:$E$59,3,FALSE))","v":"Propósito 5: Construir Bogotá - Región con gobierno abierto, transparente y ciudadanía consciente"},1741,10,901341884,"INTEGRA DE COLOMBIA SAS","Persona Jurídica",null,null,null,null,105000000,0,null,null,105000000,0,"2022-12-28",null,null,90,null,null,null,null,null,null,"En ejecución",0]
[329,2022,"FDLCH-CCV-329-2022","https://community.secop.gov.co/Public/Tendering/OpportunityDetail/Index?noticeUID=CO1.NTC.3617762&isFromPublicArea=True&isModal=true&asPopupView=true","Compraventa de bienes muebles","Selección abreviada","Subasta inversa ","Realizar la compraventa a monto agotable para la dotación de bienes destinados al fortalecimiento organizacional de la Alcaldia Local de Chapinero.","Inversión","Un nuevo contrato social y ambiental para la Bogotá del Siglo XXI",57,{"$f":"IF(ISERROR(VLOOKUP(K359,[2]Proposito_programa!$C$2:$E$59,2,FALSE)),\" \",VLOOKUP(K359,[2]Proposito_programa!$C$2:$E$59,2,FALSE))","v":"Gestión pública local"},{"$f":"IF(ISERROR(VLOOKUP(K359,[2]Proposito_programa!$C$2:$E$59,3,FALSE)),\" \",VLOOKUP(K359,[2]Proposito_programa!$C$2:$E$59,3,FALSE))","v":"Propósito 5: Construir Bogotá - Región con gobierno abierto, transparente y ciudadanía consciente"},1741,10,900171311,"TECHNOLOGY WORLD GROUP SAS","Persona Jurídica",null,null,null,null,{"$f":"81168867+56792133","v":137961000},0,null,null,137961000,0,"2022-12-28",null,null,30,null,null,null,null,null,null,"En ejecución",0]
[222,2022,"CPS-222-2022","https://community.secop.gov.co/Public/Tendering/OpportunityDetail/Index?noticeUID=CO1.NTC.3428944&isFromPublicArea=True&isModal=true&asPopupView=true","Contratos de prestación de servicios profesionales y de apoyo a la gestión","Contratación directa","Prestación de servicios profesionales y de apoyo a la gestión, o para la ejecución de trabajos artísticos que sólo puedan encomendarse a determinadas personas naturales","Prestar servicios profesionales especializados para la organización y estructuración de la gestión jurídica del despacho de la Alcaldía Local de Chapinero y de las dependencias que la conforman.","Inversión","Un nuevo contrato social y ambiental para la Bogotá del Siglo XXI",57,{"$f":"IF(ISERROR(VLOOKUP(K360,[2]Proposito_programa!$C$2:$E$59,2,FALSE)),\" \",VLOOKUP(K360,[2]Proposito_programa!$C$2:$E$59,2,FALSE))","v":"Gestión pública local"},{"$f":"IF(ISERROR(VLOOKUP(K360,[2]Proposito_programa!$C$2:$E$59,3,FALSE)),\" \",VLOOKUP(K360,[2]Proposito_programa!$C$2:$E$59,3,FALSE))","v":"Propósito 5: Construir Bogotá - Región con gobierno abierto, transparente y ciudadanía consciente"},1741,null,79729789,"ALFREDO ENRIQUE CACERES MENDOZA","Persona Natural",null,null,null,null,18750000,0,1,7500000,26250000,10000000,"2022-10-21","2022-10-21","2022-12-20",60,1,15,null,null,null,null,"En ejecución",1]
[216,2022,"FDLCH-CPS-216-2022","https://community.secop.gov.co/Public/Tendering/OpportunityDetail/Index?noticeUID=CO1.NTC.3314250&isFromPublicArea=True&isModal=true&asPopupView=true","Contratos de prestación de servicios profesionales y de apoyo a la gestión","Selección abreviada","Selección abreviada por menor cuantía ","Prestar los servicios logísticos a monto agotable para fomentar la participación ciudadana, organización comunitario, la estrategia de presupuestos participativos, gobierno abierto y la transparencia local y desarrollar el proceso de rendición de cuentas constante de la Localidad de Chapinero.","Inversión","Un nuevo contrato social y ambiental para la Bogotá del Siglo XXI",57,{"$f":"IF(ISERROR(VLOOKUP(K361,[2]Proposito_programa!$C$2:$E$59,2,FALSE)),\" \",VLOOKUP(K361,[2]Proposito_programa!$C$2:$E$59,2,FALSE))","v":"Gestión pública local"},{"$f":"IF(ISERROR(VLOOKUP(K361,[2]Proposito_programa!$C$2:$E$59,3,FALSE)),\" \",VLOOKUP(K361,[2]Proposito_programa!$C$2:$E$59,3,FALSE))","v":"Propósito 5: Construir Bogotá - Región con gobierno abierto, transparente y ciudadanía consciente"},1741,7,900350133,"OFIBEST SAS","Persona Jurídica",null,null,null,null,75000000,0,null,null,75000000,15000000,"2022-10-19","2022-10-21","2023-05-20",210,null,22,null,null,null,null,"En ejecución",0]
[null,2022,null,null,"Otros gastos","Otros","No aplica","PAGO ARL 2022","Inversión","Un nuevo contrato social y ambiental para la Bogotá del Siglo XXI",57,{"$f":"IF(ISERROR(VLOOKUP(K362,[2]Proposito_programa!$C$2:$E$59,2,FALSE)),\" \",VLOOKUP(K362,[2]Proposito_programa!$C$2:$E$59,2,FALSE))","v":"Gestión pública local"},{"$f":"IF(ISERROR(VLOOKUP(K362,[2]Proposito_programa!$C$2:$E$59,3,FALSE)),\" \",VLOOKUP(K362,[2]Proposito_programa!$C$2:$E$59,3,FALSE))","v":"Propósito 5: Construir Bogotá - Región con gobierno abierto, transparente y ciudadanía consciente"},1741,null,899999061,"FONDO DESARROLLO LOCAL CHAPINERO","Persona Jurídica",null,null,null,null,16453900,0,null,null,16453900,16462100,null,null,null,null,null,null,null,null,null,null,"En ejecución",1]
[null,2022,null,null,"Otros gastos","Otros","No aplica","SALUD EDILES","Funcionamiento","Un nuevo contrato social y ambiental para la Bogotá del Siglo XXI","No aplica",{"$f":"IF(ISERROR(VLOOKUP(K363,Proposito_programa!$C$2:$E$59,2,FALSE)),\" \",VLOOKUP(K363,Proposito_programa!$C$2:$E$59,2,FALSE))","v":" "},{"$f":"IF(ISERROR(VLOOKUP(K363,Proposito_programa!$C$2:$E$59,3,FALSE)),\" \",VLOOKUP(K363,Proposito_programa!$C$2:$E$59,3,FALSE))","v":" "},null,null,899999061,"FONDO DESARROLLO LOCAL CHAPINERO","Persona Jurídica",null,null,null,null,84709800,null,null,null,84709800,84709800,null,null,null,null,null,null,null,null,null,null,"Terminado",1]
[null,2022,null,null,"Otros gastos","Otros","No aplica","SERVICIOS PUBLICOS","Funcionamiento","Un nuevo contrato social y ambiental para la Bogotá del Siglo XXI","No aplica",{"$f":"IF(ISERROR(VLOOKUP(K364,Proposito_programa!$C$2:$E$59,2,FALSE)),\" \",VLOOKUP(K364,Proposito_programa!$C$2:$E$59,2,FALSE))","v":" "},{"$f":"IF(ISERROR(VLOOKUP(K364,Proposito_programa!$C$2:$E$59,3,FALSE)),\" \",VLOOKUP(K364,Proposito_programa!$C$2:$E$59,3,FALSE))","v":" "},null,null,899999061,"FONDO DESARROLLO LOCAL CHAPINERO","Persona Jurídica",null,null,null,null,141802780,null,null,null,141802780,141802780,null,null,null,null,null,null,null,null,null,null,"Terminado",1]
[null,2022,null,null,"Otros gastos","Otros","No aplica","SANCIONES ADMINISTRATIVAS","Funcionamiento","Un nuevo contrato social y ambiental para la Bogotá del Siglo XXI","No aplica",{"$f":"IF(ISERROR(VLOOKUP(K365,Proposito_programa!$C$2:$E$59,2,FALSE)),\" \",VLOOKUP(K365,Proposito_programa!$C$2:$E$59,2,FALSE))","v":" "},{"$f":"IF(ISERROR(VLOOKUP(K365,Proposito_programa!$C$2:$E$59,3,FALSE)),\" \",VLOOKUP(K365,Proposito_programa!$C$2:$E$59,3,FALSE))","v":" "},null,null,899999061,"FONDO DESARROLLO LOCAL CHAPINERO","Persona Jurídica",null,null,null,null,3290142,null,null,null,3290142,0,null,null,null,null,null,null,null,null,null,null,"Terminado",1]
[null,2022,null,null,"Otros gastos","Otros","No aplica","OTROS SERVICIOS JURIDICOS","Funcionamiento","Un nuevo contrato social y ambiental para la Bogotá del Siglo XXI","No aplica",{"$f":"IF(ISERROR(VLOOKUP(K366,Proposito_programa!$C$2:$E$59,2,FALSE)),\" \",VLOOKUP(K366,Proposito_programa!$C$2:$E$59,2,FALSE))","v":" "},{"$f":"IF(ISERROR(VLOOKUP(K366,Proposito_programa!$C$2:$E$59,3,FALSE)),\" \",VLOOKUP(K366,Proposito_programa!$C$2:$E$59,3,FALSE))","v":" "},null,null,899999061,"FONDO DESARROLLO LOCAL CHAPINERO","Persona Jurídica",null,null,null,null,226100,null,null,null,226100,226100,null,null,null,null,null,null,null,null,null,null,"Terminado",1]
[253,2021,"CPS-253-2022",null,"Contratos de prestación de servicios","Contratación mínima cuantia","No aplica","ADICION Y PRORROGA DEL CONTRATO FDLCH-CPS-253-2022 QUE TIENE POR OBJETO PRESTAR EL SERVICIO DE MANTENIMIENTO PREVENTIVO Y CORRECTIVO DE LOS ASCENSORES ELECTRICOS DE LAS MARCAS MP<(>&<)>L Y OTIS DE LAS TORRES A Y B DE LA PLANTA FISICA DE LA ALCALDIA LOCAL DE CHAPINERO A PRECIOS UNITARIOS FIJOS SIN FORMULA DE REAJUSTE.","Funcionamiento","Un nuevo contrato social y ambiental para la Bogotá del Siglo XXI","No aplica",{"$f":"IF(ISERROR(VLOOKUP(K367,Proposito_programa!$C$2:$E$59,2,FALSE)),\" \",VLOOKUP(K367,Proposito_programa!$C$2:$E$59,2,FALSE))","v":" "},{"$f":"IF(ISERROR(VLOOKUP(K367,Proposito_programa!$C$2:$E$59,3,FALSE)),\" \",VLOOKUP(K367,Proposito_programa!$C$2:$E$59,3,FALSE))","v":" "},null,null,null,null,"Persona Jurídica",null,null,null,null,8000000,null,null,null,8000000,4720921,null,null,null,90,null,null,null,null,null,null,"En ejecución",1]
[303,2021,"CPS-303-2021",null,"Contratos de prestación de servicios","Contratación mínima cuantia","No aplica","CONTRATAR LA PRESTACIÓN DE SERVICIOS DE MATERIAL IMPRESO Y O DIGITAL DE ACUERDO A LAS NECESIDADES DE LA ALCALDÍA LOCAL DE CHAPINERO.","Funcionamiento","Un nuevo contrato social y ambiental para la Bogotá del Siglo XXI","No aplica",{"$f":"IF(ISERROR(VLOOKUP(K368,Proposito_programa!$C$2:$E$59,2,FALSE)),\" \",VLOOKUP(K368,Proposito_programa!$C$2:$E$59,2,FALSE))","v":" "},{"$f":"IF(ISERROR(VLOOKUP(K368,Proposito_programa!$C$2:$E$59,3,FALSE)),\" \",VLOOKUP(K368,Proposito_programa!$C$2:$E$59,3,FALSE))","v":" "},null,null,null,null,"Persona Jurídica",null,null,null,null,8000000,null,null,null,8000000,39018,null,null,null,90,null,null,null,null,null,null,"En ejecución",1]
[93,2022,null,null,null,"Otros","No aplica","OBLIGACIONES POR PAGAR","Funcionamiento","Un nuevo contrato social y ambiental para la Bogotá del Siglo XXI","No aplica",null,null,null,null,"900144990","IMPORMAQUINAS Y OUTSOURCING S.A.S.","Persona Jurídica",null,null,null,null,null,null,null,null,2708725,2708725,null,null,null,null,null,null,null,null,null,null,"Terminado",1]
[95,2022,null,null,null,"Otros","No aplica","OBLIGACIONES POR PAGAR","Funcionamiento","Un nuevo contrato social y ambiental para la Bogotá del Siglo XXI","No aplica",null,null,null,null,"830095213","ORGANIZACION TERPEL S A","Persona Jurídica",null,null,null,null,null,null,null,null,670819,670819,null,null,null,null,null,null,null,null,null,null,"Terminado",1]
[141,2022,null,null,null,"Otros","No aplica","OBLIGACIONES POR PAGAR","Funcionamiento","Un nuevo contrato social y ambiental para la Bogotá del Siglo XXI","No aplica",null,null,null,null,"830079122","COLOMBIANA DE TELEFONOS Y SISTEMAS LIMIT ADA","Persona Jurídica",null,null,null,null,null,null,null,null,595050,595050,{"$f":"+AB371-1403826700","v":-1403231650},null,null,null,null,null,null,null,null,null,"Terminado",1]
[93,2022,null,null,null,"Otros","No aplica","OBLIGACIONES POR PAGAR","Funcionamiento","Un nuevo contrato social y ambiental para la Bogotá del Siglo XXI","No aplica",null,null,null,null,"900144990","IMPORMAQUINAS Y OUTSOURCING S.A.S.","Persona Jurídica",null,null,null,null,null,null,null,null,3914922,3914922,null,null,null,null,null,null,null,null,null,null,"Terminado",1]
[114,2022,null,null,null,"Otros","No aplica","OBLIGACIONES POR PAGAR","Funcionamiento","Un nuevo contrato social y ambiental para la Bogotá del Siglo XXI","No aplica",null,null,null,null,"900119390","ALAS DE COLOMBIA EXPRESS SAS","Persona Jurídica",null,null,null,null,null,null,null,null,6553500,5335300,null,null,null,null,null,null,null,null,null,null,"Terminado",1]
[177,2022,null,null,null,"Otros","No aplica","OBLIGACIONES POR PAGAR","Funcionamiento","Un nuevo contrato social y ambiental para la Bogotá del Siglo XXI","No aplica",null,null,null,null,"899999115","EMPRESA DE TELECOMUNICACIONES DE BOGOTÁ S.A. E.S.P. - ETB S.A. ESP","Persona Jurídica",null,null,null,null,null,null,null,null,733024,733024,null,null,null,null,null,null,null,null,null,null,"Terminado",1]
[264,2022,null,null,null,"Otros","No aplica","OBLIGACIONES POR PAGAR","Funcionamiento","Un nuevo contrato social y ambiental para la Bogotá del Siglo XXI","No aplica",null,null,null,null,"900975944","FEC SUMINISTROS Y SERVICIOS SAS","Persona Jurídica",null,null,null,null,null,null,null,null,0,0,null,null,null,null,null,null,null,null,null,null,"Terminado",1]
[65068,2022,null,null,null,"Otros","No aplica","OBLIGACIONES POR PAGAR","Funcionamiento","Un nuevo contrato social y ambiental para la Bogotá del Siglo XXI","No aplica",null,null,null,null,"830068543","MUNDOLIMPIEZA LTDA","Persona Jurídica",null,null,null,null,null,null,null,null,15726007,15726007,null,null,null,null,null,null,null,null,null,null,"Terminado",1]
[74,2022,null,null,null,"Otros","No aplica","OBLIGACIONES POR PAGAR","Funcionamiento","Un nuevo contrato social y ambiental para la Bogotá del Siglo XXI","No aplica",null,null,null,null,"830009853","SEGURIDAD PENTA LTDA","Persona Jurídica",null,null,null,null,null,null,null,null,117897746,117897746,null,null,null,null,null,null,null,null,null,null,"Terminado",1]
[74,2022,null,null,null,"Otros","No aplica","OBLIGACIONES POR PAGAR","Funcionamiento","Un nuevo contrato social y ambiental para la Bogotá del Siglo XXI","No aplica",null,null,null,null,"805000867","CORREAGRO S.A","Persona Jurídica",null,null,null,null,null,null,null,null,1785006,1785006,null,null,null,null,null,null,null,null,null,null,"Terminado",1]
[86,2022,null,null,null,"Otros","No aplica","OBLIGACIONES POR PAGAR","Funcionamiento","Un nuevo contrato social y ambiental para la Bogotá del Siglo XXI","No aplica",null,null,null,null,"20185010","ANA GRACIELA GALAN DE ALVAREZ","Persona Natural",null,null,null,null,null,null,null,null,9400000,9400000,null,null,null,null,null,null,null,null,null,null,"Terminado",1]
[88,2022,null,null,null,"Otros","No aplica","OBLIGACIONES POR PAGAR","Funcionamiento","Un nuevo contrato social y ambiental para la Bogotá del Siglo XXI","No aplica",null,null,null,null,"891700037","MAPFRE SEGUROS GENERALES DE COLOMBIA S.A","Persona Jurídica",null,null,null,null,null,null,null,null,316459,0,null,null,null,null,null,null,null,null,null,null,"Terminado",1]
[111,2022,null,null,null,"Otros","No aplica","OBLIGACIONES POR PAGAR","Funcionamiento","Un nuevo contrato social y ambiental para la Bogotá del Siglo XXI","No aplica",null,null,null,null,"900110012","MORARCI GROUP SAS","Persona Jurídica",null,null,null,null,null,null,null,null,142956,142956,null,null,null,null,null,null,null,null,null,null,"Terminado",1]
[112,2022,null,null,null,"Otros","No aplica","OBLIGACIONES POR PAGAR","Funcionamiento","Un nuevo contrato social y ambiental para la Bogotá del Siglo XXI","No aplica",null,null,null,null,"830031296","CENTRO INTEGRAL DE MANTENIMIENTO AUTOCAR S SAS","Persona Jurídica",null,null,null,null,null,null,null,null,2401591,2401591,null,null,null,null,null,null,null,null,null,null,"Terminado",1]
[113,2022,null,null,null,"Otros","No aplica","OBLIGACIONES POR PAGAR","Funcionamiento","Un nuevo contrato social y ambiental para la Bogotá del Siglo XXI","No aplica",null,null,null,null,"800020006","AUTO INVERSIONES COLOMBIA S.A. AUTOINVER COL","Persona Jurídica",null,null,null,null,null,null,null,null,4595619,4595619,null,null,null,null,null,null,null,null,null,null,"Terminado",1]
["08 12",2022,null,null,null,"Otros","No aplica","OBLIGACIONES POR PAGAR","Funcionamiento","Un nuevo contrato social y ambiental para la Bogotá del Siglo XXI","No aplica",null,null,null,null,"1020755813","EDMUNDO JOSE DAVID LOPEZ GUTIERREZ","Persona Natural",null,null,null,null,null,null,null,null,0,0,null,null,null,null,null,null,null,null,null,null,"Terminado",1]
["08-12",2022,null,null,null,"Otros","No aplica","OBLIGACIONES POR PAGAR","Funcionamiento","Un nuevo contrato social y ambiental para la Bogotá del Siglo XXI","No aplica",null,null,null,null,"1000794169","JOSE MIGUEL SANTAMARIA BARVO","Persona Natural",null,null,null,null,null,null,null,null,0,0,null,null,null,null,null,null,null,null,null,null,"Terminado",1]
[260,2022,null,null,null,"Otros","No aplica","OBLIGACIONES POR PAGAR","Funcionamiento","Un nuevo contrato social y ambiental para la Bogotá del Siglo XXI","No aplica",null,null,null,null,"901040640","IIS TECHNOLOGY SOLUTIONS SAS","Persona Jurídica",null,null,null,null,null,null,null,null,24241322,23456539,null,null,null,null,null,null,null,null,null,null,"Terminado",1]
[112,2022,null,null,null,"Otros","No aplica","OBLIGACIONES POR PAGAR","Funcionamiento","Un nuevo contrato social y ambiental para la Bogotá del Siglo XXI","No aplica",null,null,null,null,"830031296","CENTRO INTEGRAL DE MANTENIMIENTO AUTOCAR S SAS","Persona Jurídica",null,null,null,null,null,null,null,null,2000000,2000000,null,null,null,null,null,null,null,null,null,null,"Terminado",1]
[228,2022,null,null,null,"Otros","No aplica","OBLIGACIONES POR PAGAR","Funcionamiento","Un nuevo contrato social y ambiental para la Bogotá del Siglo XXI","No aplica",null,null,null,null,"830095213","ORGANIZACION TERPEL S A","Persona Jurídica",null,null,null,null,null,null,null,null,17383717,17383717,null,null,null,null,null,null,null,null,null,null,"Terminado",1]
[10,2022,null,null,null,"Otros","No aplica","OBLIGACIONES POR PAGAR","Funcionamiento","Un nuevo contrato social y ambiental para la Bogotá del Siglo XXI","No aplica",null,null,null,null,"830113831","ALIANSALUD ENTIDAD PROMOTORA DE SALUD S. A PERO TAMBIEN PODRA UTILIZAR LAS DENOMI NACIONES ALIANSALUD ENTIDAD PROMOTORA DE SALUD Y/O","Persona Jurídica",null,null,null,null,null,null,null,null,0,0,null,null,null,null,null,null,null,null,null,null,"Terminado",1]
[258,2022,null,null,null,"Otros","No aplica","OBLIGACIONES POR PAGAR","Funcionamiento","Un nuevo contrato social y ambiental para la Bogotá del Siglo XXI","No aplica",null,null,null,null,"901040640","IIS TECHNOLOGY SOLUTIONS SAS","Persona Jurídica",null,null,null,null,null,null,null,null,24796855,24796855,null,null,null,null,null,null,null,null,null,null,"Terminado",1]
[111,2022,null,null,null,"Otros","No aplica","OBLIGACIONES POR PAGAR","Funcionamiento","Un nuevo contrato social y ambiental para la Bogotá del Siglo XXI","No aplica",null,null,null,null,"900110012","MORARCI GROUP SAS","Persona Jurídica",null,null,null,null,null,null,null,null,4853585,4853585,null,null,null,null,null,null,null,null,null,null,"Terminado",1]
[250,2022,null,null,null,"Otros","No aplica","OBLIGACIONES POR PAGAR","Funcionamiento","Un nuevo contrato social y ambiental para la Bogotá del Siglo XXI","No aplica",null,null,null,null,"901065278","HEALTHCORP SAS","Persona Jurídica",null,null,null,null,null,null,null,null,11594180,11594180,null,null,null,null,null,null,null,null,null,null,"Terminado",1]
[253,2022,null,null,null,"Otros","No aplica","OBLIGACIONES POR PAGAR","Funcionamiento","Un nuevo contrato social y ambiental para la Bogotá del Siglo XXI","No aplica",null,null,null,null,"901147649","INGYEMEL PROFESIONALES J&H S.A.S","Persona Jurídica",null,null,null,null,null,null,null,null,17003728,17003728,null,null,null,null,null,null,null,null,null,null,"Terminado",1]
[113,2022,null,null,null,"Otros","No aplica","OBLIGACIONES POR PAGAR","Funcionamiento","Un nuevo contrato social y ambiental para la Bogotá del Siglo XXI","No aplica",null,null,null,null,"800020006","AUTO INVERSIONES COLOMBIA S.A. AUTOINVER COL","Persona Jurídica",null,null,null,null,null,null,null,null,7802146,7802146,null,null,null,null,null,null,null,null,null,null,"Terminado",1]
[261,2022,null,null,null,"Otros","No aplica","OBLIGACIONES POR PAGAR","Funcionamiento","Un nuevo contrato social y ambiental para la Bogotá del Siglo XXI","No aplica",null,null,null,null,"900353659","JM GRUPO EMPRESARIAL SAS","Persona Jurídica",null,null,null,null,null,null,null,null,170250,170250,null,null,null,null,null,null,null,null,null,null,"Terminado",1]
[262,2022,null,null,null,"Otros","No aplica","OBLIGACIONES POR PAGAR","Funcionamiento","Un nuevo contrato social y ambiental para la Bogotá del Siglo XXI","No aplica",null,null,null,null,"900353659","JM GRUPO EMPRESARIAL SAS","Persona Jurídica",null,null,null,null,null,null,null,null,145750,145750,null,null,null,null,null,null,null,null,null,null,"Terminado",1]
[65068,2022,null,null,null,"Otros","No aplica","OBLIGACIONES POR PAGAR","Funcionamiento","Un nuevo contrato social y ambiental para la Bogotá del Siglo XXI","No aplica",null,null,null,null,"830068543","MUNDOLIMPIEZA LTDA","Persona Jurídica",null,null,null,null,null,null,null,null,45648603,45648603,null,null,null,null,null,null,null,null,null,null,"Terminado",1]
[260,2022,null,null,null,"Otros","No aplica","OBLIGACIONES POR PAGAR","Funcionamiento","Un nuevo contrato social y ambiental para la Bogotá del Siglo XXI","No aplica",null,null,null,null,"900353659","JM GRUPO EMPRESARIAL SAS","Persona Jurídica",null,null,null,null,null,null,null,null,1667963,1667963,null,null,null,null,null,null,null,null,null,null,"Terminado",1]
[86,2022,null,null,null,"Otros","No aplica","OBLIGACIONES POR PAGAR","Funcionamiento","Un nuevo contrato social y ambiental para la Bogotá del Siglo XXI","No aplica",null,null,null,null,"20185010","ANA GRACIELA GALAN DE ALVAREZ","Persona Jurídica",null,null,null,null,null,null,null,null,4700000,4700000,null,null,null,null,null,null,null,null,null,null,"Terminado",1]
[288,2022,null,null,null,"Otros","No aplica","OBLIGACIONES POR PAGAR","Funcionamiento","Un nuevo contrato social y ambiental para la Bogotá del Siglo XXI","No aplica",null,null,null,null,"860524654","ASEGURADORA SOLIDARIA DE COLOMBIA ENTIDA D COOPERATIVA","Persona Jurídica",null,null,null,null,null,null,null,null,44999605,44999605,null,null,null,null,null,null,null,null,null,null,"Terminado",1]
[292,2022,null,null,null,"Otros","No aplica","OBLIGACIONES POR PAGAR","Funcionamiento","Un nuevo contrato social y ambiental para la Bogotá del Siglo XXI","No aplica",null,null,null,null,"901489264","TIESTO SOLUCIONES SAS","Persona Jurídica",null,null,null,null,null,null,null,null,2684759,2684759,null,null,null,null,null,null,null,null,null,null,"Terminado",1]
[293,2022,null,null,null,"Otros","No aplica","OBLIGACIONES POR PAGAR","Funcionamiento","Un nuevo contrato social y ambiental para la Bogotá del Siglo XXI","No aplica",null,null,null,null,"900429481","ESM LOGISTICA SAS","Persona Jurídica",null,null,null,null,null,null,null,null,5995800,5995800,null,null,null,null,null,null,null,null,null,null,"Terminado",1]
[291,2022,null,null,null,"Otros","No aplica","OBLIGACIONES POR PAGAR","Funcionamiento","Un nuevo contrato social y ambiental para la Bogotá del Siglo XXI","No aplica",null,null,null,null,"901295092","MACRO INGENIEROS SAS","Persona Jurídica",null,null,null,null,null,null,null,null,24110100,24110100,null,null,null,null,null,null,null,null,null,null,"Terminado",1]
[297,2022,null,null,null,"Otros","No aplica","OBLIGACIONES POR PAGAR","Funcionamiento","Un nuevo contrato social y ambiental para la Bogotá del Siglo XXI","No aplica",null,null,null,null,"830037946","PANAMERICANA LIBRERIA Y PAPELERIA S A","Persona Jurídica",null,null,null,null,null,null,null,null,5939337,5939337,null,null,null,null,null,null,null,null,null,null,"Terminado",1]
[29,2022,null,null,null,"Otros","No aplica","OBLIGACIONES POR PAGAR","Funcionamiento","Un nuevo contrato social y ambiental para la Bogotá del Siglo XXI","No aplica",null,null,null,null,"860007336","CAJA COLOMBIANA DE SUBSIDIO FAMILIAR COL SUBSIDIO","Persona Jurídica",null,null,null,null,null,null,null,null,11058048,11058048,null,null,null,null,null,null,null,null,null,null,"Terminado",1]
[260,2022,null,null,null,"Otros","No aplica","OBLIGACIONES POR PAGAR","Funcionamiento","Un nuevo contrato social y ambiental para la Bogotá del Siglo XXI","No aplica",null,null,null,null,"901040640","IIS TECHNOLOGY SOLUTIONS SAS","Persona Jurídica",null,null,null,null,null,null,null,null,30000000,0,null,null,null,null,null,null,null,null,null,null,"Terminado",1]
[302,2022,null,null,null,"Otros","No aplica","OBLIGACIONES POR PAGAR","Funcionamiento","Un nuevo contrato social y ambiental para la Bogotá del Siglo XXI","No aplica",null,null,null,null,"860007336","CAJA COLOMBIANA DE SUBSIDIO FAMILIAR COL SUBSIDIO","Persona Jurídica",null,null,null,null,null,null,null,null,24669600,24669600,null,null,null,null,null,null,null,null,null,null,"Terminado",1]
[65068,2022,null,null,null,"Otros","No aplica","OBLIGACIONES POR PAGAR","Funcionamiento","Un nuevo contrato social y ambiental para la Bogotá del Siglo XXI","No aplica",null,null,null,null,"830068543","MUNDOLIMPIEZA LTDA","Persona Jurídica",null,null,null,null,null,null,null,null,19123430,19123430,null,null,null,null,null,null,null,null,null,null,"Terminado",1]
[88,2022,null,null,null,"Otros","No aplica","OBLIGACIONES POR PAGAR","Funcionamiento","Un nuevo contrato social y ambiental para la Bogotá del Siglo XXI","No aplica",null,null,null,null,"891700037","MAPFRE SEGUROS GENERALES DE COLOMBIA S.A","Persona Jurídica",null,null,null,null,null,null,null,null,13683170,0,null,null,null,null,null,null,null,null,null,null,"Terminado",1]
[303,2022,null,null,null,"Otros","No aplica","OBLIGACIONES POR PAGAR","Funcionamiento","Un nuevo contrato social y ambiental para la Bogotá del Siglo XXI","No aplica",null,null,null,null,"900223533","ULTRA CONCEPT SAS","Persona Jurídica",null,null,null,null,null,null,null,null,16500000,16500000,null,null,null,null,null,null,null,null,null,null,"Terminado",1]
[305,2022,null,null,null,"Otros","No aplica","OBLIGACIONES POR PAGAR","Funcionamiento","Un nuevo contrato social y ambiental para la Bogotá del Siglo XXI","No aplica",null,null,null,null,"423972","LUIS FRANCISCO MORENO SANDOVAL","Persona Jurídica",null,null,null,null,null,null,null,null,8920000,8920000,null,null,null,null,null,null,null,null,null,null,"Terminado",1]
[304,2022,null,null,null,"Otros","No aplica","OBLIGACIONES POR PAGAR","Funcionamiento","Un nuevo contrato social y ambiental para la Bogotá del Siglo XXI","No aplica",null,null,null,null,"890900608","ALMACENES EXITO S.A.","Persona Jurídica",null,null,null,null,null,null,null,null,7599800,7599800,null,null,null,null,null,null,null,null,null,null,"Terminado",1]
[306,2022,null,null,null,"Otros","No aplica","OBLIGACIONES POR PAGAR","Funcionamiento","Un nuevo contrato social y ambiental para la Bogotá del Siglo XXI","No aplica",null,null,null,null,"901434039","GRUPO CONSTRUCTORES INTELIGENTES S.A.S","Persona Jurídica",null,null,null,null,null,null,null,null,24500000,24500000,null,null,null,null,null,null,null,null,null,null,"Terminado",1]
[74,2022,null,null,null,"Otros","No aplica","OBLIGACIONES POR PAGAR","Funcionamiento","Un nuevo contrato social y ambiental para la Bogotá del Siglo XXI","No aplica",null,null,null,null,"830009853","SEGURIDAD PENTA LTDA","Persona Jurídica",null,null,null,null,null,null,null,null,103302274,103302274,null,null,null,null,null,null,null,null,null,null,"Terminado",1]
[74,2022,null,null,null,"Otros","No aplica","OBLIGACIONES POR PAGAR","Funcionamiento","Un nuevo contrato social y ambiental para la Bogotá del Siglo XXI","No aplica",null,null,null,null,"805000867","CORREAGRO S.A","Persona Jurídica",null,null,null,null,null,null,null,null,928523,928523,null,null,null,null,null,null,null,null,null,null,"Terminado",1]
[74,2022,null,null,null,"Otros","No aplica","OBLIGACIONES POR PAGAR","Funcionamiento","Un nuevo contrato social y ambiental para la Bogotá del Siglo XXI","No aplica",null,null,null,null,"860071250","BMC BOLSA MERCANTIL DE COLOMBIA S.A.","Persona Jurídica",null,null,null,null,null,null,null,null,615260,615260,null,null,null,null,null,null,null,null,null,null,"Terminado",1]
[176,2022,null,null,null,"Otros","No aplica","OBLIGACIONES POR PAGAR","Funcionamiento","Un nuevo contrato social y ambiental para la Bogotá del Siglo XXI","No aplica",null,null,null,null,"899999061","BOGOTA DISTRITO CAPITAL","Persona Jurídica",null,null,null,null,null,null,null,null,903651,903651,null,null,null,null,null,null,null,null,null,null,"Terminado",1]

{"sheet":"BOGDATA VS FORMATO R3","index":1,"n_rows":116,"n_cols":6,"rows_kept":116,"cut":false,"hidden":false,"merged":[[10,0,35,0],[11,2,11,3],[11,4,11,5],[13,2,13,3],[13,4,13,5],[15,2,15,3],[0,0,0,5],[1,0,1,1],[3,2,3,3],[3,4,3,5],[5,2,5,3],[5,4,5,5],[15,4,15,5],[17,2,17,3],[17,4,17,5],[19,2,19,3],[19,4,19,5],[21,2,21,3],[21,4,21,5],[7,2,7,3],[7,4,7,5],[9,2,9,3],[9,4,9,5],[29,2,29,3],[29,4,29,5],[31,2,31,3],[31,4,31,5],[33,2,33,3],[33,4,33,5],[23,2,23,3],[23,4,23,5],[25,2,25,3],[25,4,25,5],[27,2,27,3],[27,4,27,5],[41,2,41,3],[41,4,41,5],[43,2,43,3],[43,4,43,5],[45,2,45,3],[45,4,45,5],[35,2,35,3],[35,4,35,5],[37,2,37,3],[37,4,37,5],[39,2,39,3],[39,4,39,5],[53,2,53,3],[53,4,53,5],[55,2,55,3],[55,4,55,5],[57,2,57,3],[57,4,57,5],[47,2,47,3],[47,4,47,5],[49,2,49,3],[49,4,49,5],[51,2,51,3],[51,4,51,5],[65,2,65,3],[65,4,65,5],[67,2,67,3],[67,4,67,5],[69,2,69,3],[69,4,69,5],[59,2,59,3],[59,4,59,5],[61,2,61,3],[61,4,61,5],[63,2,63,3],[63,4,63,5],[77,2,77,3],[77,4,77,5],[79,2,79,3],[79,4,79,5],[81,2,81,3],[81,4,81,5],[71,2,71,3],[71,4,71,5],[73,2,73,3],[73,4,73,5],[75,2,75,3],[75,4,75,5],[89,2,89,3],[89,4,89,5],[91,2,91,3],[91,4,91,5],[93,2,93,3],[93,4,93,5],[83,2,83,3],[83,4,83,5],[85,2,85,3],[85,4,85,5],[87,2,87,3],[87,4,87,5],[101,2,101,3],[101,4,101,5],[103,2,103,3],[103,4,103,5],[105,2,105,3],[105,4,105,5],[95,2,95,3],[95,4,95,5],[97,2,97,3],[97,4,97,5],[99,2,99,3],[99,4,99,5],[113,2,113,3],[113,4,113,5],[115,2,115,3],[115,4,115,5],[107,2,107,3],[107,4,107,5],[109,2,109,3],[109,4,109,5],[111,2,111,3],[111,4,111,5]]}
["BOGDATA- CUADRO ANALISIS- CHAPINERO "]
[null,null,"COMPROMISOS ACUMULADOS BOGDATA","VALOR FINAL","ACUMULADO GIROS BOGDATA","GIROS"]
[null,"FUNCIONAMIENTO",2967215043,2292232163,2245441934,1616461666]
[null,"DIFERENCIAS",{"$f":"C3-D3","v":674982880},null,{"$f":"E3-F3","v":628980268}]
[null,"INVERSION (Comprometido)",24296914848,24296914848,12625638325,12625638325]
[null,"DIFERENCIAS",{"$f":"C5-D5","v":0},null,{"$f":"E5-F5","v":0}]
[null,"Un nuevo contrato social y ambiental para la Bogotá del Siglo XXI",24296914848,24296914848,12625638325,12625638325]
[null,"DIFERENCIAS",{"$f":"C7-D7","v":0},null,{"$f":"E7-F7","v":0}]
[null,"Propósito 1 - Hacer un nuevo contrato social con igualdad de oportunidades para la inclusión social, productiva y política",10947044204,11374611204,7750383775,7750383775]
[null,"DIFERENCIAS",{"$f":"C9-D9","v":-427567000},null,{"$f":"E9-F9","v":0}]
[null,"Subsidios y transferencias para la equidad- Programa 1",4219260970,4219260970,4149404127,4149404127]
[null,"DIFERENCIAS",{"$f":"C11-D11","v":0},null,{"$f":"E11-F11","v":0}]
[null,"Proyecto 1815 ",4219260970,4219260970,4149404127,4149404127]
[null,"DIFERENCIAS",{"$f":"C13-D13","v":0},null,{"$f":"E13-F13","v":0}]
[null,"Sistema Distrital de Cuidado - Programa 6 ",2754038219,2754038219,982662438,982662438]
[null,"DIFERENCIAS",{"$f":"+C15-D15","v":0},null,{"$f":"+E15-F15","v":0}]
[null,"Proyecto 1671 ",1400924332,1400924332,665495105,665495105]
[null,"DIFERENCIAS",{"$f":"+C17-D17","v":0},null,{"$f":"+E17-F17","v":0}]
[null,"Proyecto 1710",507645592,507645592,128543334,128543334]
[null,"DIFERENCIAS",{"$f":"+C19-D19","v":0},null,{"$f":"+E19-F19","v":0}]
[null,"Proyecto 1855 ",243337030,243337030,53333333,53333333]
[null,"DIFERENCIAS",{"$f":"+C21-D21","v":0},null,{"$f":"+E21-F21","v":0}]
[null,"Proyecto 2024",602131265,602131265,135290666,135290666]
[null,"DIFERENCIAS",{"$f":"+C23-D23","v":0},null,{"$f":"+E23-F23","v":0}]
[null,"Educación inicial: Bases sólidas para la vida -  Programa 12 ",556345363,556345363,177234667,177234667]
[null,"DIFERENCIAS",{"$f":"+C25-D25","v":0},null,{"$f":"+E25-F25","v":0}]
[null,"Proyecto 1830 ",556345363,556345363,177234667,177234667]
[null,"DIFERENCIAS",{"$f":"+C27-D27","v":0},null,{"$f":"+E27-F27","v":0}]
[null,"Jóvenes con capacidades: Proyecto de vida para la ciudadanía, la innovación y el trabajo del siglo XXI - Programa 17",1259034000,1259034000,1250074000,1250074000]
[null,"DIFERENCIAS",{"$f":"+C29-D29","v":0},null,{"$f":"+E29-F29","v":0}]
[null,"Proyecto 1743 ",1259034000,1259034000,1250074000,1250074000]
[null,"DIFERENCIAS",{"$f":"+C31-D31","v":0},null,{"$f":"+E31-F31","v":0}]
[null,"Bogotá, referente en cultura, deporte, recreación y actividad física, con parques para el desarrollo y la salud - Programa 20 ",628481475,628481475,194000197,194000197]
[null,"DIFERENCIAS",{"$f":"+C33-D33","v":0},null,{"$f":"+E33-F33","v":0}]
[null,"Proyecto 1845 ",628481475,628481475,194000197,194000197]
[null,"DIFERENCIAS",{"$f":"+C35-D35","v":0},null,{"$f":"+E35-F35","v":0}]
[null,"Creación y vida cotidiana: Apropiación ciudadana del arte, la cultura y el patrimonio, para la democracia cultural - Programa 21 ",976916265,976916265,860185013,860185013]
[null,"DIFERENCIAS",{"$f":"+C37-D37","v":0},null,{"$f":"+E37-F37","v":0}]
[null,"Proyecto 1848 ",976916265,976916265,860185013,860185013]
[null,"DIFERENCIAS",{"$f":"+C39-D39","v":0},null,{"$f":"+E39-F39","v":0}]
[null,"Bogotá rural - Programa 23",292967912,292967912,67090000,67090000]
[null,"DIFERENCIAS",{"$f":"+C41-D41","v":0},null,{"$f":"+E41-F41","v":0}]
[null,"Proyecto 1827",292967912,292967912,67090000,67090000]
[null,"DIFERENCIAS",{"$f":"+C43-D43","v":0},null,{"$f":"+E43-F43","v":0}]
[null,"Bogotá región emprendedora e innovadora - Programa 24 ",260000000,260000000,69733333,69733333]
[null,"DIFERENCIAS",{"$f":"+C45-D45","v":0},null,{"$f":"+E45-F45","v":0}]
[null,"Proyecto 1631 ",260000000,260000000,69733333,69733333]
[null,"DIFERENCIAS",{"$f":"+C47-D47","v":0},null,{"$f":"+E47-F47","v":0}]
[null,"Propósito 2 - Cambiar nuestros hábitos de vida para reverdecer a Bogotá y adaptarnos y mitigar la crisis climática",1677325093,1677325093,471396801,471396801]
[null,"DIFERENCIAS",{"$f":"+C49-D49","v":0},null,{"$f":"+E49-F49","v":0}]
[null,"Cambio cultural para la gestión de la crisis climática - Programa 27 ",246329000,246329000,75016667,75016667]
[null,"DIFERENCIAS",{"$f":"+C51-D51","v":0},null,{"$f":"+E51-F51","v":0}]
[null,"Proyecto 7212 ",246329000,246329000,75016667,75016667]
[null,"DIFERENCIAS",{"$f":"+C53-D53","v":0},null,{"$f":"+E53-F53","v":0}]
[null,"Bogotá protectora de sus recursos naturales - Programa 28 ",252000000,252000000,73600000,73600000]
[null,"DIFERENCIAS",{"$f":"+C55-D55","v":0},null,{"$f":"+E55-F55","v":0}]
[null,"Proyecto 1715 ",252000000,252000000,73600000,73600000]
[null,"DIFERENCIAS",{"$f":"+C57-D57","v":0},null,{"$f":"+E57-F57","v":0}]
[null,"Eficiencia en la atención de emergencias - Programa 30 ",290907320,290907320,81040000,81040000]
[null,"DIFERENCIAS",{"$f":"+C59-D59","v":0},null,{"$f":"+E59-F59","v":0}]
[null,"Proyecto 1719",290907320,290907320,81040000,81040000]
[null,"DIFERENCIAS",{"$f":"+C61-D61","v":0},null,{"$f":"+E61-F61","v":0}]
[null,"Más árboles y más y mejor espacio público  - Programa 33",255230073,255230073,85178667,85178667]
[null,"DIFERENCIAS",{"$f":"+C63-D63","v":0},null,{"$f":"+E63-F63","v":0}]
[null,"Proyecto 1723 ",255230073,255230073,85178667,85178667]
[null,"DIFERENCIAS",{"$f":"+C65-D65","v":0},null,{"$f":"+E65-F65","v":0}]
[null,"Bogotá protectora de los animales - Programa 34 ",399929700,399929700,92378133,92378133]
[null,"DIFERENCIAS",{"$f":"+C67-D67","v":0},null,{"$f":"+E67-F67","v":0}]
[null,"Proyecto 1731 ",399929700,399929700,92378133,92378133]
[null,"DIFERENCIAS",{"$f":"+C69-D69","v":0},null,{"$f":"+E69-F69","v":0}]
[null,"Ecoeficiencia, reciclaje, manejo de residuos e inclusión de la población recicladora - Programa 38 ",232929000,232929000,64183334,64183334]
[null,"DIFERENCIAS",{"$f":"+C71-D71","v":0},null,{"$f":"+E71-F71","v":0}]
[null,"Proyecto 1728 ",232929000,232929000,64183334,64183334]
[null,"DIFERENCIAS",{"$f":"+C73-D73","v":0},null,{"$f":"+E73-F73","v":0}]
[null,"Propósito 3 - Inspirar confianza y legitimidad para vivir sin miedo y ser epicentro de cultura ciudadana, paz y reconciliación",1945755345,1518188345,540812267,540812267]
[null,"DIFERENCIAS",{"$f":"+C75-D75","v":427567000},null,{"$f":"+E75-F75","v":0}]
[null,"Bogotá territorio de paz y atención integral a las víctimas del conflicto armado - Programa 39 ",243991908,243991908,73675334,73675334]
[null,"DIFERENCIAS",{"$f":"+C77-D77","v":0},null,{"$f":"+E77-F77","v":0}]
[null,"Proyecto 2028",243991908,243991908,73675334,73675334]
[null,"DIFERENCIAS",{"$f":"+C79-D79","v":0},null,{"$f":"+E79-F79","v":0}]
[null,"Más mujeres viven una vida libre de violencias, se sienten seguras y acceden con confianza al sistema de justicia - Programa 40 ",560793333,133226333,110146933,110146933]
[null,"DIFERENCIAS",{"$f":"+C81-D81","v":427567000},null,{"$f":"+E81-F81","v":0}]
[null,"Proyecto 2035",560793333,133226333,110146933,110146933]
[null,"DIFERENCIAS",{"$f":"+C83-D83","v":427567000},null,{"$f":"+E83-F83","v":0}]
[null,"Cultura ciudadana para la confianza, la convivencia y la participación desde la vida cotidiana - Programa 43 ",282985051,282985051,75826933,75826933]
[null,"DIFERENCIAS",{"$f":"+C85-D85","v":0},null,{"$f":"+E85-F85","v":0}]
[null,"Proyecto 1735 ",282985051,282985051,75826933,75826933]
[null,"DIFERENCIAS",{"$f":"+C87-D87","v":0},null,{"$f":"+E87-F87","v":0}]
[null,"Espacio público más seguro y construido colectivamente - Programa 45 ",275000000,275000000,148589734,148589734]
[null,"DIFERENCIAS",{"$f":"+C89-D89","v":0},null,{"$f":"+E89-F89","v":0}]
[null,"Proyecto 1736",275000000,275000000,148589734,148589734]
[null,"DIFERENCIAS",{"$f":"+C91-D91","v":0},null,{"$f":"+E91-F91","v":0}]
[null,"Plataforma institucional para la seguridad y justicia - Programa 48",582985053,582985053,132573333,132573333]
[null,"DIFERENCIAS",{"$f":"+C93-D93","v":0},null,{"$f":"+E93-F93","v":0}]
[null,"Proyecto 1738",282985053,282985053,74243333,74243333]
[null,"DIFERENCIAS",{"$f":"+C95-D95","v":0},null,{"$f":"+E95-F95","v":0}]
[null,"Proyecto 1740 ",300000000,300000000,58330000,58330000]
[null,"DIFERENCIAS",{"$f":"+C97-D97","v":0},null,{"$f":"+E97-F97","v":0}]
[null,"Propósito 4 -Hacer de Bogotá Región un modelo de movilidad multimodal, incluyente y sostenible.",5215602130,5215602130,446983734,446983734]
[null,"DIFERENCIAS",{"$f":"+C99-D99","v":0},null,{"$f":"+E99-F99","v":0}]
[null,"Movilidad segura, sostenible y accesible - Programa 49 ",5215602130,5215602130,446983734,446983734]
[null,"DIFERENCIAS",{"$f":"+C101-D101","v":0},null,{"$f":"+E101-F101","v":0}]
[null,"Proyecto 1734",5215602130,5215602130,446983734,446983734]
[null,"DIFERENCIAS",{"$f":"+C103-D103","v":0},null,{"$f":"+E103-F103","v":0}]
[null,"Propósito 5 - Construir Bogotá Región con gobierno abierto, transparente y ciudadanía consciente",4511188076,4511188076,3416061748,3416061748]
[null,"DIFERENCIAS",{"$f":"+C105-D105","v":0},null,{"$f":"+E105-F105","v":0}]
[null,"Fortalecimiento de Cultura Ciudadana y su institucionalidad - Programa 55 ",313080001,313080001,23420001,23420001]
[null,"DIFERENCIAS",{"$f":"+C107-D107","v":0},null,{"$f":"+E107-F107","v":0}]
[null,"Proyecto 1739 ",313080001,313080001,23420001,23420001]
[null,"DIFERENCIAS",{"$f":"+C109-D109","v":0},null,{"$f":"+E109-F109","v":0}]
[null,"Gestión Pública Local - Programa 57 ",4198108075,4198108075,3392641747,3392641747]
[null,"DIFERENCIAS",{"$f":"+C111-D111","v":0},null,{"$f":"+E111-F111","v":0}]
[null,"Proyecto 1741 ",2565965213,2565965213,1988815047,1988815047]
[null,"DIFERENCIAS",{"$f":"+C113-D113","v":0},null,{"$f":"+E113-F113","v":0}]
[null,"Proyecto 1841",1632142862,1632142862,1403826700,1403826700]
[null,"DIFERENCIAS",{"$f":"+C115-D115","v":0},null,{"$f":"+E115-F115","v":0}]

{"sheet":"BOGDATA VS FORMATO VOL.2","index":2,"n_rows":116,"n_cols":6,"rows_kept":116,"cut":false,"hidden":false,"merged":[[10,0,35,0],[11,2,11,3],[11,4,11,5],[13,2,13,3],[13,4,13,5],[15,2,15,3],[0,0,0,5],[1,0,1,1],[3,2,3,3],[3,4,3,5],[5,2,5,3],[5,4,5,5],[15,4,15,5],[17,2,17,3],[17,4,17,5],[19,2,19,3],[19,4,19,5],[21,2,21,3],[21,4,21,5],[7,2,7,3],[7,4,7,5],[9,2,9,3],[9,4,9,5],[29,2,29,3],[29,4,29,5],[31,2,31,3],[31,4,31,5],[33,2,33,3],[33,4,33,5],[23,2,23,3],[23,4,23,5],[25,2,25,3],[25,4,25,5],[27,2,27,3],[27,4,27,5],[41,2,41,3],[41,4,41,5],[43,2,43,3],[43,4,43,5],[45,2,45,3],[45,4,45,5],[35,2,35,3],[35,4,35,5],[37,2,37,3],[37,4,37,5],[39,2,39,3],[39,4,39,5],[53,2,53,3],[53,4,53,5],[55,2,55,3],[55,4,55,5],[57,2,57,3],[57,4,57,5],[47,2,47,3],[47,4,47,5],[49,2,49,3],[49,4,49,5],[51,2,51,3],[51,4,51,5],[65,2,65,3],[65,4,65,5],[67,2,67,3],[67,4,67,5],[69,2,69,3],[69,4,69,5],[59,2,59,3],[59,4,59,5],[61,2,61,3],[61,4,61,5],[63,2,63,3],[63,4,63,5],[77,2,77,3],[77,4,77,5],[79,2,79,3],[79,4,79,5],[81,2,81,3],[81,4,81,5],[71,2,71,3],[71,4,71,5],[73,2,73,3],[73,4,73,5],[75,2,75,3],[75,4,75,5],[89,2,89,3],[89,4,89,5],[91,2,91,3],[91,4,91,5],[93,2,93,3],[93,4,93,5],[83,2,83,3],[83,4,83,5],[85,2,85,3],[85,4,85,5],[87,2,87,3],[87,4,87,5],[101,2,101,3],[101,4,101,5],[103,2,103,3],[103,4,103,5],[105,2,105,3],[105,4,105,5],[95,2,95,3],[95,4,95,5],[97,2,97,3],[97,4,97,5],[99,2,99,3],[99,4,99,5],[113,2,113,3],[113,4,113,5],[115,2,115,3],[115,4,115,5],[107,2,107,3],[107,4,107,5],[109,2,109,3],[109,4,109,5],[111,2,111,3],[111,4,111,5]]}
["BOGDATA- CUADRO ANALISIS- CHAPINERO "]
[null,null,"COMPROMISOS ACUMULADOS BOGDATA","VALOR FINAL","ACUMULADO GIROS BOGDATA","GIROS"]
[null,"FUNCIONAMIENTO",2967215043,2292232163,2245441934,1637631580]
[null,"DIFERENCIAS",{"$f":"C3-D3","v":674982880},null,{"$f":"E3-F3","v":607810354}]
[null,"INVERSION (Comprometido)",24296914848,24296914848,12625638325,11888812485]
[null,"DIFERENCIAS",{"$f":"C5-D5","v":0},null,{"$f":"E5-F5","v":736825840}]
[null,"Un nuevo contrato social y ambiental para la Bogotá del Siglo XXI",24296914848,24296914848,12625638325,11888812485]
[null,"DIFERENCIAS",{"$f":"C7-D7","v":0},null,{"$f":"E7-F7","v":736825840}]
[null,"Propósito 1 - Hacer un nuevo contrato social con igualdad de oportunidades para la inclusión social, productiva y política",10947044204,11374611204,7750383775,5352252062]
[null,"DIFERENCIAS",{"$f":"C9-D9","v":-427567000},null,{"$f":"E9-F9","v":2398131713}]
[null,"Subsidios y transferencias para la equidad- Programa 1",4219260970,4219260970,4149404127,3955350970]
[null,"DIFERENCIAS",{"$f":"C11-D11","v":0},null,{"$f":"E11-F11","v":194053157}]
[null,"Proyecto 1815 ",4219260970,4219260970,4149404127,3955350970]
[null,"DIFERENCIAS",{"$f":"C13-D13","v":0},null,{"$f":"E13-F13","v":194053157}]
[null,"Sistema Distrital de Cuidado - Programa 6 ",2754038219,3181605219,982662438,494057956]
[null,"DIFERENCIAS",{"$f":"+C15-D15","v":-427567000},null,{"$f":"+E15-F15","v":488604482}]
[null,"Proyecto 1671 ",1400924332,1400924332,665495105,178678622]
[null,"DIFERENCIAS",{"$f":"+C17-D17","v":0},null,{"$f":"+E17-F17","v":486816483}]
[null,"Proyecto 1710",507645592,507645592,128543334,122880000]
[null,"DIFERENCIAS",{"$f":"+C19-D19","v":0},null,{"$f":"+E19-F19","v":5663334}]
[null,"Proyecto 1855 ",243337030,243337030,53333333,53166667]
[null,"DIFERENCIAS",{"$f":"+C21-D21","v":0},null,{"$f":"+E21-F21","v":166666}]
[null,"Proyecto 2024",602131265,602131265,135290666,139332667]
[null,"DIFERENCIAS",{"$f":"+C23-D23","v":0},null,{"$f":"+E23-F23","v":-4042001}]
[null,"Educación inicial: Bases sólidas para la vida -  Programa 12 ",556345363,556345363,177234667,91346667]
[null,"DIFERENCIAS",{"$f":"+C25-D25","v":0},null,{"$f":"+E25-F25","v":85888000}]
[null,"Proyecto 1830 ",556345363,556345363,177234667,91346667]
[null,"DIFERENCIAS",{"$f":"+C27-D27","v":0},null,{"$f":"+E27-F27","v":85888000}]
[null,"Jóvenes con capacidades: Proyecto de vida para la ciudadanía, la innovación y el trabajo del siglo XXI - Programa 17",1259034000,1259034000,1250074000,113777533]
[null,"DIFERENCIAS",{"$f":"+C29-D29","v":0},null,{"$f":"+E29-F29","v":1136296467}]
[null,"Proyecto 1743 ",1259034000,1259034000,1250074000,113777533]
[null,"DIFERENCIAS",{"$f":"+C31-D31","v":0},null,{"$f":"+E31-F31","v":1136296467}]
[null,"Bogotá, referente en cultura, deporte, recreación y actividad física, con parques para el desarrollo y la salud - Programa 20 ",628481475,628481475,194000197,173598990]
[null,"DIFERENCIAS",{"$f":"+C33-D33","v":0},null,{"$f":"+E33-F33","v":20401207}]
[null,"Proyecto 1845 ",628481475,628481475,194000197,173598990]
[null,"DIFERENCIAS",{"$f":"+C35-D35","v":0},null,{"$f":"+E35-F35","v":20401207}]
[null,"Creación y vida cotidiana: Apropiación ciudadana del arte, la cultura y el patrimonio, para la democracia cultural - Programa 21 ",976916265,976916265,860185013,334006346]
[null,"DIFERENCIAS",{"$f":"+C37-D37","v":0},null,{"$f":"+E37-F37","v":526178667}]
[null,"Proyecto 1848 ",976916265,976916265,860185013,334006346]
[null,"DIFERENCIAS",{"$f":"+C39-D39","v":0},null,{"$f":"+E39-F39","v":526178667}]
[null,"Bogotá rural - Programa 23",292967912,292967912,67090000,75313600]
[null,"DIFERENCIAS",{"$f":"+C41-D41","v":0},null,{"$f":"+E41-F41","v":-8223600}]
[null,"Proyecto 1827",292967912,292967912,67090000,75313600]
[null,"DIFERENCIAS",{"$f":"+C43-D43","v":0},null,{"$f":"+E43-F43","v":-8223600}]
[null,"Bogotá región emprendedora e innovadora - Programa 24 ",260000000,260000000,69733333,114800000]
[null,"DIFERENCIAS",{"$f":"+C45-D45","v":0},null,{"$f":"+E45-F45","v":-45066667}]
[null,"Proyecto 1631 ",260000000,260000000,69733333,114800000]
[null,"DIFERENCIAS",{"$f":"+C47-D47","v":0},null,{"$f":"+E47-F47","v":-45066667}]
[null,"Propósito 2 - Cambiar nuestros hábitos de vida para reverdecer a Bogotá y adaptarnos y mitigar la crisis climática",1677325093,1677325093,471396801,499569334]
[null,"DIFERENCIAS",{"$f":"+C49-D49","v":0},null,{"$f":"+E49-F49","v":-28172533}]
[null,"Cambio cultural para la gestión de la crisis climática - Programa 27 ",246329000,240329000,75016667,80000000]
[null,"DIFERENCIAS",{"$f":"+C51-D51","v":6000000},null,{"$f":"+E51-F51","v":-4983333}]
[null,"Proyecto 7212 ",246329000,240329000,75016667,80000000]
[null,"DIFERENCIAS",{"$f":"+C53-D53","v":6000000},null,{"$f":"+E53-F53","v":-4983333}]
[null,"Bogotá protectora de sus recursos naturales - Programa 28 ",252000000,252000000,73600000,74753333]
[null,"DIFERENCIAS",{"$f":"+C55-D55","v":0},null,{"$f":"+E55-F55","v":-1153333}]
[null,"Proyecto 1715 ",252000000,252000000,73600000,74753333]
[null,"DIFERENCIAS",{"$f":"+C57-D57","v":0},null,{"$f":"+E57-F57","v":-1153333}]
[null,"Eficiencia en la atención de emergencias - Programa 30 ",290907320,290907320,81040000,73120000]
[null,"DIFERENCIAS",{"$f":"+C59-D59","v":0},null,{"$f":"+E59-F59","v":7920000}]
[null,"Proyecto 1719",290907320,290907320,81040000,73120000]
[null,"DIFERENCIAS",{"$f":"+C61-D61","v":0},null,{"$f":"+E61-F61","v":7920000}]
[null,"Más árboles y más y mejor espacio público  - Programa 33",255230073,255230073,85178667,74264667]
[null,"DIFERENCIAS",{"$f":"+C63-D63","v":0},null,{"$f":"+E63-F63","v":10914000}]
[null,"Proyecto 1723 ",255230073,255230073,85178667,74264667]
[null,"DIFERENCIAS",{"$f":"+C65-D65","v":0},null,{"$f":"+E65-F65","v":10914000}]
[null,"Bogotá protectora de los animales - Programa 34 ",399929700,399929700,92378133,113404667]
[null,"DIFERENCIAS",{"$f":"+C67-D67","v":0},null,{"$f":"+E67-F67","v":-21026534}]
[null,"Proyecto 1731 ",399929700,399929700,92378133,113404667]
[null,"DIFERENCIAS",{"$f":"+C69-D69","v":0},null,{"$f":"+E69-F69","v":-21026534}]
[null,"Ecoeficiencia, reciclaje, manejo de residuos e inclusión de la población recicladora - Programa 38 ",232929000,238929000,64183334,84026667]
[null,"DIFERENCIAS",{"$f":"+C71-D71","v":-6000000},null,{"$f":"+E71-F71","v":-19843333}]
[null,"Proyecto 1728 ",232929000,232929000,64183334,78026667]
[null,"DIFERENCIAS",{"$f":"+C73-D73","v":0},null,{"$f":"+E73-F73","v":-13843333}]
[null,"Propósito 3 - Inspirar confianza y legitimidad para vivir sin miedo y ser epicentro de cultura ciudadana, paz y reconciliación",1945755345,1518188345,540812267,1041990958]
[null,"DIFERENCIAS",{"$f":"+C75-D75","v":427567000},null,{"$f":"+E75-F75","v":-501178691}]
[null,"Bogotá territorio de paz y atención integral a las víctimas del conflicto armado - Programa 39 ",243991908,243991908,73675334,86240000]
[null,"DIFERENCIAS",{"$f":"+C77-D77","v":0},null,{"$f":"+E77-F77","v":-12564666}]
[null,"Proyecto 2028",243991908,243991908,73675334,86240000]
[null,"DIFERENCIAS",{"$f":"+C79-D79","v":0},null,{"$f":"+E79-F79","v":-12564666}]
[null,"Más mujeres viven una vida libre de violencias, se sienten seguras y acceden con confianza al sistema de justicia - Programa 40 ",560793333,133226333,110146933,105240000]
[null,"DIFERENCIAS",{"$f":"+C81-D81","v":427567000},null,{"$f":"+E81-F81","v":4906933}]
[null,"Proyecto 2035",560793333,133226333,110146933,105240000]
[null,"DIFERENCIAS",{"$f":"+C83-D83","v":427567000},null,{"$f":"+E83-F83","v":4906933}]
[null,"Cultura ciudadana para la confianza, la convivencia y la participación desde la vida cotidiana - Programa 43 ",282985051,282985051,75826933,79079392]
[null,"DIFERENCIAS",{"$f":"+C85-D85","v":0},null,{"$f":"+E85-F85","v":-3252459}]
[null,"Proyecto 1735 ",282985051,282985051,75826933,79079392]
[null,"DIFERENCIAS",{"$f":"+C87-D87","v":0},null,{"$f":"+E87-F87","v":-3252459}]
[null,"Espacio público más seguro y construido colectivamente - Programa 45 ",275000000,275000000,148589734,157016327]
[null,"DIFERENCIAS",{"$f":"+C89-D89","v":0},null,{"$f":"+E89-F89","v":-8426593}]
[null,"Proyecto 1736",275000000,275000000,148589734,157016327]
[null,"DIFERENCIAS",{"$f":"+C91-D91","v":0},null,{"$f":"+E91-F91","v":-8426593}]
[null,"Plataforma institucional para la seguridad y justicia - Programa 48",582985053,582985053,132573333,614415239]
[null,"DIFERENCIAS",{"$f":"+C93-D93","v":0},null,{"$f":"+E93-F93","v":-481841906}]
[null,"Proyecto 1738",282985053,282985053,74243333,83680134]
[null,"DIFERENCIAS",{"$f":"+C95-D95","v":0},null,{"$f":"+E95-F95","v":-9436801}]
[null,"Proyecto 1740 ",300000000,300000000,58330000,530735105]
[null,"DIFERENCIAS",{"$f":"+C97-D97","v":0},null,{"$f":"+E97-F97","v":-472405105}]
[null,"Propósito 4 -Hacer de Bogotá Región un modelo de movilidad multimodal, incluyente y sostenible.",5215602130,5215602130,446983734,1679976301]
[null,"DIFERENCIAS",{"$f":"+C99-D99","v":0},null,{"$f":"+E99-F99","v":-1232992567}]
[null,"Movilidad segura, sostenible y accesible - Programa 49 ",5215602130,5215602130,446983734,1679976301]
[null,"DIFERENCIAS",{"$f":"+C101-D101","v":0},null,{"$f":"+E101-F101","v":-1232992567}]
[null,"Proyecto 1734",5215602130,5215602130,446983734,1679976301]
[null,"DIFERENCIAS",{"$f":"+C103-D103","v":0},null,{"$f":"+E103-F103","v":-1232992567}]
[null,"Propósito 5 - Construir Bogotá Región con gobierno abierto, transparente y ciudadanía consciente",4511188076,4511188076,3416061748,3315023830]
[null,"DIFERENCIAS",{"$f":"+C105-D105","v":0},null,{"$f":"+E105-F105","v":101037918}]
[null,"Fortalecimiento de Cultura Ciudadana y su institucionalidad - Programa 55 ",313080001,313080001,23420001,24733334]
[null,"DIFERENCIAS",{"$f":"+C107-D107","v":0},null,{"$f":"+E107-F107","v":-1313333}]
[null,"Proyecto 1739 ",313080001,313080001,23420001,24733334]
[null,"DIFERENCIAS",{"$f":"+C109-D109","v":0},null,{"$f":"+E109-F109","v":-1313333}]
[null,"Gestión Pública Local - Programa 57 ",4198108075,4198108075,3392641747,3290290496]
[null,"DIFERENCIAS",{"$f":"+C111-D111","v":0},null,{"$f":"+E111-F111","v":102351251}]
[null,"Proyecto 1741 ",2565965213,2565965213,1988815047,1938372919]
[null,"DIFERENCIAS",{"$f":"+C113-D113","v":0},null,{"$f":"+E113-F113","v":50442128}]
[null,"Proyecto 1841",1632142862,1632142862,1403826700,1351917577]
[null,"DIFERENCIAS",{"$f":"+C115-D115","v":0},null,{"$f":"+E115-F115","v":51909123}]

{"sheet":"BOGDATA VS FORMATO","index":3,"n_rows":114,"n_cols":6,"rows_kept":114,"cut":false,"hidden":true,"merged":[[113,2,113,3],[113,4,113,5],[107,2,107,3],[107,4,107,5],[109,2,109,3],[109,4,109,5],[111,2,111,3],[111,4,111,5],[101,2,101,3],[101,4,101,5],[103,2,103,3],[103,4,103,5],[105,2,105,3],[105,4,105,5],[97,2,97,3],[97,4,97,5],[99,2,99,3],[99,4,99,5],[91,2,91,3],[91,4,91,5],[93,2,93,3],[93,4,93,5],[95,2,95,3],[95,4,95,5],[85,2,85,3],[85,4,85,5],[87,2,87,3],[87,4,87,5],[89,2,89,3],[89,4,89,5],[79,2,79,3],[79,4,79,5],[81,2,81,3],[81,4,81,5],[83,2,83,3],[83,4,83,5],[73,2,73,3],[73,4,73,5],[75,2,75,3],[75,4,75,5],[77,2,77,3],[77,4,77,5],[67,2,67,3],[67,4,67,5],[69,2,69,3],[69,4,69,5],[71,2,71,3],[71,4,71,5],[61,2,61,3],[61,4,61,5],[63,2,63,3],[63,4,63,5],[65,2,65,3],[65,4,65,5],[55,2,55,3],[55,4,55,5],[57,2,57,3],[57,4,57,5],[59,2,59,3],[59,4,59,5],[47,2,47,3],[47,4,47,5],[35,2,35,3],[35,4,35,5],[37,2,37,3],[37,4,37,5],[49,2,49,3],[49,4,49,5],[53,2,53,3],[53,4,53,5],[51,2,51,3],[51,4,51,5],[41,2,41,3],[41,4,41,5],[43,2,43,3],[43,4,43,5],[45,2,45,3],[45,4,45,5],[39,2,39,3],[39,4,39,5],[31,2,31,3],[31,4,31,5],[33,2,33,3],[33,4,33,5],[11,2,11,3],[23,2,23,3],[23,4,23,5],[25,2,25,3],[25,4,25,5],[27,2,27,3],[27,4,27,5],[0,0,0,5],[1,0,1,1],[3,2,3,3],[3,4,3,5],[5,2,5,3],[5,4,5,5],[10,0,33,0],[13,2,13,3],[13,4,13,5],[15,2,15,3],[15,4,15,5],[11,4,11,5],[17,2,17,3],[17,4,17,5],[19,2,19,3],[19,4,19,5],[21,2,21,3],[21,4,21,5],[7,2,7,3],[7,4,7,5],[9,2,9,3],[9,4,9,5],[29,2,29,3],[29,4,29,5]]}
["BOGDATA- CUADRO ANALISIS- DASC"]
[null,null,"COMPROMISOS ACUMULADOS BOGDATA","VALOR FINAL","ACUMULADO GIROS BOGDATA","GIROS"]
[null,"FUNCIONAMIENTO",2967215043,2292232163,2245441934,1637631580]
[null,"DIFERENCIAS",{"$f":"C3-D3","v":674982880},null,{"$f":"E3-F3","v":607810354}]
[null,"INVERSION (Comprometido)",24296914848,24296914848,12625638325,11888812485]
[null,"DIFERENCIAS",{"$f":"C5-D5","v":0},null,{"$f":"E5-F5","v":736825840}]
[null,"Un nuevo contrato social y ambiental para la Bogotá del Siglo XXI",24296914848,24296914848,12625638325,11888812485]
[null,"DIFERENCIAS",{"$f":"C7-D7","v":0},null,{"$f":"E7-F7","v":736825840}]
[null,"Propósito 1 - Hacer un nuevo contrato social con igualdad de oportunidades para la inclusión social, productiva y política",10947044204,11374611204,7750383775,5352252062]
[null,"DIFERENCIAS",{"$f":"C9-D9","v":-427567000},null,{"$f":"E9-F9","v":2398131713}]
[null,"Subsidios y transferencias para la equidad- Programa 1",4219260970,104440000,4149404127,84120000]
[null,"DIFERENCIAS",{"$f":"C11-D11","v":4114820970},null,{"$f":"+E11-F11","v":4065284127}]
[null,"Sistema Distrital de Cuidado - Programa 6 ",2754038219,1685955443,982662438,595743101]
[null,"DIFERENCIAS",{"$f":"+C13-D13","v":1068082776},null,{"$f":"+E13-F13","v":386919337}]
[null,"Proyecto 1671 ",1400924332,831046875,665495105,145802599]
[null,"DIFERENCIAS",{"$f":"+C15-D15","v":569877457},null,{"$f":"+E15-F15","v":519692506}]
[null,"Proyecto 1710",507645592,126876666,128543334,120346667]
[null,"DIFERENCIAS",{"$f":"+C17-D17","v":380768926},null,{"$f":"+E17-F17","v":8196667}]
[null,"Proyecto 1855 ",243337030,45000000,53333333,45000000]
[null,"DIFERENCIAS",{"$f":"+C19-D19","v":198337030},null,{"$f":"+E19-F19","v":8333333}]
[null,"Proyecto 2024",602131265,151018568,135290666,133506000]
[null,"DIFERENCIAS",{"$f":"+C21-D21","v":451112697},null,{"$f":"+E21-F21","v":1784666}]
[null,"Educación inicial: Bases sólidas para la vida -  Programa 12 ",556345363,110280000,177234667,92413333]
[null,"DIFERENCIAS",{"$f":"+C23-D23","v":446065363},null,{"$f":"+E23-F23","v":84821334}]
[null,"Proyecto 1830 ",556345363,96480000,177234667,89880000]
[null,"DIFERENCIAS",{"$f":"+C25-D25","v":459865363},null,{"$f":"+E25-F25","v":87354667}]
[null,"Jóvenes con capacidades: Proyecto de vida para la ciudadanía, la innovación y el trabajo del siglo XXI - Programa 17",1259034000,1454434000,1250074000,117020000]
[null,"DIFERENCIAS",{"$f":"+C27-D27","v":-195400000},null,{"$f":"+E27-F27","v":1133054000}]
[null,"Proyecto 1743 ",1259034000,1249434000,1250074000,109833333]
[null,"DIFERENCIAS",{"$f":"+C29-D29","v":9600000},null,{"$f":"+E29-F29","v":1140240667}]
[null,"Bogotá, referente en cultura, deporte, recreación y actividad física, con parques para el desarrollo y la salud - Programa 20 ",628481475,644000318,194000197,177215657]
[null,"DIFERENCIAS",{"$f":"+C31-D31","v":-15518843},null,{"$f":"+E31-F31","v":16784540}]
[null,"Proyecto 1845 ",628481475,617040318,194000197,173598990]
[null,"DIFERENCIAS",{"$f":"+C33-D33","v":11441157},null,{"$f":"+E33-F33","v":20401207}]
[null,"Creación y vida cotidiana: Apropiación ciudadana del arte, la cultura y el patrimonio, para la democracia cultural - Programa 21 ",976916265,894079599,860185013,336709679]
[null,"DIFERENCIAS",{"$f":"+C35-D35","v":82836666},null,{"$f":"+E35-F35","v":523475334}]
[null,"Proyecto 1848 ",976916265,864582932,860185013,325839679]
[null,"DIFERENCIAS",{"$f":"+C37-D37","v":112333333},null,{"$f":"+E37-F37","v":534345334}]
[null,"Bogotá rural - Programa 23",292967912,353509000,67090000,121380000]
[null,"DIFERENCIAS",{"$f":"+C39-D39","v":-60541088},null,{"$f":"+E39-F39","v":-54290000}]
[null,"Proyecto 1827",292967912,54480000,67090000,54480000]
[null,"DIFERENCIAS",{"$f":"+C41-D41","v":238487912},null,{"$f":"+E41-F41","v":12610000}]
[null,"Bogotá región emprendedora e innovadora - Programa 24 ",260000000,479831247,69733333,78326800]
[null,"DIFERENCIAS",{"$f":"+C43-D43","v":-219831247},null,{"$f":"+E43-F43","v":-8593467}]
[null,"Proyecto 1931 ",260000000,240037912,69733333,64800000]
[null,"DIFERENCIAS",{"$f":"+C45-D45","v":19962088},null,{"$f":"+E45-F45","v":4933333}]
[null,"Propósito 2 - Cambiar nuestros hábitos de vida para reverdecer a Bogotá y adaptarnos y mitigar la crisis climática",1677325093,536872001,471396801,480144994]
[null,"DIFERENCIAS",{"$f":"+C47-D47","v":1140453092},null,{"$f":"+E47-F47","v":-8748193}]
[null,"Cambio cultural para la gestión de la crisis climática - Programa 27 ",246329000,70900000,75016667,71788667]
[null,"DIFERENCIAS",{"$f":"+C49-D49","v":175429000},null,{"$f":"+E49-F49","v":3228000}]
[null,"Proyecto 7212 ",246329000,65400000,75016667,65400000]
[null,"DIFERENCIAS",{"$f":"+C51-D51","v":180929000},null,{"$f":"+E51-F51","v":9616667}]
[null,"Bogotá protectora de sus recursos naturales - Programa 28 ",252000000,90550000,73600000,71354460]
[null,"DIFERENCIAS",{"$f":"+C53-D53","v":161450000},null,{"$f":"+E53-F53","v":2245540}]
[null,"Proyecto 1715 ",252000000,64800000,73600000,64800000]
[null,"DIFERENCIAS",{"$f":"+C55-D55","v":187200000},null,{"$f":"+E55-F55","v":8800000}]
[null,"Eficiencia en la atención de emergencias - Programa 30 ",290907320,81700000,81040000,78926667]
[null,"DIFERENCIAS",{"$f":"+C57-D57","v":209207320},null,{"$f":"+E57-F57","v":2113333}]
[null,"Proyecto 1719",290907320,70200000,81040000,70040000]
[null,"DIFERENCIAS",{"$f":"+C59-D59","v":220707320},null,{"$f":"+E59-F59","v":11000000}]
[null,"Más árboles y más y mejor espacio público  - Programa 33",255230073,94273334,85178667,76736667]
[null,"DIFERENCIAS",{"$f":"+C61-D61","v":160956739},null,{"$f":"+E61-F61","v":8442000}]
[null,"Proyecto 1723 ",255230073,77123334,85178667,70910000]
[null,"DIFERENCIAS",{"$f":"+C63-D63","v":178106739},null,{"$f":"+E63-F63","v":14268667}]
[null,"Bogotá protectora de los animales - Programa 34 ",399929700,112948667,92378133,108358533]
[null,"DIFERENCIAS",{"$f":"+C65-D65","v":286981033},null,{"$f":"+E65-F65","v":-15980400}]
[null,"Proyecto 1731 ",399929700,88404667,92378133,98511333]
[null,"DIFERENCIAS",{"$f":"+C67-D67","v":311525033},null,{"$f":"+E67-F67","v":-6133200}]
[null,"Ecoeficiencia, reciclaje, manejo de residuos e inclusión de la población recicladora - Programa 38 ",232929000,86500000,64183334,72980000]
[null,"DIFERENCIAS",{"$f":"+C69-D69","v":146429000},null,{"$f":"+E69-F69","v":-8796666}]
[null,"Proyecto 1728 ",232929000,63000000,64183334,63000000]
[null,"DIFERENCIAS",{"$f":"+C71-D71","v":169929000},null,{"$f":"+E71-F71","v":1183334}]
[null,"Propósito 3 - Inspirar confianza y legitimidad para vivir sin miedo y ser epicentro de cultura ciudadana, paz y reconciliación",1945755345,1059294566,540812267,1007523030]
[null,"DIFERENCIAS",{"$f":"+C73-D73","v":886460779},null,{"$f":"+E73-F73","v":-466710763}]
[null,"Bogotá territorio de paz y atención integral a las víctimas del conflicto armado - Programa 39 ",243991908,74360000,73675334,75800000]
[null,"DIFERENCIAS",{"$f":"+C75-D75","v":169631908},null,{"$f":"+E75-F75","v":-2124666}]
[null,"Proyecto 2028",243991908,64360000,73675334,75800000]
[null,"DIFERENCIAS",{"$f":"+C77-D77","v":179631908},null,{"$f":"+E77-F77","v":-2124666}]
[null,"Más mujeres viven una vida libre de violencias, se sienten seguras y acceden con confianza al sistema de justicia - Programa 40 ",560793333,112913333,110146933,95640000]
[null,"DIFERENCIAS",{"$f":"+C79-D79","v":447880000},null,{"$f":"+E79-F79","v":14506933}]
[null,"Proyecto 2035",560793333,112913333,110146933,95640000]
[null,"DIFERENCIAS",{"$f":"+C81-D81","v":447880000},null,{"$f":"+E81-F81","v":14506933}]
[null,"Cultura ciudadana para la confianza, la convivencia y la participación desde la vida cotidiana - Programa 43 ",282985051,288636000,75826933,79912725]
[null,"DIFERENCIAS",{"$f":"+C83-D83","v":-5650949},null,{"$f":"+E83-F83","v":-4085792}]
[null,"Proyecto 1735 ",282985051,276386000,75826933,72912725]
[null,"DIFERENCIAS",{"$f":"+C85-D85","v":6599051},null,{"$f":"+E85-F85","v":2914208}]
[null,"Espacio público más seguro y construido colectivamente - Programa 45 ",275000000,164983333,148589734,158233333]
[null,"DIFERENCIAS",{"$f":"+C87-D87","v":110016667},null,{"$f":"+E87-F87","v":-9643599}]
[null,"Proyecto 1736",275000000,128400000,148589734,137400000]
[null,"DIFERENCIAS",{"$f":"+C89-D89","v":146600000},null,{"$f":"+E89-F89","v":11189734}]
[null,"Plataforma institucional para la seguridad y justicia - Programa 48",582985053,418401900,132573333,597936972]
[null,"DIFERENCIAS",{"$f":"+C91-D91","v":164583153},null,{"$f":"+E91-F91","v":-465363639}]
[null,"Proyecto 1738",282985053,63900000,74243333,63900000]
[null,"DIFERENCIAS",{"$f":"+C93-D93","v":219085053},null,{"$f":"+E93-F93","v":10343333}]
[null,"Proyecto 1740 ",300000000,62700000,58330000,520651772]
[null,"DIFERENCIAS",{"$f":"+C95-D95","v":237300000},null,{"$f":"+E95-F95","v":-462321772}]
[null,"Propósito 4 -Hacer de Bogotá Región un modelo de movilidad multimodal, incluyente y sostenible.",5215602130,4736856114,446983734,1605418176]
[null,"DIFERENCIAS",{"$f":"+C97-D97","v":478746016},null,{"$f":"+E97-F97","v":-1158434442}]
[null,"Movilidad segura, sostenible y accesible - Programa 49 ",5215602130,4736856114,446983734,1605418176]
[null,"DIFERENCIAS",{"$f":"+C99-D99","v":478746016},null,{"$f":"+E99-F99","v":-1158434442}]
[null,"Proyecto 1734",5215602130,4671579247,446983734,1571610667]
[null,"DIFERENCIAS",{"$f":"+C101-D101","v":544022883},null,{"$f":"+E101-F101","v":-1124626933}]
[null,"Propósito 5 - Construir Bogotá Región con gobierno abierto, transparente y ciudadanía consciente",4511188076,4331681100,3416061748,3291236055]
[null,"DIFERENCIAS",{"$f":"+C103-D103","v":179506976},null,{"$f":"+E103-F103","v":124825693}]
[null,"Fortalecimiento de Cultura Ciudadana y su institucionalidad - Programa 55 ",313080001,14833334,23420001,14833334]
[null,"DIFERENCIAS",{"$f":"+C105-D105","v":298246667},null,{"$f":"+E105-F105","v":8586667}]
[null,"Proyecto 1739 ",313080001,14833334,23420001,14833334]
[null,"DIFERENCIAS",{"$f":"+C107-D107","v":298246667},null,{"$f":"+E107-F107","v":8586667}]
[null,"Gestión Pública Local - Programa 57 ",4198108075,4316847766,3392641747,3276402721]
[null,"DIFERENCIAS",{"$f":"+C109-D109","v":-118739691},null,{"$f":"+E109-F109","v":116239026}]
[null,"Proyecto 1741 ",2565965213,2064571113,1988815047,1862755986]
[null,"DIFERENCIAS",{"$f":"+C111-D111","v":501394100},null,{"$f":"+E111-F111","v":126059061}]
[null,"Proyecto 1841",1632142862,1461154662,1403826700,1291670067]
[null,"DIFERENCIAS",{"$f":"+C113-D113","v":170988200},null,{"$f":"+E113-F113","v":112156633}]

{"sheet":"WP REVISION ","index":4,"n_rows":6,"n_cols":5,"rows_kept":6,"cut":false,"hidden":true,"merged":[[0,0,0,4]]}
[" "]
["Parte","Sección","Ítem ","Pruebas a realizar","Incluir el nombre de la entidad"]
["B",10,"Número de proponentes ","Con un filtro en la columna de la SECCIÓN 5 Modalidad de selección escoja las modalidades de Licitación Pública, Selección Abreviada o Concurso de Méritos y verifique no haya celdas en blanco en la columna de la SECCIÓN 10 Número de proponentes.","No se ha diligenciado las filas 255, 293, 353 "]
["C",15,"Número de adiciones","Verifique que el número de adicciones se haya diligenciado tanto para los contratos como para los contratos de otras vigencias pasadas que tengan adiciones en 2022.","No se ha diligenciado el numero de adiciones de la celda 360, 361, 362, 363, 364, 265, 366, 367,369,370, y 371"]
["D",21,"Fecha de terminación (DD/MM/AAAA)","Verifique que la fecha de suscripción se encuentre consignada para todos los contratos y el formato de la fecha sea (DD/MM/AAAA)","No se encuentran diligenciadas las fechas de  las celdas 360, 361, 362, 363, 364, 365, 366,367, 369, 370, 371 "]
["D",22,"Plazo en días","Verifique que no haya celdas en blanco, excepto para la fila de OTROS GASTOS.","No se encuentran diligenciadas las fechas de  las celdas 167, 168, 172, 173, 360, 361, 362, 363, 364, 365, 366, 367, 369, 370, 371. "]

{"sheet":"Proposito_programa","index":5,"n_rows":59,"n_cols":5,"rows_kept":59,"cut":false,"hidden":false,"merged":[]}
[]
[null,"PDD","No. Programa","Programa","Propósito"]
["Acuerdo 761 2020","Un Nuevo Contrato Social y Ambiental para la Bogotá del Siglo XXI",1,"Subsidios y transferencias para la equidad","Propósito 1: Hacer un nuevo contrato social para incrementar la inclusión social, productiva y política"]
["Pag. 51","Un Nuevo Contrato Social y Ambiental para la Bogotá del Siglo XXI",{"$f":"+C3+1","v":2},"Igualdad de oportunidades y desarrollo de capacidades para las mujeres","Propósito 1: Hacer un nuevo contrato social para incrementar la inclusión social, productiva y política"]
[null,"Un Nuevo Contrato Social y Ambiental para la Bogotá del Siglo XXI",{"$f":"+C4+1","v":3},"Movilidad social integral","Propósito 1: Hacer un nuevo contrato social para incrementar la inclusión social, productiva y política"]
[null,"Un Nuevo Contrato Social y Ambiental para la Bogotá del Siglo XXI",4,"Prevención de la exclusión por razones étnicas, religiosas, sociales, políticas y de orientación sexual","Propósito 1: Hacer un nuevo contrato social para incrementar la inclusión social, productiva y política"]
[null,"Un Nuevo Contrato Social y Ambiental para la Bogotá del Siglo XXI",5,"Promoción de la igualdad, el desarrollo de capacidades y el reconocimiento de las mujeres","Propósito 1: Hacer un nuevo contrato social para incrementar la inclusión social, productiva y política"]
[null,"Un Nuevo Contrato Social y Ambiental para la Bogotá del Siglo XXI",6,"Sistema Distrital de Cuidado","Propósito 1: Hacer un nuevo contrato social para incrementar la inclusión social, productiva y política"]
[null,"Un Nuevo Contrato Social y Ambiental para la Bogotá del Siglo XXI",7,"Mejora de la gestión de instituciones de salud","Propósito 1: Hacer un nuevo contrato social para incrementar la inclusión social, productiva y política"]
[null,"Un Nuevo Contrato Social y Ambiental para la Bogotá del Siglo XXI",8,"Prevención y atención de maternidad temprana","Propósito 1: Hacer un nuevo contrato social para incrementar la inclusión social, productiva y política"]
[null,"Un Nuevo Contrato Social y Ambiental para la Bogotá del Siglo XXI",9,"Prevención y cambios para mejorar la salud de la población","Propósito 1: Hacer un nuevo contrato social para incrementar la inclusión social, productiva y política"]
[null,"Un Nuevo Contrato Social y Ambiental para la Bogotá del Siglo XXI",10,"Salud para la vida y el bienestar","Propósito 1: Hacer un nuevo contrato social para incrementar la inclusión social, productiva y política"]
[null,"Un Nuevo Contrato Social y Ambiental para la Bogotá del Siglo XXI",11,"Salud y bienestar para niñas y niños","Propósito 1: Hacer un nuevo contrato social para incrementar la inclusión social, productiva y política"]
[null,"Un Nuevo Contrato Social y Ambiental para la Bogotá del Siglo XXI",12,"Educación inicial: Bases sólidas para la vida.","Propósito 1: Hacer un nuevo contrato social para incrementar la inclusión social, productiva y política"]
[null,"Un Nuevo Contrato Social y Ambiental para la Bogotá del Siglo XXI",13,"Educación para todos y todas: acceso y permanencia con equidad y énfasis en educación rural","Propósito 1: Hacer un nuevo contrato social para incrementar la inclusión social, productiva y política"]
[null,"Un Nuevo Contrato Social y Ambiental para la Bogotá del Siglo XXI",14,"Formación integral: más y mejor tiempo en los colegios","Propósito 1: Hacer un nuevo contrato social para incrementar la inclusión social, productiva y política"]
[null,"Un Nuevo Contrato Social y Ambiental para la Bogotá del Siglo XXI",15,"Plan Distrital de Lectura, Escritura y Oralidad: \"Leer para la vida\"","Propósito 1: Hacer un nuevo contrato social para incrementar la inclusión social, productiva y política"]
[null,"Un Nuevo Contrato Social y Ambiental para la Bogotá del Siglo XXI",16,"Transformación pedagógica y mejoramiento de la gestión educativa. Es con los maestros y maestras.","Propósito 1: Hacer un nuevo contrato social para incrementar la inclusión social, productiva y política"]
[null,"Un Nuevo Contrato Social y Ambiental para la Bogotá del Siglo XXI",17,"Jóvenes con capacidades: Proyecto de vida para la ciudadanía, la innovación y el trabajo del siglo XXI","Propósito 1: Hacer un nuevo contrato social para incrementar la inclusión social, productiva y política"]
[null,"Un Nuevo Contrato Social y Ambiental para la Bogotá del Siglo XXI",18,"Cierre de brechas para la inclusión productiva urbano rural","Propósito 1: Hacer un nuevo contrato social para incrementar la inclusión social, productiva y política"]
[null,"Un Nuevo Contrato Social y Ambiental para la Bogotá del Siglo XXI",19,"Vivienda y entornos dignos en el territorio urbano y rural","Propósito 1: Hacer un nuevo contrato social para incrementar la inclusión social, productiva y política"]
[null,"Un Nuevo Contrato Social y Ambiental para la Bogotá del Siglo XXI",20,"Bogotá, referente en cultura, deporte, recreación y actividad física, con parques para el desarrollo y la salud","Propósito 1: Hacer un nuevo contrato social para incrementar la inclusión social, productiva y política"]
[null,"Un Nuevo Contrato Social y Ambiental para la Bogotá del Siglo XXI",21,"Creación y vida cotidiana: Apropiación ciudadana del arte, la cultura y el patrimonio, para la democracia cultural","Propósito 1: Hacer un nuevo contrato social para incrementar la inclusión social, productiva y política"]
[null,"Un Nuevo Contrato Social y Ambiental para la Bogotá del Siglo XXI",22,"Transformación cultural para la conciencia ambiental y el cuidado de la fauna doméstica","Propósito 1: Hacer un nuevo contrato social para incrementar la inclusión social, productiva y política"]
[null,"Un Nuevo Contrato Social y Ambiental para la Bogotá del Siglo XXI",23,"Bogotá rural","Propósito 1: Hacer un nuevo contrato social para incrementar la inclusión social, productiva y política"]
[null,"Un Nuevo Contrato Social y Ambiental para la Bogotá del Siglo XXI",24,"Bogotá región emprendedora e innovadora","Propósito 1: Hacer un nuevo contrato social para incrementar la inclusión social, productiva y política"]
[null,"Un Nuevo Contrato Social y Ambiental para la Bogotá del Siglo XXI",25,"Bogotá región productiva y competitiva","Propósito 1: Hacer un nuevo contrato social para incrementar la inclusión social, productiva y política"]
[null,"Un Nuevo Contrato Social y Ambiental para la Bogotá del Siglo XXI",26,"Bogotá - región, el mejor destino para visitar","Propósito 1: Hacer un nuevo contrato social para incrementar la inclusión social, productiva y política"]
[null,"Un Nuevo Contrato Social y Ambiental para la Bogotá del Siglo XXI",27,"Cambio cultural para la gestión de la crisis climática","Propósito 2 : Cambiar Nuestros Hábitos de Vida para Reverdecer a Bogotá y Adaptarnos y Mitigar la Crisis Climática"]
[null,"Un Nuevo Contrato Social y Ambiental para la Bogotá del Siglo XXI",{"$f":"+C29+1","v":28},"Bogotá protectora de sus recursos naturales","Propósito 2 : Cambiar Nuestros Hábitos de Vida para Reverdecer a Bogotá y Adaptarnos y Mitigar la Crisis Climática"]
[null,"Un Nuevo Contrato Social y Ambiental para la Bogotá del Siglo XXI",{"$f":"+C30+1","v":29},"Asentamientos y entornos protectores","Propósito 2 : Cambiar Nuestros Hábitos de Vida para Reverdecer a Bogotá y Adaptarnos y Mitigar la Crisis Climática"]
[null,"Un Nuevo Contrato Social y Ambiental para la Bogotá del Siglo XXI",30,"Eficiencia en la atención de emergencias","Propósito 2 : Cambiar Nuestros Hábitos de Vida para Reverdecer a Bogotá y Adaptarnos y Mitigar la Crisis Climática"]
[null,"Un Nuevo Contrato Social y Ambiental para la Bogotá del Siglo XXI",31," Protección y valoración del patrimonio tangible e intangible en Bogotá y la región","Propósito 2 : Cambiar Nuestros Hábitos de Vida para Reverdecer a Bogotá y Adaptarnos y Mitigar la Crisis Climática"]
[null,"Un Nuevo Contrato Social y Ambiental para la Bogotá del Siglo XXI",32,"Revitalización urbana para la competitividad","Propósito 2 : Cambiar Nuestros Hábitos de Vida para Reverdecer a Bogotá y Adaptarnos y Mitigar la Crisis Climática"]
[null,"Un Nuevo Contrato Social y Ambiental para la Bogotá del Siglo XXI",33,"Más árboles y más y mejor espacio público","Propósito 2 : Cambiar Nuestros Hábitos de Vida para Reverdecer a Bogotá y Adaptarnos y Mitigar la Crisis Climática"]
[null,"Un Nuevo Contrato Social y Ambiental para la Bogotá del Siglo XXI",34,"Bogotá protectora de los animales","Propósito 2 : Cambiar Nuestros Hábitos de Vida para Reverdecer a Bogotá y Adaptarnos y Mitigar la Crisis Climática"]
[null,"Un Nuevo Contrato Social y Ambiental para la Bogotá del Siglo XXI",35,"Manejo y prevención de contaminación","Propósito 2 : Cambiar Nuestros Hábitos de Vida para Reverdecer a Bogotá y Adaptarnos y Mitigar la Crisis Climática"]
[null,"Un Nuevo Contrato Social y Ambiental para la Bogotá del Siglo XXI",36,"Manejo y saneamiento de los cuerpos de agua","Propósito 2 : Cambiar Nuestros Hábitos de Vida para Reverdecer a Bogotá y Adaptarnos y Mitigar la Crisis Climática"]
[null,"Un Nuevo Contrato Social y Ambiental para la Bogotá del Siglo XXI",37,"Provisión y mejoramiento de servicios públicos","Propósito 2 : Cambiar Nuestros Hábitos de Vida para Reverdecer a Bogotá y Adaptarnos y Mitigar la Crisis Climática"]
[null,"Un Nuevo Contrato Social y Ambiental para la Bogotá del Siglo XXI",38,"Ecoeficiencia, reciclaje, manejo de residuos e inclusión de la población recicladora","Propósito 2 : Cambiar Nuestros Hábitos de Vida para Reverdecer a Bogotá y Adaptarnos y Mitigar la Crisis Climática"]
[null,"Un Nuevo Contrato Social y Ambiental para la Bogotá del Siglo XXI",39,"Bogotá territorio de paz y atención integral a las víctimas del conflicto armado","Propósito 3: Inspirar confianza y legitimidad para vivir sin miedo y ser epicentro de cultura ciudadana, paz y reconciliación"]
[null,"Un Nuevo Contrato Social y Ambiental para la Bogotá del Siglo XXI",{"$f":"+C41+1","v":40},"Más mujeres viven una vida libre de violencias, se sienten seguras y acceden con confianza al sistema de justicia","Propósito 3: Inspirar confianza y legitimidad para vivir sin miedo y ser epicentro de cultura ciudadana, paz y reconciliación"]
[null,"Un Nuevo Contrato Social y Ambiental para la Bogotá del Siglo XXI",{"$f":"+C42+1","v":41},"Sin machismo ni violencias contra las mujeres, las niñas y los niños","Propósito 3: Inspirar confianza y legitimidad para vivir sin miedo y ser epicentro de cultura ciudadana, paz y reconciliación"]
[null,"Un Nuevo Contrato Social y Ambiental para la Bogotá del Siglo XXI",42,"Conciencia y cultura ciudadana para la seguridad, la convivencia y la construcción de confianza","Propósito 3: Inspirar confianza y legitimidad para vivir sin miedo y ser epicentro de cultura ciudadana, paz y reconciliación"]
[null,"Un Nuevo Contrato Social y Ambiental para la Bogotá del Siglo XXI",43,"Cultura ciudadana para la confianza, la convivencia y la participación desde la vida cotidiana","Propósito 3: Inspirar confianza y legitimidad para vivir sin miedo y ser epicentro de cultura ciudadana, paz y reconciliación"]
[null,"Un Nuevo Contrato Social y Ambiental para la Bogotá del Siglo XXI",44,"Autoconciencia, respeto y cuidado en el espacio público","Propósito 3: Inspirar confianza y legitimidad para vivir sin miedo y ser epicentro de cultura ciudadana, paz y reconciliación"]
[null,"Un Nuevo Contrato Social y Ambiental para la Bogotá del Siglo XXI",45,"Espacio público más seguro y construido colectivamente","Propósito 3: Inspirar confianza y legitimidad para vivir sin miedo y ser epicentro de cultura ciudadana, paz y reconciliación"]
[null,"Un Nuevo Contrato Social y Ambiental para la Bogotá del Siglo XXI",46,"Atención a jóvenes y adultos infractores con impacto en su proyecto de vida","Propósito 3: Inspirar confianza y legitimidad para vivir sin miedo y ser epicentro de cultura ciudadana, paz y reconciliación"]
[null,"Un Nuevo Contrato Social y Ambiental para la Bogotá del Siglo XXI",47,"Calidad de Vida y Derechos de la Población privada de la libertad","Propósito 3: Inspirar confianza y legitimidad para vivir sin miedo y ser epicentro de cultura ciudadana, paz y reconciliación"]
[null,"Un Nuevo Contrato Social y Ambiental para la Bogotá del Siglo XXI",48,"Plataforma institucional para la seguridad y justicia","Propósito 3: Inspirar confianza y legitimidad para vivir sin miedo y ser epicentro de cultura ciudadana, paz y reconciliación"]
[null,"Un Nuevo Contrato Social y Ambiental para la Bogotá del Siglo XXI",49,"Movilidad segura, sostenible y accesible","Propósito 4: Hacer de Bogotá Región un modelo de movilidad multimodal, incluyente y sostenible"]
[null,"Un Nuevo Contrato Social y Ambiental para la Bogotá del Siglo XXI",{"$f":"+C51+1","v":50},"Red de metros","Propósito 4: Hacer de Bogotá Región un modelo de movilidad multimodal, incluyente y sostenible"]
[null,"Un Nuevo Contrato Social y Ambiental para la Bogotá del Siglo XXI",51,"Gobierno Abierto","Propósito 5: Construir Bogotá - Región con gobierno abierto, transparente y ciudadanía consciente"]
[null,"Un Nuevo Contrato Social y Ambiental para la Bogotá del Siglo XXI",{"$f":"+C53+1","v":52},"Integración regional, distrital y local","Propósito 5: Construir Bogotá - Región con gobierno abierto, transparente y ciudadanía consciente"]
[null,"Un Nuevo Contrato Social y Ambiental para la Bogotá del Siglo XXI",{"$f":"+C54+1","v":53},"Información para la toma de decisiones","Propósito 5: Construir Bogotá - Región con gobierno abierto, transparente y ciudadanía consciente"]
[null,"Un Nuevo Contrato Social y Ambiental para la Bogotá del Siglo XXI",54,"Transformación digital y gestión de TIC para un territorio inteligente","Propósito 5: Construir Bogotá - Región con gobierno abierto, transparente y ciudadanía consciente"]
[null,"Un Nuevo Contrato Social y Ambiental para la Bogotá del Siglo XXI",55,"Fortalecimiento de cultura ciudadana y su institucionalidad","Propósito 5: Construir Bogotá - Región con gobierno abierto, transparente y ciudadanía consciente"]
[null,"Un Nuevo Contrato Social y Ambiental para la Bogotá del Siglo XXI",56,"Gestión pública efectiva","Propósito 5: Construir Bogotá - Región con gobierno abierto, transparente y ciudadanía consciente"]
[null,"Un Nuevo Contrato Social y Ambiental para la Bogotá del Siglo XXI",57,"Gestión pública local","Propósito 5: Construir Bogotá - Región con gobierno abierto, transparente y ciudadanía consciente"]

{"sheet":"Tipo","index":6,"n_rows":67,"n_cols":5,"rows_kept":67,"cut":false,"hidden":true,"merged":[]}
[null,null,"Modalidad de Selección","afectacion","Naturaleza Jurídica"]
[1,null,"Concurso de méritos","Funcionamiento","Persona Natural"]
[2,null,"Contratación directa","Inversión","Persona Jurídica"]
[3,null,"Contratación mínima cuantia","Operación","Unión Temporal"]
[4,null,"Selección abreviada",null,"Consorcio"]
[5,null,"Licitación pública",null,"Sociedad con objeto único"]
[6,null,"Otros",null,"Persona jurídica extranjera"]
[7,null,"Régimen especial",null,"Sin ánimo de lucro"]
[8,null,null,null,"Cabildo indígena"]
[9,null,null,null,"Consejo comunitario de las comunidades negras"]
[10,null,"Selección abreviada",null,"Organizaciones de segundo nivel"]
[11,null,"Subasta inversa ",null,"Formas o expresiones organizativas, afrocolombianas, raizales y palenqueras"]
[12,null,"Bolsas de productos",null,"Organizaciones de base de comunidades negras "]
[13,null,"Acuerdo marco de precios ",null,"Asociaciones de autoridades tradicionales indígenas"]
[14,null,"Selección abreviada por menor cuantía "]
[15]
[16,null,"contratacion directa"]
[17,null,"Urgencia manifiesta"]
[18,null,"Contratación de empréstitos"]
[19,null,"Contratos interadministrativos"]
[20,null,"Contratación de bienes y servicios en el sector Defensa "]
[null,"SECTOR","Contratos para el desarrollo de actividades científicas y tecnológicas"]
[1,"Gestión Pública","Contratos de encargo fiduciario que celebren las entidades territoriales cuando inician el Acuerdo de Reestructuración de Pasivos"]
[{"$f":"+A23+1","v":2},"Gobierno","Cuando no exista pluralidad de oferentes en el mercado"]
[{"$f":"+A24+1","v":3},"Hacienda","Prestación de servicios profesionales y de apoyo a la gestión, o para la ejecución de trabajos artísticos que sólo puedan encomendarse a determinadas personas naturales"]
[4,"Planeación","El arrendamiento o adquisición de inmuebles"]
[5,"Desarrollo Económico, Industria y Turismo","Contratación de bienes y servicios de la Dirección Nacional de Inteligencia (DNI)"]
[6,"Educación"]
[7,"Salud"]
[8,"Integración Social","Decreto 92 de 2017"]
[9,"Cultura, Recreación y Deporte","No aplica"]
[10,"Ambiente"]
[11,"Movilidad","SECOP I"]
[12,"Hábitat","SECOP II"]
[13,"Mujeres"]
[14,"Seguridad, Convivencia y Justicia","Bogotá Mejor para Todos"]
[15,"Gestión Juridíca","Un Nuevo Contrato Social y Ambiental para la Bogotá del Siglo XXI"]
[16,"descentralizado territorialmente"]
[]
[null,"16 - AL","Estado"]
[null,null,"Celebrado o por iniciar"]
[null,"Plan de desarrollo distrital","En ejecución"]
[null,"Un nuevo contrato social y ambiental para la Bogotá del Siglo XXI","Terminado"]
[null,null,"Liquidado"]
[]
[null,"Tipo"]
[null,"Obra pública"]
[null,"Consultoría"]
[null,"Interventoría"]
[null,"Contratos de prestación de servicios"]
[null,"Contratos de prestación de servicios profesionales y de apoyo a la gestión"]
[null,"Compraventa de bienes muebles"]
[null,"Compraventa de bienes inmuebles"]
[null,"Arrendamiento de bienes muebles"]
[null,"Arrendamiento de bienes inmuebles"]
[null,"Seguro"]
[null,"Suministro"]
[null,"Empréstitos"]
[null,"Fiducia mercantil o encargo fiduciario"]
[null,"Concesión "]
[null,"Convenios de cooperacion"]
[null,"Convenios/Contratos interadministrativos"]
[null,"Convenios de apoyo o convenios de asociación "]
[null,"Convenios solidarios"]
[null,"Asociaciones Público Privadas"]
[null,"Otros"]
[null,"Otros gastos"]