{"text_format":"1","workbook":"xlsx","n_sheets":9,"sheets":["Hoja1","1. INFORMACION ACUMULADA","BOG-DATA","2. PAA","3. CONSOLIDADO","4. INSTRUCTIVO","Proposito_programa","Tipo","Eje_Pilar_Prop1"],"not_rendered":{"charts":0,"images":1,"macros":1,"external_links":2,"defined_names":25,"comments":1,"pivot_tables":1},"unopened":[],"bounds":{"document_bytes":16777216,"sheet_cells":100000,"rows_first":2000,"rows_last":500,"rows_between":2000,"halvings":0,"cell_chars":16384,"cell_head_chars":4096},"cells_cut":0,"cells_raw":0,"read":"whole","date_system":"1900"}

{"sheet":"Hoja1","index":0,"n_rows":6,"n_cols":4,"rows_kept":6,"cut":false,"hidden":false,"merged":[]}
["Afectación","Inversión"]
[]
["Número Proyecto","Nombre del contratista\n  (según el caso: nombres y apellidos o Razón social y Tipo societario)","Suma de Valor Final ","Suma de Giros (Valor en pesos)"]
[1760,"IDARTES",163079837]
[1760,"SECRETARIA DISTRITAL DE CULTURA RECREACION Y DEPORTE",41002163]
["Total general",null,204082000]

{"sheet":"1. INFORMACION ACUMULADA","index":1,"n_rows":426,"n_cols":42,"rows_kept":426,"cut":false,"hidden":false,"merged":[[7,33,7,34],[10,37,10,40],[5,35,5,41],[6,35,6,41],[7,35,7,41],[8,35,8,41],[9,35,9,41],[1,0,1,37],[2,0,2,37],[4,0,4,3],[4,8,4,10],[4,14,4,15],[4,22,4,37],[8,0,8,3],[8,6,8,7],[8,10,9,15],[8,33,8,34],[9,0,9,3],[9,5,9,7],[9,33,9,34],[5,0,5,3],[5,8,5,10],[5,33,5,34],[6,0,6,3],[6,8,6,10],[6,33,6,34],[11,2,11,3],[11,8,11,12],[11,15,11,20],[11,37,11,40],[10,0,10,20],[10,21,10,26],[10,27,10,32],[10,33,10,36]]}
[]
["VEEDURIA DISTRITAL - INFORMACIÓN GESTION CONTRACTUAL"]
["DEL 1 DE ENERO AL 31 DE DICIEMBRE DE 2021"]
[]
["1. Entidad",null,null,null,"Fondo de desarrollo local de Fontibón",null,null,"2. Sector","Gobierno"]
["3. Presupuesto Disponible Inversión Directa PREDIS (BOGDATA)",null,null,null,28298462943,null,null,"5. Presupuesto Disponible Funcionamiento PREDIS (BOGDATA)",3573000000,null,null,null,null,null,null,null,null,null,null,null,null,null,null,null,null,null,null,null,null,null,null,null,null,"9. Nombre de quien diligencia el formato",null,"ANDREA ROCHA"]
["4. Presupuesto Comprometido de Inversión Directa según PREDIS (BOGDATA)",null,null,null,27491453799,null,null,"6. Presupuesto Comprometido Funcionamiento según PREDIS (BOGDATA)",3306317701,null,null,null,null,null,null,null,null,null,null,null,null,null,null,null,null,null,null,null,null,null,null,null,null,"Cargo",null,"ABOGADA"]
[null,null,null,null,null,null,null,null,null,null,null,null,null,null,null,null,null,null,null,null,null,null,null,null,null,null,null,null,null,null,null,null,null,"Dependencia",null,"CONTRATACION"]
["7. Presupuesto Disponible Operación (Régimen Privado)",null,null,null,null,null,null,null,null,null,null,null,null,null,null,null,null,null,null,null,null,null,null,null,null,null,null,null,null,null,null,null,null,"Teléfono",null,3102419516]
["8. Presupuesto Comprometido Operación mediante contratos",null,null,null,null,null,null,null,null,null,null,null,null,null,null,null,null,null,null,null,null,null,null,null,null,null,null,null,null,null,null,null,null,"Correo Electrónico",null,"johana.rocha@gobiernobogota.gov.co"]
["1- INFORMACION GENERAL",null,null,null,null,null,null,null,null,null,null,null,null,null,null,null,null,null,null,null,null,"2- INFORMACION FINANCIERA",null,null,null,null,null,"3 - PLAZOS ",null,null,null,null,null,"4. CESION",null,null,null,"5. ESTADO",null,null,null,"6. %  Avance y/o cumplimiento"]
[1,2,3,null,4,5,6,7,8,null,null,null,null,9,10,11,null,null,null,null,null,12,13,14,15,16,17,18,19,20,21,22,23,24,25,26,27,28,null,null,null,29]
["Número Contrato","Año","Número de proceso contractual \nSECOP","Link proceso SECOP","Tipo de contrato ","Modalidad de Selección","Procedimiento o causal","Objeto","Afectación","Plan de Desarrollo Distrital","Número Programa","Equivalencia número de programa","Propósito","Número Proyecto","Número de proponentes","Número  de Identificación del contratista\n(Cédula o NIT sin puntos, comas ni caracteres especiales y sin digito de verificación)","Nombre del contratista\n  (según el caso: nombres y apellidos o Razón social y Tipo societario)","Naturaleza Jurídica","Número  de Identificación del integrante del Consorcio o U.T.\n(Cédula o NIT sin puntos, comas ni caracteres especiales y sin digito de verificación)","Nombre del Integrante del Consorcio o U.T. y Tipo societario\n (Según el caso: nombres y apellidos o razón social y tipo societario)","% Participación (indicar solo el numero del porcentaje, sin caracteres especiales)","Valor Inicial del contrato","Valor total reducciones \n(En valor negativo)","Número de adiciones","Valor total de adiciones ","Valor Final ","Giros (Valor en pesos)","Fecha de suscripción (DD/MM/AAAA)","Fecha de inicio (DD/MM/AAAA)","Fecha de terminación (DD/MM/AAAA)","Plazo en días","Número de prórrogas","Prorroga en días","Número  de Identificación del cesionario\n(NIT sin digito de verificación)","Nombre cesionario","Fecha cesión\n(DD/MM/AAAA)","Valor cesión","Celebrado o por iniciar","En Ejecución","Terminado","Liquidado","% Avance y/o Cumplimiento"]
[1,2021,"FDLF-CD-1-2021","https://community.secop.gov.co/Public/Tendering/OpportunityDetail/Index?noticeUID=CO1.NTC.1709977&isFromPublicArea=True&isModal=true&asPopupView=true","Contratos de prestación de servicios profesionales y de apoyo a la gestión","Contratación directa","Prestación de servicios profesionales y de apoyo a la gestión, o para la ejecución de trabajos artísticos que sólo puedan encomendarse a determinadas personas naturales;","PRESTAR SERVICIOS PARA APOYAR LAS ACTIVIDADES OPERATIVAS Y ADMINISTRATIVAS DE LA JUNTA ADMINISTRADORA LOCAL ","Inversión","Un nuevo Contrato Social y ambiental para la Bogotá del Siglo XXI",57,{"$f":"IF(ISERROR(VLOOKUP(K14,[2]Proposito_programa!$C$2:$E$59,2,FALSE)),\" \",VLOOKUP(K14,[2]Proposito_programa!$C$2:$E$59,2,FALSE))","v":"Gestión pública local"},{"$f":"IF(ISERROR(VLOOKUP(K14,[2]Proposito_programa!$C$2:$E$59,3,FALSE)),\" \",VLOOKUP(K14,[2]Proposito_programa!$C$2:$E$59,3,FALSE))","v":"Propósito 5: Construir Bogotá - Región con gobierno abierto, transparente y ciudadanía consciente"},1783,1,19426466,"RAUL ARMANDO LUQUE RUIZ","Persona Natural",null,null,null,21905010,null,1,5111169,{"$f":"Y14+V14+W14","v":27016179},24501159,"2021-01-29","2021-01-29","2021-12-31","274 DÍAS",1,63,null,null,null,null,null,null,"X",null,0.81]
[2,2021,"FDLF-CD-2-2021","https://community.secop.gov.co/Public/Tendering/OpportunityDetail/Index?noticeUID=CO1.NTC.1711465&isFromPublicArea=True&isModal=true&asPopupView=true","Contratos de prestación de servicios profesionales y de apoyo a la gestión","Contratación directa","Prestación de servicios profesionales y de apoyo a la gestión, o para la ejecución de trabajos artísticos que sólo puedan encomendarse a determinadas personas naturales;","PRESTAR SERVICIOS PROFESIONALES PARA APOYAR JURÍDICAMENTE LOS DIFERENTES PROCESOS QUE REQUIERA ADELANTAR LA ALCALDÍA LOCAL DE FONTIBÓN DESDE LAS ETAPAS PRECONTRACTUAL, CONTRACTUAL Y POST CONTRACTUAL","Inversión","Un nuevo Contrato Social y ambiental para la Bogotá del Siglo XXI",57,{"$f":"IF(ISERROR(VLOOKUP(K15,[2]Proposito_programa!$C$2:$E$59,2,FALSE)),\" \",VLOOKUP(K15,[2]Proposito_programa!$C$2:$E$59,2,FALSE))","v":"Gestión pública local"},{"$f":"IF(ISERROR(VLOOKUP(K15,[2]Proposito_programa!$C$2:$E$59,3,FALSE)),\" \",VLOOKUP(K15,[2]Proposito_programa!$C$2:$E$59,3,FALSE))","v":"Propósito 5: Construir Bogotá - Región con gobierno abierto, transparente y ciudadanía consciente"},1783,1,1123730820,"RODRIGO JOSE ZABALETA BAÑOL","Persona Natural",null,null,null,61200000,null,0,0,61200000,61200000,"2021-01-29","2021-01-29","2021-10-28","274 DÍAS",0,0,null,null,null,null,null,null,"X",null,1]
[3,2021,"FDLF-CD-03-2021","https://community.secop.gov.co/Public/Tendering/OpportunityDetail/Index?noticeUID=CO1.NTC.1711916&isFromPublicArea=True&isModal=true&asPopupView=true","Contratos de prestación de servicios profesionales y de apoyo a la gestión","Contratación directa","Prestación de servicios profesionales y de apoyo a la gestión, o para la ejecución de trabajos artísticos que sólo puedan encomendarse a determinadas personas naturales;","PRESTAR SERVICIOS PROFESIONALES PARA APOYAR JURÍDICAMENTE LOS DIFERENTES PROCESOS QUE REQUIERA ADELANTAR LA ALCALDÍA LOCAL DE FONTIBÓN DESDE LAS ETAPAS PRECONTRACTUAL, CONTRACTUAL Y POST CONTRACTUAL","Inversión","Un nuevo Contrato Social y ambiental para la Bogotá del Siglo XXI",57,{"$f":"IF(ISERROR(VLOOKUP(K16,[2]Proposito_programa!$C$2:$E$59,2,FALSE)),\" \",VLOOKUP(K16,[2]Proposito_programa!$C$2:$E$59,2,FALSE))","v":"Gestión pública local"},{"$f":"IF(ISERROR(VLOOKUP(K16,[2]Proposito_programa!$C$2:$E$59,3,FALSE)),\" \",VLOOKUP(K16,[2]Proposito_programa!$C$2:$E$59,3,FALSE))","v":"Propósito 5: Construir Bogotá - Región con gobierno abierto, transparente y ciudadanía consciente"},1783,1,1019002889,"EDNA LORENA YISSETH LEON SAAVEDRA","Persona Natural",null,null,null,61200000,null,0,0,61200000,60066667,"2021-01-29","2021-01-29","2021-10-28","274 DÍAS",0,0,1090427583,"ERIKA ANDREA RUBIO CASTILLO","2021-08-30",13146667,null,null,"X",null,0.98]
[4,2021,"FDLF-CD-4-2021","https://community.secop.gov.co/Public/Tendering/OpportunityDetail/Index?noticeUID=CO1.NTC.1726965&isFromPublicArea=True&isModal=true&asPopupView=true","Contratos de prestación de servicios profesionales y de apoyo a la gestión","Contratación directa","Prestación de servicios profesionales y de apoyo a la gestión, o para la ejecución de trabajos artísticos que sólo puedan encomendarse a determinadas personas naturales;","PRESTAR SERVICIOS PROFESIONALES PARA APOYAR JURÍDICAMENTE LOS DIFERENTES PROCESOS QUE REQUIERA ADELANTAR LA ALCALDÍA LOCAL DE FONTIBÓN DESDE LAS ETAPAS PRECONTRACTUAL, CONTRACTUAL Y POST CONTRACTUAL.","Inversión","Un nuevo Contrato Social y ambiental para la Bogotá del Siglo XXI",57,{"$f":"IF(ISERROR(VLOOKUP(K17,[2]Proposito_programa!$C$2:$E$59,2,FALSE)),\" \",VLOOKUP(K17,[2]Proposito_programa!$C$2:$E$59,2,FALSE))","v":"Gestión pública local"},{"$f":"IF(ISERROR(VLOOKUP(K17,[2]Proposito_programa!$C$2:$E$59,3,FALSE)),\" \",VLOOKUP(K17,[2]Proposito_programa!$C$2:$E$59,3,FALSE))","v":"Propósito 5: Construir Bogotá - Región con gobierno abierto, transparente y ciudadanía consciente"},1783,1,1019002889,"EFREY ARMANDO SANABRIA MORENO","Persona Natural",null,null,null,61200000,null,0,0,61200000,60066667,"2021-02-04","2021-02-04","2021-11-03","274 DÍAS",0,0,1032389169,"JUAN DAVID CUADROS GARZON","2021-04-30",41026667,null,null,"X",null,0.98]
[5,2021,"FDLF-CD-5-2021","https://community.secop.gov.co/Public/Tendering/OpportunityDetail/Index?noticeUID=CO1.NTC.1733520&isFromPublicArea=True&isModal=true&asPopupView=true","Contratos de prestación de servicios profesionales y de apoyo a la gestión","Contratación directa","Prestación de servicios profesionales y de apoyo a la gestión, o para la ejecución de trabajos artísticos que sólo puedan encomendarse a determinadas personas naturales;","PRESTAR SERVICIOS PARA APOYAR LAS ACTIVIDADES OPERATIVAS Y ADMINISTRATIVAS DE LA JUNTA ADMINISTRADORA LOCAL.","Inversión","Un nuevo Contrato Social y ambiental para la Bogotá del Siglo XXI",57,{"$f":"IF(ISERROR(VLOOKUP(K18,[2]Proposito_programa!$C$2:$E$59,2,FALSE)),\" \",VLOOKUP(K18,[2]Proposito_programa!$C$2:$E$59,2,FALSE))","v":"Gestión pública local"},{"$f":"IF(ISERROR(VLOOKUP(K18,[2]Proposito_programa!$C$2:$E$59,3,FALSE)),\" \",VLOOKUP(K18,[2]Proposito_programa!$C$2:$E$59,3,FALSE))","v":"Propósito 5: Construir Bogotá - Región con gobierno abierto, transparente y ciudadanía consciente"},1783,1,52481412,"JEIMMY ZAMANDA CRUZ BALLESTEROS","Persona Natural",null,null,null,21905010,null,1,4624391,26529401,24014381,"2021-02-05","2021-02-05","2021-11-04","274 DÍAS",1,57,null,null,null,null,null,null,"X",null,0.83]
[6,2021,"FDLF-CD-6-2021","https://community.secop.gov.co/Public/Tendering/OpportunityDetail/Index?noticeUID=CO1.NTC.1735402&isFromPublicArea=True&isModal=true&asPopupView=true","Contratos de prestación de servicios profesionales y de apoyo a la gestión","Contratación directa","Prestación de servicios profesionales y de apoyo a la gestión, o para la ejecución de trabajos artísticos que sólo puedan encomendarse a determinadas personas naturales;","PRESTAR SERVICIOS DE APOYO AL ÁREA DE GESTIÓN DEL DESARROLLO LOCAL DE FONTIBÓN EN ACTIVIDADES INHERENTES A LA PLANEACIÓN.","Inversión","Un nuevo Contrato Social y ambiental para la Bogotá del Siglo XXI",57,{"$f":"IF(ISERROR(VLOOKUP(K19,[2]Proposito_programa!$C$2:$E$59,2,FALSE)),\" \",VLOOKUP(K19,[2]Proposito_programa!$C$2:$E$59,2,FALSE))","v":"Gestión pública local"},{"$f":"IF(ISERROR(VLOOKUP(K19,[2]Proposito_programa!$C$2:$E$59,3,FALSE)),\" \",VLOOKUP(K19,[2]Proposito_programa!$C$2:$E$59,3,FALSE))","v":"Propósito 5: Construir Bogotá - Región con gobierno abierto, transparente y ciudadanía consciente"},1783,1,80147386,"JOHN FREDY HERRERA RINCON","Persona Natural",null,null,null,21905010,null,1,4299872,26204882,23770992,"2021-02-08","2021-02-08","2021-12-31","274 DÍAS",1,53,null,null,null,null,null,null,"X",null,0.84]
[7,2021,"FDLF-CD-7-2021","https://community.secop.gov.co/Public/Tendering/OpportunityDetail/Index?noticeUID=CO1.NTC.1735075&isFromPublicArea=True&isModal=true&asPopupView=true","Contratos de prestación de servicios profesionales y de apoyo a la gestión","Contratación directa","Prestación de servicios profesionales y de apoyo a la gestión, o para la ejecución de trabajos artísticos que sólo puedan encomendarse a determinadas personas naturales;","PRESTAR SERVICIOS COMO PROFESIONAL PARA REALIZAR EL PROCESO DE LIQUIDACIONES DE LOS CONTRATOS SUSCRITOS POR EL FONDO DE DESARROLLO LOCAL DE FONTIBÓN","Inversión","Un nuevo Contrato Social y ambiental para la Bogotá del Siglo XXI",57,{"$f":"IF(ISERROR(VLOOKUP(K20,[2]Proposito_programa!$C$2:$E$59,2,FALSE)),\" \",VLOOKUP(K20,[2]Proposito_programa!$C$2:$E$59,2,FALSE))","v":"Gestión pública local"},{"$f":"IF(ISERROR(VLOOKUP(K20,[2]Proposito_programa!$C$2:$E$59,3,FALSE)),\" \",VLOOKUP(K20,[2]Proposito_programa!$C$2:$E$59,3,FALSE))","v":"Propósito 5: Construir Bogotá - Región con gobierno abierto, transparente y ciudadanía consciente"},1783,1,60315384,"MARTHA LUCIA VEGA RAMIREZ","Persona Natural",null,null,null,47700000,null,1,9893333,57593333,52293333,"2021-02-05","2021-02-05","2021-12-31","274 DÍAS",1,56,null,null,null,null,null,null,"X",null,0.83]
[8,2021,"FDLF-CD-8-2021","https://community.secop.gov.co/Public/Tendering/OpportunityDetail/Index?noticeUID=CO1.NTC.1735504&isFromPublicArea=True&isModal=true&asPopupView=true","Contratos de prestación de servicios profesionales y de apoyo a la gestión","Contratación directa","Prestación de servicios profesionales y de apoyo a la gestión, o para la ejecución de trabajos artísticos que sólo puedan encomendarse a determinadas personas naturales;","PRESTAR SERVICIOS COMO PROFESIONAL PARA REALIZAR EL PROCESO DE LIQUIDACIONES DE LOS CONTRATOS SUSCRITOS POR EL FONDO DE DESARROLLO LOCAL DE FONTIBÓN","Inversión","Un nuevo Contrato Social y ambiental para la Bogotá del Siglo XXI",57,{"$f":"IF(ISERROR(VLOOKUP(K21,[2]Proposito_programa!$C$2:$E$59,2,FALSE)),\" \",VLOOKUP(K21,[2]Proposito_programa!$C$2:$E$59,2,FALSE))","v":"Gestión pública local"},{"$f":"IF(ISERROR(VLOOKUP(K21,[2]Proposito_programa!$C$2:$E$59,3,FALSE)),\" \",VLOOKUP(K21,[2]Proposito_programa!$C$2:$E$59,3,FALSE))","v":"Propósito 5: Construir Bogotá - Región con gobierno abierto, transparente y ciudadanía consciente"},1783,1,52324766,"YARSELY SUAREZ SUAREZ","Persona Natural",null,null,null,47700000,null,1,9893333,57593333,52293333,"2021-02-05","2021-02-05","2021-12-31","274 DÍAS",1,56,null,null,null,null,null,null,"X",null,0.83]
[9,2021,"FDLF-CD-9-2021","https://community.secop.gov.co/Public/Tendering/OpportunityDetail/Index?noticeUID=CO1.NTC.1737152&isFromPublicArea=True&isModal=true&asPopupView=true","Contratos de prestación de servicios profesionales y de apoyo a la gestión","Contratación directa","Prestación de servicios profesionales y de apoyo a la gestión, o para la ejecución de trabajos artísticos que sólo puedan encomendarse a determinadas personas naturales;","PRESTAR SERVICIOS PROFESIONALES DE APOYO A PRESUPUESTO EN EL FONDO DE DESARROLLO LOCAL DE FONTIBÓN EN EL REGISTRO, ANÁLISIS Y GESTIÓN DE OBLIGACIONES POR PAGAR Y OTROS ASUNTOS QUE EN MATERIA DE PRESUPUESTO LOCAL LE SEAN ASIGNADOS","Inversión","Un nuevo Contrato Social y ambiental para la Bogotá del Siglo XXI",57,{"$f":"IF(ISERROR(VLOOKUP(K22,[2]Proposito_programa!$C$2:$E$59,2,FALSE)),\" \",VLOOKUP(K22,[2]Proposito_programa!$C$2:$E$59,2,FALSE))","v":"Gestión pública local"},{"$f":"IF(ISERROR(VLOOKUP(K22,[2]Proposito_programa!$C$2:$E$59,3,FALSE)),\" \",VLOOKUP(K22,[2]Proposito_programa!$C$2:$E$59,3,FALSE))","v":"Propósito 5: Construir Bogotá - Región con gobierno abierto, transparente y ciudadanía consciente"},1783,1,1014177647,"NAIRA CAROLINA PARRA BELTRAN","Persona Natural",null,null,null,44338410,null,2,11495144,55833554,48115386,"2021-02-08","2021-02-08","2022-01-17","274 DÍAS",2,71,null,null,null,null,null,null,"X",null,0.79]
[10,2021,"FDLF-CD-10-2021","https://community.secop.gov.co/Public/Tendering/OpportunityDetail/Index?noticeUID=CO1.NTC.1738165&isFromPublicArea=True&isModal=true&asPopupView=true","Contratos de prestación de servicios profesionales y de apoyo a la gestión","Contratación directa","Prestación de servicios profesionales y de apoyo a la gestión, o para la ejecución de trabajos artísticos que sólo puedan encomendarse a determinadas personas naturales;","PRESTAR LOS SERVICIOS TÉCNICOS PARA APOYAR LOS PROCESOS DE GESTIÓN ADMINISTRATIVA Y CONTRACTUAL AL FONDO DE DESARROLLO LOCAL DE FONTIBON","Inversión","Un nuevo Contrato Social y ambiental para la Bogotá del Siglo XXI",57,{"$f":"IF(ISERROR(VLOOKUP(K23,[2]Proposito_programa!$C$2:$E$59,2,FALSE)),\" \",VLOOKUP(K23,[2]Proposito_programa!$C$2:$E$59,2,FALSE))","v":"Gestión pública local"},{"$f":"IF(ISERROR(VLOOKUP(K23,[2]Proposito_programa!$C$2:$E$59,3,FALSE)),\" \",VLOOKUP(K23,[2]Proposito_programa!$C$2:$E$59,3,FALSE))","v":"Propósito 5: Construir Bogotá - Región con gobierno abierto, transparente y ciudadanía consciente"},1783,1,1016039271,"JUAN DAVID RAMIREZ MONTOYA","Persona Natural",null,null,null,35226000,null,2,8871733,44097733,38226733,"2021-02-08","2021-02-08","2022-01-15","274 DÍAS",2,68,null,null,null,null,null,null,"X",null,0.8]
[11,2021,"FDLF-CD-11-2021","https://community.secop.gov.co/Public/Tendering/OpportunityDetail/Index?noticeUID=CO1.NTC.1743195&isFromPublicArea=True&isModal=true&asPopupView=true","Contratos de prestación de servicios profesionales y de apoyo a la gestión","Contratación directa","Prestación de servicios profesionales y de apoyo a la gestión, o para la ejecución de trabajos artísticos que sólo puedan encomendarse a determinadas personas naturales;","PRESTACIÓN DE SERVICIOS PROFESIONALES DE APOYO AL ÁREA DE GESTIÓN DE DESARROLLO LOCAL EN PLANEACIÓN EN LAS ACTIVIDADES QUE SE REQUIERAN, DE CONFORMIDAD CON LOS ESTUDIOS PREVIOS.","Inversión","Un nuevo Contrato Social y ambiental para la Bogotá del Siglo XXI",57,{"$f":"IF(ISERROR(VLOOKUP(K24,[2]Proposito_programa!$C$2:$E$59,2,FALSE)),\" \",VLOOKUP(K24,[2]Proposito_programa!$C$2:$E$59,2,FALSE))","v":"Gestión pública local"},{"$f":"IF(ISERROR(VLOOKUP(K24,[2]Proposito_programa!$C$2:$E$59,3,FALSE)),\" \",VLOOKUP(K24,[2]Proposito_programa!$C$2:$E$59,3,FALSE))","v":"Propósito 5: Construir Bogotá - Región con gobierno abierto, transparente y ciudadanía consciente"},1783,1,52352116,"NELLY ANGELICA MELENDEZ NUÑEZ","Persona Natural",null,null,null,38934000,null,1,7354200,46288200,38934000,"2021-02-10","2021-02-10","2022-01-21","274 DÍAS",1,51,null,null,null,null,null,null,"X",null,0.84]
[12,2021,"FDLF-CD-12-2021","https://community.secop.gov.co/Public/Tendering/OpportunityDetail/Index?noticeUID=CO1.NTC.1744406&isFromPublicArea=True&isModal=true&asPopupView=true","Contratos de prestación de servicios profesionales y de apoyo a la gestión","Contratación directa","Prestación de servicios profesionales y de apoyo a la gestión, o para la ejecución de trabajos artísticos que sólo puedan encomendarse a determinadas personas naturales;","PRESTAR SERVICIOS COMO PROFESIONAL PARA REALIZAR EL PROCESO DE LIQUIDACIONES DE LOS CONTRATOS SUSCRITOS POR EL FONDO DE DESARROLLO LOCAL DE FONTIBÓN.","Inversión","Un nuevo Contrato Social y ambiental para la Bogotá del Siglo XXI",57,{"$f":"IF(ISERROR(VLOOKUP(K25,[2]Proposito_programa!$C$2:$E$59,2,FALSE)),\" \",VLOOKUP(K25,[2]Proposito_programa!$C$2:$E$59,2,FALSE))","v":"Gestión pública local"},{"$f":"IF(ISERROR(VLOOKUP(K25,[2]Proposito_programa!$C$2:$E$59,3,FALSE)),\" \",VLOOKUP(K25,[2]Proposito_programa!$C$2:$E$59,3,FALSE))","v":"Propósito 5: Construir Bogotá - Región con gobierno abierto, transparente y ciudadanía consciente"},1783,1,51800753,"MARIBEL SOLIS AVILA","Persona Natural",null,null,null,47700000,null,0,0,47700000,46110000,"2021-02-10","2021-02-10","2021-11-09","274 DÍAS",0,0,null,null,null,null,null,null,"X",null,0.97]
[13,2021,"FDLF-CD-13-2021","https://community.secop.gov.co/Public/Tendering/OpportunityDetail/Index?noticeUID=CO1.NTC.1743686&isFromPublicArea=True&isModal=true&asPopupView=true","Contratos de prestación de servicios profesionales y de apoyo a la gestión","Contratación directa","Prestación de servicios profesionales y de apoyo a la gestión, o para la ejecución de trabajos artísticos que sólo puedan encomendarse a determinadas personas naturales;","PRESTAR SERVICIOS PARA APOYAR JURÍDICAMENTE LA EJECUCIÓN DE LAS ACCIONES REQUERIDAS PARA EL TRÁMITE E IMPULSO PROCESAL DE LAS ACTUACIONES CONTRAVENCIONALES Y/O QUERELLAS QUE CURSEN EN LAS INSPECCIONES DE POLICÍA DE LA LOCALIDAD","Inversión","Un nuevo Contrato Social y ambiental para la Bogotá del Siglo XXI",57,{"$f":"IF(ISERROR(VLOOKUP(K26,[2]Proposito_programa!$C$2:$E$59,2,FALSE)),\" \",VLOOKUP(K26,[2]Proposito_programa!$C$2:$E$59,2,FALSE))","v":"Gestión pública local"},{"$f":"IF(ISERROR(VLOOKUP(K26,[2]Proposito_programa!$C$2:$E$59,3,FALSE)),\" \",VLOOKUP(K26,[2]Proposito_programa!$C$2:$E$59,3,FALSE))","v":"Propósito 5: Construir Bogotá - Región con gobierno abierto, transparente y ciudadanía consciente"},1784,1,79131970,"WILFORD LIBERMAN RODRIGUEZ FONSECA","Persona Natural",null,null,null,24632450,null,2,12316225,36948675,36948675,"2021-02-12","2021-02-12","2021-09-26","152 DÍAS",2,76,null,null,null,null,null,null,"X",null,0.67]
[14,2021,"FDLF-CD-14-2021","https://community.secop.gov.co/Public/Tendering/OpportunityDetail/Index?noticeUID=CO1.NTC.1744162&isFromPublicArea=True&isModal=true&asPopupView=true","Contratos de prestación de servicios profesionales y de apoyo a la gestión","Contratación directa","Prestación de servicios profesionales y de apoyo a la gestión, o para la ejecución de trabajos artísticos que sólo puedan encomendarse a determinadas personas naturales;","PRESTAR SERVICIOS PARA APOYAR JURÍDICAMENTE LA EJECUCIÓN DE LAS ACCIONES REQUERIDAS PARA EL TRÁMITE E IMPULSO PROCESAL DE LAS ACTUACIONES CONTRAVENCIONALES Y/O QUERELLAS QUE CURSEN EN LAS INSPECCIONES DE POLICÍA DE LA LOCALIDAD.","Inversión","Un nuevo Contrato Social y ambiental para la Bogotá del Siglo XXI",57,{"$f":"IF(ISERROR(VLOOKUP(K27,[2]Proposito_programa!$C$2:$E$59,2,FALSE)),\" \",VLOOKUP(K27,[2]Proposito_programa!$C$2:$E$59,2,FALSE))","v":"Gestión pública local"},{"$f":"IF(ISERROR(VLOOKUP(K27,[2]Proposito_programa!$C$2:$E$59,3,FALSE)),\" \",VLOOKUP(K27,[2]Proposito_programa!$C$2:$E$59,3,FALSE))","v":"Propósito 5: Construir Bogotá - Región con gobierno abierto, transparente y ciudadanía consciente"},1784,1,5831620,"RICAURTE TARQUINO BECERRA","Persona Natural",null,null,null,24632450,null,2,12316225,36948675,{"$f":"Z27+W27+X27","v":36948677},"2021-02-10","2021-02-10","2021-09-24","152 DÍAS",2,75,null,null,null,null,null,null,"X",null,0.67]
[15,2021,"FDLF-CD-15-2021","https://community.secop.gov.co/Public/Tendering/OpportunityDetail/Index?noticeUID=CO1.NTC.1744944&isFromPublicArea=True&isModal=true&asPopupView=true","Contratos de prestación de servicios profesionales y de apoyo a la gestión","Contratación directa","Prestación de servicios profesionales y de apoyo a la gestión, o para la ejecución de trabajos artísticos que sólo puedan encomendarse a determinadas personas naturales;","PRESTAR SERVICIOS PARA APOYAR JURÍDICAMENTE LA EJECUCIÓN DE LAS ACCIONES REQUERIDAS PARA EL TRÁMITE E IMPULSO PROCESAL DE LAS ACTUACIONES CONTRAVENCIONALES Y/O QUERELLAS QUE CURSEN EN LAS INSPECCIONES DE POLICÍA DE LA LOCALIDAD","Inversión","Un nuevo Contrato Social y ambiental para la Bogotá del Siglo XXI",57,{"$f":"IF(ISERROR(VLOOKUP(K28,[2]Proposito_programa!$C$2:$E$59,2,FALSE)),\" \",VLOOKUP(K28,[2]Proposito_programa!$C$2:$E$59,2,FALSE))","v":"Gestión pública local"},{"$f":"IF(ISERROR(VLOOKUP(K28,[2]Proposito_programa!$C$2:$E$59,3,FALSE)),\" \",VLOOKUP(K28,[2]Proposito_programa!$C$2:$E$59,3,FALSE))","v":"Propósito 5: Construir Bogotá - Región con gobierno abierto, transparente y ciudadanía consciente"},1784,1,1031152968,"NATALIA ALEJANDRA SEDANO GARZON","Persona Natural",null,null,null,24632450,null,2,12316225,36948675,36948675,"2021-02-10","2021-02-10","2021-09-24","152 DÍAS",2,75,null,null,null,null,null,null,"X",null,0.67]
[16,2021,"FDLF-CD-16-2021","https://community.secop.gov.co/Public/Tendering/OpportunityDetail/Index?noticeUID=CO1.NTC.1744295&isFromPublicArea=True&isModal=true&asPopupView=true","Contratos de prestación de servicios profesionales y de apoyo a la gestión","Contratación directa","Prestación de servicios profesionales y de apoyo a la gestión, o para la ejecución de trabajos artísticos que sólo puedan encomendarse a determinadas personas naturales;","SERVICIOS DE APOYO TÉCNICO AL ÁREA DE GESTIÓN DEL DESARROLLO LOCAL DE FONTIBÓN EN ACTIVIDADES INHERENTES A LA PLANEACIÓN.","Inversión","Un nuevo Contrato Social y ambiental para la Bogotá del Siglo XXI",57,{"$f":"IF(ISERROR(VLOOKUP(K29,[2]Proposito_programa!$C$2:$E$59,2,FALSE)),\" \",VLOOKUP(K29,[2]Proposito_programa!$C$2:$E$59,2,FALSE))","v":"Gestión pública local"},{"$f":"IF(ISERROR(VLOOKUP(K29,[2]Proposito_programa!$C$2:$E$59,3,FALSE)),\" \",VLOOKUP(K29,[2]Proposito_programa!$C$2:$E$59,3,FALSE))","v":"Propósito 5: Construir Bogotá - Región con gobierno abierto, transparente y ciudadanía consciente"},1783,1,51712771,"MARIA ELENA SARMIENTO FRANCO","Persona Natural",null,null,null,39140000,null,0,0,39140000,38096267,"2021-02-09","2021-02-09","2021-12-08","304 DÍAS",0,0,null,null,null,null,null,null,"X",null,0.97]
[17,2021,"FDLF-CD-17-2021","https://community.secop.gov.co/Public/Tendering/OpportunityDetail/Index?noticeUID=CO1.NTC.1744522&isFromPublicArea=True&isModal=true&asPopupView=true","Contratos de prestación de servicios profesionales y de apoyo a la gestión","Contratación directa","Prestación de servicios profesionales y de apoyo a la gestión, o para la ejecución de trabajos artísticos que sólo puedan encomendarse a determinadas personas naturales;","PRESTAR SERVICIOS PROFESIONALES EN DERECHO PARA APOYAR LAS ACTIVIDADES JURÍDICAS Y ADMINISTRATIVAS PROPIAS DE LA CASA DEL CONSUMIDOR, EN EL MARCO DEL CONVENIO SUSCRITO ENTRE LA SUPERINTENDENCIA DE INDUSTRIA Y COMERCIO Y LA ALCALDÍA LOCAL DE FONTIBÓN","Inversión","Un nuevo Contrato Social y ambiental para la Bogotá del Siglo XXI",57,{"$f":"IF(ISERROR(VLOOKUP(K30,[2]Proposito_programa!$C$2:$E$59,2,FALSE)),\" \",VLOOKUP(K30,[2]Proposito_programa!$C$2:$E$59,2,FALSE))","v":"Gestión pública local"},{"$f":"IF(ISERROR(VLOOKUP(K30,[2]Proposito_programa!$C$2:$E$59,3,FALSE)),\" \",VLOOKUP(K30,[2]Proposito_programa!$C$2:$E$59,3,FALSE))","v":"Propósito 5: Construir Bogotá - Región con gobierno abierto, transparente y ciudadanía consciente"},1784,1,28946846,"YOLANDA CALDERON","Persona Natural",null,null,null,44338410,null,2,12480441,56818851,47951169,"2021-02-09","2021-02-09","2022-01-24","274 DÍAS",2,76,null,null,null,null,null,null,"X",null,0.78]
[18,2021,"FDLF-CD-18-2021","https://community.secop.gov.co/Public/Tendering/OpportunityDetail/Index?noticeUID=CO1.NTC.1754577&isFromPublicArea=True&isModal=true&asPopupView=true","Contratos de prestación de servicios profesionales y de apoyo a la gestión","Contratación directa","Prestación de servicios profesionales y de apoyo a la gestión, o para la ejecución de trabajos artísticos que sólo puedan encomendarse a determinadas personas naturales;","PRESTAR SERVICIOS PARA APOYO A LA GESTIÓN DE EXPEDIENTES CONTRACTUALES VIGENTES Y ACTIVOS A CARGO DEL ÁREA DE GESTIÓN DE DESARROLLO LOCAL DE FONTIBÓN.","Inversión","Un nuevo Contrato Social y ambiental para la Bogotá del Siglo XXI",57,{"$f":"IF(ISERROR(VLOOKUP(K31,[2]Proposito_programa!$C$2:$E$59,2,FALSE)),\" \",VLOOKUP(K31,[2]Proposito_programa!$C$2:$E$59,2,FALSE))","v":"Gestión pública local"},{"$f":"IF(ISERROR(VLOOKUP(K31,[2]Proposito_programa!$C$2:$E$59,3,FALSE)),\" \",VLOOKUP(K31,[2]Proposito_programa!$C$2:$E$59,3,FALSE))","v":"Propósito 5: Construir Bogotá - Región con gobierno abierto, transparente y ciudadanía consciente"},1783,1,10197441,"OSCAR EMILIO CORTES RODRIGUEZ","Persona Natural",null,null,null,21905010,null,0,0,21905010,21093713,"2021-02-11","2021-02-11","2021-11-10","274 DÍAS",0,0,null,null,null,null,null,null,"X",null,0.64]
[19,2021,"FDLF-CD-19-2021","https://community.secop.gov.co/Public/Tendering/OpportunityDetail/Index?noticeUID=CO1.NTC.1747591&isFromPublicArea=True&isModal=true&asPopupView=true","Contratos de prestación de servicios profesionales y de apoyo a la gestión","Contratación directa","Prestación de servicios profesionales y de apoyo a la gestión, o para la ejecución de trabajos artísticos que sólo puedan encomendarse a determinadas personas naturales;","PRESTAR SERVICIOS PARA APOYAR ADMINISTRATIVA Y ASISTENCIALMENTE A LAS INSPECCIONES DE POLICÍA DE LA LOCALIDAD.","Inversión","Un nuevo Contrato Social y ambiental para la Bogotá del Siglo XXI",57,{"$f":"IF(ISERROR(VLOOKUP(K32,[2]Proposito_programa!$C$2:$E$59,2,FALSE)),\" \",VLOOKUP(K32,[2]Proposito_programa!$C$2:$E$59,2,FALSE))","v":"Gestión pública local"},{"$f":"IF(ISERROR(VLOOKUP(K32,[2]Proposito_programa!$C$2:$E$59,3,FALSE)),\" \",VLOOKUP(K32,[2]Proposito_programa!$C$2:$E$59,3,FALSE))","v":"Propósito 5: Construir Bogotá - Región con gobierno abierto, transparente y ciudadanía consciente"},1784,1,88220745,"JULIO CESAR CALDERON SUAREZ","Persona Natural",null,null,null,4867780,null,1,2433890,7301670,7301670,"2021-02-10","2021-02-10","2021-05-09","60 DÍAS",1,30,null,null,null,null,null,null,"X",null,0.67]
[20,2021,"FDLF-CD-20-2021","https://community.secop.gov.co/Public/Tendering/OpportunityDetail/Index?noticeUID=CO1.NTC.1748138&isFromPublicArea=True&isModal=true&asPopupView=true","Contratos de prestación de servicios profesionales y de apoyo a la gestión","Contratación directa","Prestación de servicios profesionales y de apoyo a la gestión, o para la ejecución de trabajos artísticos que sólo puedan encomendarse a determinadas personas naturales;","PRESTAR SERVICIOS PARA APOYAR JURÍDICAMENTE LA EJECUCIÓN DE LAS ACCIONES REQUERIDAS PARA EL TRÁMITE E IMPULSO PROCESAL DE LAS ACTUACIONES CONTRAVENCIONALES Y/O QUERELLAS QUE CURSEN EN LAS INSPECCIONES DE POLICÍA DE LA LOCALIDAD","Inversión","Un nuevo Contrato Social y ambiental para la Bogotá del Siglo XXI",57,{"$f":"IF(ISERROR(VLOOKUP(K33,[2]Proposito_programa!$C$2:$E$59,2,FALSE)),\" \",VLOOKUP(K33,[2]Proposito_programa!$C$2:$E$59,2,FALSE))","v":"Gestión pública local"},{"$f":"IF(ISERROR(VLOOKUP(K33,[2]Proposito_programa!$C$2:$E$59,3,FALSE)),\" \",VLOOKUP(K33,[2]Proposito_programa!$C$2:$E$59,3,FALSE))","v":"Propósito 5: Construir Bogotá - Región con gobierno abierto, transparente y ciudadanía consciente"},1784,1,1016074802,"NATALIA ANDREA SERRATO CRUZ","Persona Natural",null,null,null,24632450,null,2,12316225,36948675,32186401,"2021-02-15","2021-02-15","2021-09-29","152 DÍAS",2,76,null,null,null,null,null,null,"X",null,0.67]
[21,2021,"FDLF-CD-21-2021","https://community.secop.gov.co/Public/Tendering/OpportunityDetail/Index?noticeUID=CO1.NTC.1751238&isFromPublicArea=True&isModal=true&asPopupView=true","Contratos de prestación de servicios profesionales y de apoyo a la gestión","Contratación directa","Prestación de servicios profesionales y de apoyo a la gestión, o para la ejecución de trabajos artísticos que sólo puedan encomendarse a determinadas personas naturales;","PRESTAR SERVICIOS PARA APOYAR ADMINISTRATIVA Y ASISTENCIALMENTE A LAS INSPECCIONES DE POLICÍA DE LA LOCALIDAD.","Inversión","Un nuevo Contrato Social y ambiental para la Bogotá del Siglo XXI",57,{"$f":"IF(ISERROR(VLOOKUP(K34,[2]Proposito_programa!$C$2:$E$59,2,FALSE)),\" \",VLOOKUP(K34,[2]Proposito_programa!$C$2:$E$59,2,FALSE))","v":"Gestión pública local"},{"$f":"IF(ISERROR(VLOOKUP(K34,[2]Proposito_programa!$C$2:$E$59,3,FALSE)),\" \",VLOOKUP(K34,[2]Proposito_programa!$C$2:$E$59,3,FALSE))","v":"Propósito 5: Construir Bogotá - Región con gobierno abierto, transparente y ciudadanía consciente"},1784,1,35221867,"MARIA JOHANA LOPEZ ULCUE","Persona Natural",null,null,null,4867780,null,1,2433890,7301670,{"$f":"Z34+W34+X34","v":7301671},"2021-02-12","2021-02-12","2021-05-11","60 DÍAS",1,30,null,null,null,null,null,null,"X",null,1]
[22,2021,"FDLF-CD-22-2021","https://community.secop.gov.co/Public/Tendering/OpportunityDetail/Index?noticeUID=CO1.NTC.1752348&isFromPublicArea=True&isModal=true&asPopupView=true","Contratos de prestación de servicios profesionales y de apoyo a la gestión","Contratación directa","Prestación de servicios profesionales y de apoyo a la gestión, o para la ejecución de trabajos artísticos que sólo puedan encomendarse a determinadas personas naturales;","PRESTACIÓN DE SERVICIOS PROFESIONALES DE APOYO AL ÁREA DE GESTIÓN DE DESARROLLO LOCAL, EN PRESUPUESTO, EN LAS ACTIVIDADES QUE ALLÍ SE GENEREN Y LE SEAN DESIGNADAS, DE CONFORMIDAD CON LOS ESTUDIOS PREVIOS","Inversión","Un nuevo Contrato Social y ambiental para la Bogotá del Siglo XXI",57,{"$f":"IF(ISERROR(VLOOKUP(K35,[2]Proposito_programa!$C$2:$E$59,2,FALSE)),\" \",VLOOKUP(K35,[2]Proposito_programa!$C$2:$E$59,2,FALSE))","v":"Gestión pública local"},{"$f":"IF(ISERROR(VLOOKUP(K35,[2]Proposito_programa!$C$2:$E$59,3,FALSE)),\" \",VLOOKUP(K35,[2]Proposito_programa!$C$2:$E$59,3,FALSE))","v":"Propósito 5: Construir Bogotá - Región con gobierno abierto, transparente y ciudadanía consciente"},1783,1,51688411,"NELLY STELLA LOPEZ SILVA","Persona Natural",null,null,null,44338410,null,0,0,44338410,44338410,"2021-02-11","2021-02-11","2021-11-10","274 DÍAS",0,0,null,null,null,null,null,null,"X",null,1]
[23,2021,"FDLF-CD-23-2021","https://community.secop.gov.co/Public/Tendering/OpportunityDetail/Index?noticeUID=CO1.NTC.1755635&isFromPublicArea=True&isModal=true&asPopupView=true","Contratos de prestación de servicios profesionales y de apoyo a la gestión","Contratación directa","Prestación de servicios profesionales y de apoyo a la gestión, o para la ejecución de trabajos artísticos que sólo puedan encomendarse a determinadas personas naturales;","PRESTAR SERVICIOS PARA APOYAR ADMINISTRATIVA Y ASISTENCIALMENTE A LAS INSPECCIONES DE POLICÍA DE LA LOCALIDAD.","Inversión","Un nuevo Contrato Social y ambiental para la Bogotá del Siglo XXI",57,{"$f":"IF(ISERROR(VLOOKUP(K36,[2]Proposito_programa!$C$2:$E$59,2,FALSE)),\" \",VLOOKUP(K36,[2]Proposito_programa!$C$2:$E$59,2,FALSE))","v":"Gestión pública local"},{"$f":"IF(ISERROR(VLOOKUP(K36,[2]Proposito_programa!$C$2:$E$59,3,FALSE)),\" \",VLOOKUP(K36,[2]Proposito_programa!$C$2:$E$59,3,FALSE))","v":"Propósito 5: Construir Bogotá - Región con gobierno abierto, transparente y ciudadanía consciente"},1784,1,39760197,"SONIA YASMIN BAQUERO PARRADO","Persona Natural",null,null,null,4867780,null,1,2433890,7301670,7301670,"2021-02-16","2021-02-16","2021-05-15","60 DÍAS",1,30,null,null,null,null,null,null,"X",null,0.67]
[24,2021,"FDLF-CD-24-2021","https://community.secop.gov.co/Public/Tendering/OpportunityDetail/Index?noticeUID=CO1.NTC.1756071&isFromPublicArea=True&isModal=true&asPopupView=true","Contratos de prestación de servicios profesionales y de apoyo a la gestión","Contratación directa","Prestación de servicios profesionales y de apoyo a la gestión, o para la ejecución de trabajos artísticos que sólo puedan encomendarse a determinadas personas naturales;","PRESTAR SERVICIOS APOYO A LAS ACTIVIDADES CORRESPONDIENTES A TEMAS DE MALLA VIAL, OBRAS, ESPACIO PÚBLICO E INFRAESTRUCTURA PARA LA ALCALDÍA LOCAL DE FONTIBÓN.","Inversión","Un nuevo Contrato Social y ambiental para la Bogotá del Siglo XXI",49,{"$f":"IF(ISERROR(VLOOKUP(K37,[2]Proposito_programa!$C$2:$E$59,2,FALSE)),\" \",VLOOKUP(K37,[2]Proposito_programa!$C$2:$E$59,2,FALSE))","v":"Movilidad segura, sostenible y accesible"},{"$f":"IF(ISERROR(VLOOKUP(K37,[2]Proposito_programa!$C$2:$E$59,3,FALSE)),\" \",VLOOKUP(K37,[2]Proposito_programa!$C$2:$E$59,3,FALSE))","v":"Propósito 4: Hacer de Bogotá Región un modelo de movilidad multimodal, incluyente y sostenible"},1780,1,19497903,"EDGAR AUGUSTO GRANADOS MEJIA","Persona Natural",null,null,null,35226000,null,1,4566333,39792333,35878333,"2021-02-26","2021-02-26","2021-12-31","274 DÍAS",1,35,null,null,null,null,null,null,"X",null,0.89]
[25,2021,"FDLF-CD-25-2021","https://community.secop.gov.co/Public/Tendering/OpportunityDetail/Index?noticeUID=CO1.NTC.1758623&isFromPublicArea=True&isModal=true&asPopupView=true","Contratos de prestación de servicios profesionales y de apoyo a la gestión","Contratación directa","Prestación de servicios profesionales y de apoyo a la gestión, o para la ejecución de trabajos artísticos que sólo puedan encomendarse a determinadas personas naturales;","SERVICIOS PROFESIONALES PARA LA OPERACIÓN, PRESTACIÓN, SEGUIMIENTO Y CUMPLIMIENTO DE LOS PROCEDIMIENTOS ADMINISTRATIVOS, OPERATIVOS Y PROGRAMÁTICOS DEL SERVICIO APOYO ECONÓMICO TIPO C, QUE CONTRIBUYAN A LA GARANTÍA DE LOS DERECHOS DE LA POBLACIÓN MAYOR EN EL MARCO DE LA POLÍTICA PÚBLICA SOCIAL PARA EL ENVEJECIMIENTO Y LA VEJEZ EN EL DISTRITO CAPITAL A CARGO DE LA ALCALDÍA LOCAL","Inversión","Un nuevo Contrato Social y ambiental para la Bogotá del Siglo XXI",1,{"$f":"IF(ISERROR(VLOOKUP(K38,[2]Proposito_programa!$C$2:$E$59,2,FALSE)),\" \",VLOOKUP(K38,[2]Proposito_programa!$C$2:$E$59,2,FALSE))","v":"Subsidios y transferencias para la equidad"},{"$f":"IF(ISERROR(VLOOKUP(K38,[2]Proposito_programa!$C$2:$E$59,3,FALSE)),\" \",VLOOKUP(K38,[2]Proposito_programa!$C$2:$E$59,3,FALSE))","v":"Propósito 1: Hacer un nuevo contrato social para incrementar la inclusión social, productiva y política"},1752,1,52783244,"DUDLEY JOHANNA PALACIOS GARCIA","Persona Natural",null,null,null,49264900,null,1,7061302,56326202,46965871,"2021-02-15","2021-02-15","2022-01-24","304 DÍAS",1,43,52483298,"JENNY GISELA CUERVO LÓPEZ","2021-03-10",44995276,null,null,"X",null,0.62]
[26,2021,"FDLF-CD-26-2021","https://community.secop.gov.co/Public/Tendering/OpportunityDetail/Index?noticeUID=CO1.NTC.1758437&isFromPublicArea=True&isModal=true&asPopupView=true","Contratos de prestación de servicios profesionales y de apoyo a la gestión","Contratación directa","Prestación de servicios profesionales y de apoyo a la gestión, o para la ejecución de trabajos artísticos que sólo puedan encomendarse a determinadas personas naturales;","PRESTAR SERVICIOS PROFESIONALES DE APOYO EN LOS PROCESOS DE COBRO PERSUASIVO DE LAS OBLIGACIONES CLARAS, EXPRESAS Y ACTUALMENTE EXIGIBLES, POR CONCEPTO DE MULTAS IMPUESTAS POR EL ÁREA DE GESTIÓN POLICIVA.","Inversión","Un nuevo Contrato Social y ambiental para la Bogotá del Siglo XXI",57,{"$f":"IF(ISERROR(VLOOKUP(K39,[2]Proposito_programa!$C$2:$E$59,2,FALSE)),\" \",VLOOKUP(K39,[2]Proposito_programa!$C$2:$E$59,2,FALSE))","v":"Gestión pública local"},{"$f":"IF(ISERROR(VLOOKUP(K39,[2]Proposito_programa!$C$2:$E$59,3,FALSE)),\" \",VLOOKUP(K39,[2]Proposito_programa!$C$2:$E$59,3,FALSE))","v":"Propósito 5: Construir Bogotá - Región con gobierno abierto, transparente y ciudadanía consciente"},1784,1,36302596,"CLARA ISABER RAMIREZ CORDOBA","Persona Natural",null,null,null,47700000,null,2,12896667,60596667,{"$f":"50526667-1984903","v":48541764},"2021-02-15","2021-02-15","2022-01-27","274 DÍAS",2,73,null,null,null,null,null,null,"X",null,0.79]
[27,2021,"FDLF-CD-27-2021","https://community.secop.gov.co/Public/Tendering/OpportunityDetail/Index?noticeUID=CO1.NTC.1760074&isFromPublicArea=True&isModal=true&asPopupView=true","Contratos de prestación de servicios profesionales y de apoyo a la gestión","Contratación directa","Prestación de servicios profesionales y de apoyo a la gestión, o para la ejecución de trabajos artísticos que sólo puedan encomendarse a determinadas personas naturales;","PRESTAR SERVICIOS PARA APOYAR ADMINISTRATIVA Y ASISTENCIALMENTE A LAS INSPECCIONES DE POLICÍA DE LA LOCALIDAD.","Inversión","Un nuevo Contrato Social y ambiental para la Bogotá del Siglo XXI",57,{"$f":"IF(ISERROR(VLOOKUP(K40,[2]Proposito_programa!$C$2:$E$59,2,FALSE)),\" \",VLOOKUP(K40,[2]Proposito_programa!$C$2:$E$59,2,FALSE))","v":"Gestión pública local"},{"$f":"IF(ISERROR(VLOOKUP(K40,[2]Proposito_programa!$C$2:$E$59,3,FALSE)),\" \",VLOOKUP(K40,[2]Proposito_programa!$C$2:$E$59,3,FALSE))","v":"Propósito 5: Construir Bogotá - Región con gobierno abierto, transparente y ciudadanía consciente"},1784,1,1016018384,"DIEGO ALEJANDRO CASTRO MUNZA","Persona Natural",null,null,null,4867780,null,1,2433890,7301670,7301670,"2021-02-17","2021-02-17","2021-05-16","60 DÍAS",1,30,null,null,null,null,null,null,"X",null,0.67]
[28,2021,"FDLF-CD-28-2021","https://community.secop.gov.co/Public/Tendering/OpportunityDetail/Index?noticeUID=CO1.NTC.1767701&isFromPublicArea=True&isModal=true&asPopupView=true","Contratos de prestación de servicios profesionales y de apoyo a la gestión","Contratación directa","Prestación de servicios profesionales y de apoyo a la gestión, o para la ejecución de trabajos artísticos que sólo puedan encomendarse a determinadas personas naturales;","SERVICIOS PARA EL APOYO EN LA CONDUCCIÓN DE VEHÍCULOS AL SERVICIO DE LA ALCALDÍA LOCAL DE FONTIBÓN","Inversión","Un nuevo Contrato Social y ambiental para la Bogotá del Siglo XXI",57,{"$f":"IF(ISERROR(VLOOKUP(K41,[2]Proposito_programa!$C$2:$E$59,2,FALSE)),\" \",VLOOKUP(K41,[2]Proposito_programa!$C$2:$E$59,2,FALSE))","v":"Gestión pública local"},{"$f":"IF(ISERROR(VLOOKUP(K41,[2]Proposito_programa!$C$2:$E$59,3,FALSE)),\" \",VLOOKUP(K41,[2]Proposito_programa!$C$2:$E$59,3,FALSE))","v":"Propósito 5: Construir Bogotá - Región con gobierno abierto, transparente y ciudadanía consciente"},1783,1,80066595,"JHON FREDY ORDUZ ORTIZ","Persona Natural",null,null,null,21905010,null,0,0,21905010,21905010,"2021-02-16","2021-02-16","2021-11-15","274 DÍAS",0,0,null,null,null,null,null,null,"X",null,1]
[29,2021,"FDLF-CD-29-2021","https://community.secop.gov.co/Public/Tendering/OpportunityDetail/Index?noticeUID=CO1.NTC.1769170&isFromPublicArea=True&isModal=true&asPopupView=true","Contratos de prestación de servicios profesionales y de apoyo a la gestión","Contratación directa","Prestación de servicios profesionales y de apoyo a la gestión, o para la ejecución de trabajos artísticos que sólo puedan encomendarse a determinadas personas naturales;","PRESTAR SERVICIOS PROFESIONALES DE APOYO CONTABLE EN LOS PROCESOS DE CAUSACIÓN, SISTEMATIZACIÓN Y REGISTROS DE INFORMACIÓN CONTABLE Y A LA GESTIÓN PRESUPUESTAL DEL FONDO DE DESARROLLO LOCAL.","Inversión","Un nuevo Contrato Social y ambiental para la Bogotá del Siglo XXI",57,{"$f":"IF(ISERROR(VLOOKUP(K42,[2]Proposito_programa!$C$2:$E$59,2,FALSE)),\" \",VLOOKUP(K42,[2]Proposito_programa!$C$2:$E$59,2,FALSE))","v":"Gestión pública local"},{"$f":"IF(ISERROR(VLOOKUP(K42,[2]Proposito_programa!$C$2:$E$59,3,FALSE)),\" \",VLOOKUP(K42,[2]Proposito_programa!$C$2:$E$59,3,FALSE))","v":"Propósito 5: Construir Bogotá - Región con gobierno abierto, transparente y ciudadanía consciente"},1783,1,79938920,"JHON FREDY ROA PINTO","Persona Natural",null,null,null,44338410,null,1,5090706,49429116,44502627,"2021-02-17","2021-02-17","2021-12-31","274 DÍAS",1,31,null,null,null,null,null,null,"X",null,0.9]
[30,2021,"FDLF-CD-30-2021","https://community.secop.gov.co/Public/Tendering/OpportunityDetail/Index?noticeUID=CO1.NTC.1767902&isFromPublicArea=True&isModal=true&asPopupView=true","Contratos de prestación de servicios profesionales y de apoyo a la gestión","Contratación directa","Prestación de servicios profesionales y de apoyo a la gestión, o para la ejecución de trabajos artísticos que sólo puedan encomendarse a determinadas personas naturales;","SERVICIOS PARA EL APOYO EN LA CONDUCCIÓN DE VEHÍCULOS AL SERVICIO DE LA ALCALDÍA LOCAL DE FONTIBÓN","Inversión","Un nuevo Contrato Social y ambiental para la Bogotá del Siglo XXI",57,{"$f":"IF(ISERROR(VLOOKUP(K43,[2]Proposito_programa!$C$2:$E$59,2,FALSE)),\" \",VLOOKUP(K43,[2]Proposito_programa!$C$2:$E$59,2,FALSE))","v":"Gestión pública local"},{"$f":"IF(ISERROR(VLOOKUP(K43,[2]Proposito_programa!$C$2:$E$59,3,FALSE)),\" \",VLOOKUP(K43,[2]Proposito_programa!$C$2:$E$59,3,FALSE))","v":"Propósito 5: Construir Bogotá - Región con gobierno abierto, transparente y ciudadanía consciente"},1783,1,11385997,"JULIO ARMANDO GARZON MONTAÑEZ","Persona Natural",null,null,null,21905010,null,1,2515020,24420030,21986140,"2021-02-16","2021-02-16","2021-12-31","274 DÍAS",1,31,null,null,null,null,null,null,"X",null,0.85]
[31,2021,"FDLF-CD-31-2021","https://community.secop.gov.co/Public/Tendering/OpportunityDetail/Index?noticeUID=CO1.NTC.1768636&isFromPublicArea=True&isModal=true&asPopupView=true","Contratos de prestación de servicios profesionales y de apoyo a la gestión","Contratación directa","Prestación de servicios profesionales y de apoyo a la gestión, o para la ejecución de trabajos artísticos que sólo puedan encomendarse a determinadas personas naturales;","PRESTAR SERVICIOS PROFESIONALES PARA APOYAR LOS PROCESOS RELACIONADOS CON LOS CONTRATOS DE INVERSIÓN, VERIFICACIÓN DEL PROCEDIMIENTO DE PAGOS Y REVISIÓN DE CARPETAS ALLEGADAS AL DESPACHO PARA SU RESPECTIVA FIRMA DEL ALCALDE LOCAL","Inversión","Un nuevo Contrato Social y ambiental para la Bogotá del Siglo XXI",57,{"$f":"IF(ISERROR(VLOOKUP(K44,[2]Proposito_programa!$C$2:$E$59,2,FALSE)),\" \",VLOOKUP(K44,[2]Proposito_programa!$C$2:$E$59,2,FALSE))","v":"Gestión pública local"},{"$f":"IF(ISERROR(VLOOKUP(K44,[2]Proposito_programa!$C$2:$E$59,3,FALSE)),\" \",VLOOKUP(K44,[2]Proposito_programa!$C$2:$E$59,3,FALSE))","v":"Propósito 5: Construir Bogotá - Región con gobierno abierto, transparente y ciudadanía consciente"},1783,1,7182813,"JEFFER DARIO BUITRAGO BETANCUR","Persona Natural",null,null,null,38934000,null,0,0,38934000,36771000,"2021-02-16","2021-02-16","2021-11-15","274 DÍAS",0,0,null,null,null,null,null,null,"X",null,0.94]
[32,2021,"FDLF-CD-32-2021","https://community.secop.gov.co/Public/Tendering/OpportunityDetail/Index?noticeUID=CO1.NTC.1769620&isFromPublicArea=True&isModal=true&asPopupView=true","Contratos de prestación de servicios profesionales y de apoyo a la gestión","Contratación directa","Prestación de servicios profesionales y de apoyo a la gestión, o para la ejecución de trabajos artísticos que sólo puedan encomendarse a determinadas personas naturales;","SERVICIOS PROFESIONALES DE APOYO CONTABLE EN LOS PROCESOS DE CAUSACIÓN, SISTEMATIZACIÓN Y REGISTROS DE INFORMACIÓN CONTABLE","Inversión","Un nuevo Contrato Social y ambiental para la Bogotá del Siglo XXI",57,{"$f":"IF(ISERROR(VLOOKUP(K45,[2]Proposito_programa!$C$2:$E$59,2,FALSE)),\" \",VLOOKUP(K45,[2]Proposito_programa!$C$2:$E$59,2,FALSE))","v":"Gestión pública local"},{"$f":"IF(ISERROR(VLOOKUP(K45,[2]Proposito_programa!$C$2:$E$59,3,FALSE)),\" \",VLOOKUP(K45,[2]Proposito_programa!$C$2:$E$59,3,FALSE))","v":"Propósito 5: Construir Bogotá - Región con gobierno abierto, transparente y ciudadanía consciente"},1783,1,79378439,"ELMAN CIFUENTES CASTAÑEDA","Persona Natural",null,null,null,9000000,null,1,4500000,13500000,13500000,"2021-02-16","2021-02-16","2021-05-15","60 DÍAS",1,30,null,null,null,null,null,null,"X",null,1]
[33,2021,"FDLF-CD-33-2021","https://community.secop.gov.co/Public/Tendering/OpportunityDetail/Index?noticeUID=CO1.NTC.1770267&isFromPublicArea=True&isModal=true&asPopupView=true","Contratos de prestación de servicios profesionales y de apoyo a la gestión","Contratación directa","Prestación de servicios profesionales y de apoyo a la gestión, o para la ejecución de trabajos artísticos que sólo puedan encomendarse a determinadas personas naturales;","PRESTAR LOS SERVICIOS PROFESIONALES PARA APOYAR LA ALCALDÍA LOCAL DE FONTIBÓN EN TEMAS RELACIONADOS CON RESTAURACIÓN ECOLÓGICA, SIEMBRA Y MANTENIMIENTO DE ARBOLADO URBANO","Inversión","Un nuevo Contrato Social y ambiental para la Bogotá del Siglo XXI",33,{"$f":"IF(ISERROR(VLOOKUP(K46,[2]Proposito_programa!$C$2:$E$59,2,FALSE)),\" \",VLOOKUP(K46,[2]Proposito_programa!$C$2:$E$59,2,FALSE))","v":"Más árboles y más y mejor espacio público"},{"$f":"IF(ISERROR(VLOOKUP(K46,[2]Proposito_programa!$C$2:$E$59,3,FALSE)),\" \",VLOOKUP(K46,[2]Proposito_programa!$C$2:$E$59,3,FALSE))","v":"Propósito 2 : Cambiar Nuestros Hábitos de Vida para Reverdecer a Bogotá y Adaptarnos y Mitigar la Crisis Climática"},1769,1,79793957,"LUCAS DAVID CARDOZO CARRILLO","Persona Natural",null,null,null,30000000,null,0,0,{"$f":"Y46+V46+W46","v":30000000},27166667,"2021-02-18","2021-02-18","2021-08-17","182 DÍAS",0,0,null,null,null,null,null,null,"X",null,0.91]
[34,2021,"FDLF-CD-34-2021","https://community.secop.gov.co/Public/Tendering/OpportunityDetail/Index?noticeUID=CO1.NTC.1774553&isFromPublicArea=True&isModal=true&asPopupView=true","Contratos de prestación de servicios profesionales y de apoyo a la gestión","Contratación directa","Prestación de servicios profesionales y de apoyo a la gestión, o para la ejecución de trabajos artísticos que sólo puedan encomendarse a determinadas personas naturales;","SERVICIOS PARA EL APOYO EN LA CONDUCCIÓN DE VEHÍCULOS AL SERVICIO DE LA ALCALDÍA LOCAL DE FONTIBÓN","Inversión","Un nuevo Contrato Social y ambiental para la Bogotá del Siglo XXI",57,{"$f":"IF(ISERROR(VLOOKUP(K47,[2]Proposito_programa!$C$2:$E$59,2,FALSE)),\" \",VLOOKUP(K47,[2]Proposito_programa!$C$2:$E$59,2,FALSE))","v":"Gestión pública local"},{"$f":"IF(ISERROR(VLOOKUP(K47,[2]Proposito_programa!$C$2:$E$59,3,FALSE)),\" \",VLOOKUP(K47,[2]Proposito_programa!$C$2:$E$59,3,FALSE))","v":"Propósito 5: Construir Bogotá - Región con gobierno abierto, transparente y ciudadanía consciente"},1783,1,79463263,"YOVANNY BUITRAGO CACERES","Persona Natural",null,null,null,21905010,null,1,2758409,24663419,22067270,"2021-02-18","2021-02-18","2021-12-31","274 DÍAS",1,34,null,null,null,null,null,null,"X",null,0.89]
[35,2021,"FDLF-CD-35-2021","https://community.secop.gov.co/Public/Tendering/OpportunityDetail/Index?noticeUID=CO1.NTC.1775577&isFromPublicArea=True&isModal=true&asPopupView=true","Contratos de prestación de servicios profesionales y de apoyo a la gestión","Contratación directa","Prestación de servicios profesionales y de apoyo a la gestión, o para la ejecución de trabajos artísticos que sólo puedan encomendarse a determinadas personas naturales;","PRESTAR SERVICIOS PROFESIONALES PARA EL DESARROLLO DE ACTIVIDADES ORIENTADAS A LA IMPLEMENTACIÓN DEL PROYECTO ESTRATÉGICO EN EL ÁREA DE GESTIÓN DEL DESARROLLO LOCAL DE LA ALCALDÍA LOCAL DE FONTIBÓN.","Inversión","Un nuevo Contrato Social y ambiental para la Bogotá del Siglo XXI",43,{"$f":"IF(ISERROR(VLOOKUP(K48,[2]Proposito_programa!$C$2:$E$59,2,FALSE)),\" \",VLOOKUP(K48,[2]Proposito_programa!$C$2:$E$59,2,FALSE))","v":"Cultura ciudadana para la confianza, la convivencia y la participación desde la vida cotidiana"},{"$f":"IF(ISERROR(VLOOKUP(K48,[2]Proposito_programa!$C$2:$E$59,3,FALSE)),\" \",VLOOKUP(K48,[2]Proposito_programa!$C$2:$E$59,3,FALSE))","v":"Propósito 3: Inspirar confianza y legitimidad para vivir sin miedo y ser epicentro de cultura ciudadana, paz y reconciliación"},1775,1,73161809,"FARID PUELLO PEREZ","Persona Natural",null,null,null,21805000,null,0,0,21805000,21805000,"2021-02-22","2021-02-22","2021-07-21","274 DÍAS",0,0,null,null,null,null,null,null,"X",null,1]
[36,2021,"FDLF-CD-36-2021","https://community.secop.gov.co/Public/Tendering/OpportunityDetail/Index?noticeUID=CO1.NTC.1775978&isFromPublicArea=True&isModal=true&asPopupView=true","Contratos de prestación de servicios profesionales y de apoyo a la gestión","Contratación directa","Prestación de servicios profesionales y de apoyo a la gestión, o para la ejecución de trabajos artísticos que sólo puedan encomendarse a determinadas personas naturales;","APOYAR AL EQUIPO DE PRENSA Y COMUNICACIONES DE LA ALCALDÍA LOCAL EN LA REALIZACIÓN DE PRODUCTOS Y PIEZAS DIGITALES, IMPRESAS Y PUBLICITARIAS DE GRAN FORMATO Y DE ANIMACIÓN GRÁFICA, ASÍ COMO APOYAR LA PRODUCCIÓN Y MONTAJE DE EVENTOS.","Inversión","Un nuevo Contrato Social y ambiental para la Bogotá del Siglo XXI",57,{"$f":"IF(ISERROR(VLOOKUP(K49,[2]Proposito_programa!$C$2:$E$59,2,FALSE)),\" \",VLOOKUP(K49,[2]Proposito_programa!$C$2:$E$59,2,FALSE))","v":"Gestión pública local"},{"$f":"IF(ISERROR(VLOOKUP(K49,[2]Proposito_programa!$C$2:$E$59,3,FALSE)),\" \",VLOOKUP(K49,[2]Proposito_programa!$C$2:$E$59,3,FALSE))","v":"Propósito 5: Construir Bogotá - Región con gobierno abierto, transparente y ciudadanía consciente"},1783,1,1010193154,"ERIKA LIZETH VASQUEZ RAMIREZ","Persona Natural",null,null,null,21630000,null,1,10815000,32445000,32445000,"2021-02-22","2021-02-22","2021-10-06","152 DÍAS",1,75,null,null,null,null,null,null,"X",null,0.67]
[37,2021,"FDLF-CD-37-2021","https://community.secop.gov.co/Public/Tendering/OpportunityDetail/Index?noticeUID=CO1.NTC.1777272&isFromPublicArea=True&isModal=true&asPopupView=true","Contratos de prestación de servicios profesionales y de apoyo a la gestión","Contratación directa","Prestación de servicios profesionales y de apoyo a la gestión, o para la ejecución de trabajos artísticos que sólo puedan encomendarse a determinadas personas naturales;","PRESTACIÓN DE SERVICIOS ESPECIALIZADOS DE APOYO AL DESPACHO DEL ALCALDE LOCAL EN LA REVISIÓN, GESTIÓN, EJECUCIÓN Y SEGUIMIENTO DE LA EJECUCIÓN PRESUPUESTAL, PROCESO ADMINISTRATIVOS, CONTRACTUALES Y ORGANIZACIONALES DEL ÁREA DE GESTIÓN POLICIVA Y JURÍDICA Y EL ÁREA DE GESTIÓN DE GESTIÓN DE DESARROLLO LOCAL QUE LE SEAN REQUERIDOS, DE CONFORMIDAD CON LOS ESTUDIOS PREVIOS","Inversión","Un nuevo Contrato Social y ambiental para la Bogotá del Siglo XXI",57,{"$f":"IF(ISERROR(VLOOKUP(K50,[2]Proposito_programa!$C$2:$E$59,2,FALSE)),\" \",VLOOKUP(K50,[2]Proposito_programa!$C$2:$E$59,2,FALSE))","v":"Gestión pública local"},{"$f":"IF(ISERROR(VLOOKUP(K50,[2]Proposito_programa!$C$2:$E$59,3,FALSE)),\" \",VLOOKUP(K50,[2]Proposito_programa!$C$2:$E$59,3,FALSE))","v":"Propósito 5: Construir Bogotá - Región con gobierno abierto, transparente y ciudadanía consciente"},1783,1,1014182635,"HEIDI VANESSA SARAY GUATAQUIRA","Persona Natural",null,null,null,78300000,null,0,0,78300000,73370000,"2021-02-18","2021-02-18","2021-11-17","274 DÍAS",0,0,80186689,"HERNAN DAVID MONSALVE DOMINGUEZ","2021-09-01",22330000,null,null,"X",null,0.94]
[38,2021,"FDLF-CD-38-2021","https://community.secop.gov.co/Public/Tendering/OpportunityDetail/Index?noticeUID=CO1.NTC.1778906&isFromPublicArea=True&isModal=true&asPopupView=true","Contratos de prestación de servicios profesionales y de apoyo a la gestión","Contratación directa","Prestación de servicios profesionales y de apoyo a la gestión, o para la ejecución de trabajos artísticos que sólo puedan encomendarse a determinadas personas naturales;","PRESTACIÓN DE SERVICIOS PROFESIONAL DE APOYO AL ÁREA DE GESTIÓN DE DESARROLLO LOCAL PARA LA GESTIÓN DE FORTALECIMIENTO A MIPYMES Y DEMÁS ASUNTOS RELACIONADOS CON EL CUMPLIMIENTO DE ACTIVIDADES DE COMPETITIVIDAD Y DESARROLLO ECONÓMICO DE LA LOCALIDAD DE FONTIBÓN.","Inversión","Un nuevo Contrato Social y ambiental para la Bogotá del Siglo XXI",6,{"$f":"IF(ISERROR(VLOOKUP(K51,[2]Proposito_programa!$C$2:$E$59,2,FALSE)),\" \",VLOOKUP(K51,[2]Proposito_programa!$C$2:$E$59,2,FALSE))","v":"Sistema Distrital de Cuidado"},{"$f":"IF(ISERROR(VLOOKUP(K51,[2]Proposito_programa!$C$2:$E$59,3,FALSE)),\" \",VLOOKUP(K51,[2]Proposito_programa!$C$2:$E$59,3,FALSE))","v":"Propósito 1: Hacer un nuevo contrato social para incrementar la inclusión social, productiva y política"},1761,1,80040922,"ANDRES FERNANDO ACERO DIAZ","Persona Natural",null,null,null,58500000,null,0,0,58500000,52649999,"2021-02-19","2021-02-19","2021-11-28","274 DÍAS",0,0,null,null,null,null,null,null,"X",null,0.83]
[39,2021,"FDLF-CD-39-2021","https://community.secop.gov.co/Public/Tendering/OpportunityDetail/Index?noticeUID=CO1.NTC.1779752&isFromPublicArea=True&isModal=true&asPopupView=true","Contratos de prestación de servicios profesionales y de apoyo a la gestión","Contratación directa","Prestación de servicios profesionales y de apoyo a la gestión, o para la ejecución de trabajos artísticos que sólo puedan encomendarse a determinadas personas naturales;","PRESTACIÓN DE SERVICIOS COMO PROFESIONAL ESPECIALIZADO PARA ORIENTAR AL ÁREA DE GESTIÓN DE DESARROLLO EN LAS ACTIVIDADES DE REVISIÓN, CONTROL, SEGUIMIENTO A LOS PROYECTOS A CARGO DE LA ALCALDÍA LOCAL DE FONTIBÓN.","Inversión","Un nuevo Contrato Social y ambiental para la Bogotá del Siglo XXI",57,{"$f":"IF(ISERROR(VLOOKUP(K52,[2]Proposito_programa!$C$2:$E$59,2,FALSE)),\" \",VLOOKUP(K52,[2]Proposito_programa!$C$2:$E$59,2,FALSE))","v":"Gestión pública local"},{"$f":"IF(ISERROR(VLOOKUP(K52,[2]Proposito_programa!$C$2:$E$59,3,FALSE)),\" \",VLOOKUP(K52,[2]Proposito_programa!$C$2:$E$59,3,FALSE))","v":"Propósito 5: Construir Bogotá - Región con gobierno abierto, transparente y ciudadanía consciente"},1783,1,32294897,"YAJAIRA CUESTA MACHUCA","Persona Natural",null,null,null,80100000,null,0,0,80100000,{"$f":"73870000-9293334","v":64576666},"2021-02-22","2021-02-22","2021-11-21","274 DÍAS",0,0,null,null,null,null,null,null,"X",null,0.92]
[40,2021,"FDLF-CD-40-2021","https://community.secop.gov.co/Public/Tendering/OpportunityDetail/Index?noticeUID=CO1.NTC.1783427&isFromPublicArea=True&isModal=true&asPopupView=true","Contratos de prestación de servicios profesionales y de apoyo a la gestión","Contratación directa","Prestación de servicios profesionales y de apoyo a la gestión, o para la ejecución de trabajos artísticos que sólo puedan encomendarse a determinadas personas naturales;","PRESTAR SERVICIOS PARA APOYAR LAS LABORES DE NOTIFICACIÓN DE CORRESPONDENCIA DE LA ALCALDÍA LOCAL DE FONTIBÓN","Inversión","Un nuevo Contrato Social y ambiental para la Bogotá del Siglo XXI",57,{"$f":"IF(ISERROR(VLOOKUP(K53,[2]Proposito_programa!$C$2:$E$59,2,FALSE)),\" \",VLOOKUP(K53,[2]Proposito_programa!$C$2:$E$59,2,FALSE))","v":"Gestión pública local"},{"$f":"IF(ISERROR(VLOOKUP(K53,[2]Proposito_programa!$C$2:$E$59,3,FALSE)),\" \",VLOOKUP(K53,[2]Proposito_programa!$C$2:$E$59,3,FALSE))","v":"Propósito 5: Construir Bogotá - Región con gobierno abierto, transparente y ciudadanía consciente"},1783,1,79538248,"SABAS CRUZ ORTIZ","Persona Natural",null,null,null,21905010,null,0,null,21905010,21905010,"2021-02-22","2021-02-22","2021-11-21","274 DÍAS",0,0,null,null,null,null,null,null,"X",null,1]
[41,2021,"FDLF-CD-41-2021","https://community.secop.gov.co/Public/Tendering/OpportunityDetail/Index?noticeUID=CO1.NTC.1788654&isFromPublicArea=True&isModal=true&asPopupView=true","Contratos de prestación de servicios profesionales y de apoyo a la gestión","Contratación directa","Prestación de servicios profesionales y de apoyo a la gestión, o para la ejecución de trabajos artísticos que sólo puedan encomendarse a determinadas personas naturales;","SERVICIOS DE APOYO TÉCNICO ADMINISTRATIVO AL ÁREA DE GESTIÓN DEL DESARROLLO LOCAL DE LA ALCALDÍA LOCAL DE FONTIBÓN","Inversión","Un nuevo Contrato Social y ambiental para la Bogotá del Siglo XXI",57,{"$f":"IF(ISERROR(VLOOKUP(K54,[2]Proposito_programa!$C$2:$E$59,2,FALSE)),\" \",VLOOKUP(K54,[2]Proposito_programa!$C$2:$E$59,2,FALSE))","v":"Gestión pública local"},{"$f":"IF(ISERROR(VLOOKUP(K54,[2]Proposito_programa!$C$2:$E$59,3,FALSE)),\" \",VLOOKUP(K54,[2]Proposito_programa!$C$2:$E$59,3,FALSE))","v":"Propósito 5: Construir Bogotá - Región con gobierno abierto, transparente y ciudadanía consciente"},1783,1,79611853,"DIEGO FERNANDO MONCADA MORENO","Persona Natural",null,null,null,35226000,null,1,3914000,39140000,35226000,"2021-02-23","2021-02-23","2021-12-30","274 DÍAS",1,30,null,null,null,null,null,null,"X",null,0.9]
[42,2021,"FDLF-CD-42-2021","https://community.secop.gov.co/Public/Tendering/OpportunityDetail/Index?noticeUID=CO1.NTC.1788756&isFromPublicArea=True&isModal=true&asPopupView=true","Contratos de prestación de servicios profesionales y de apoyo a la gestión","Contratación directa","Prestación de servicios profesionales y de apoyo a la gestión, o para la ejecución de trabajos artísticos que sólo puedan encomendarse a determinadas personas naturales;","SERVICIOS DE APOYO OPERATIVO PARA LAS ACTIVIDADES RELACIONADAS CON EL MANTENIMIENTO Y REPARACIONES MENORES DE LA SEDE Y DEMÁS DEPENDENCIAS DE LA ALCALDÍA LOCAL DE FONTIBÓN","Inversión","Un nuevo Contrato Social y ambiental para la Bogotá del Siglo XXI",57,{"$f":"IF(ISERROR(VLOOKUP(K55,[2]Proposito_programa!$C$2:$E$59,2,FALSE)),\" \",VLOOKUP(K55,[2]Proposito_programa!$C$2:$E$59,2,FALSE))","v":"Gestión pública local"},{"$f":"IF(ISERROR(VLOOKUP(K55,[2]Proposito_programa!$C$2:$E$59,3,FALSE)),\" \",VLOOKUP(K55,[2]Proposito_programa!$C$2:$E$59,3,FALSE))","v":"Propósito 5: Construir Bogotá - Región con gobierno abierto, transparente y ciudadanía consciente"},1783,1,1090424456,"JAMES ANTONY ANGARITA VELASCO","Persona Natural",null,null,null,12169450,null,1,6084725,18254175,18254175,"2021-02-23","2021-02-23","2021-10-07","152 DÍAS",1,75,null,null,null,null,null,null,"X",null,0.67]
[43,2021,"FDLF-CD-43-2021","https://community.secop.gov.co/Public/Tendering/OpportunityDetail/Index?noticeUID=CO1.NTC.1790673&isFromPublicArea=True&isModal=true&asPopupView=true","Contratos de prestación de servicios profesionales y de apoyo a la gestión","Contratación directa","Prestación de servicios profesionales y de apoyo a la gestión, o para la ejecución de trabajos artísticos que sólo puedan encomendarse a determinadas personas naturales;","APOYAR AL EQUIPO DE PRENSA Y COMUNICACIONES DE LA ALCALDÍA LOCAL EN LA CREACIÓN, REALIZACIÓN, PRODUCCIÓN Y EDICIÓN DE VÍDEOS, ASÍ COMO EL REGISTRO, EDICIÓN Y LA PRESENTACIÓN DE FOTOGRAFÍAS DE LOS ACONTECIMIENTOS, HECHOS Y EVENTOS EXTERNOS E INTERNOS DE LA ALCALDÍA LOCAL, PARA SER UTILIZADOS COMO INSUMOS DE COMUNICACIÓN EN LOS MEDIOS, ESPECIALMENTE ESCRITOS, DIGITALES Y AUDIOVISUALES","Inversión","Un nuevo Contrato Social y ambiental para la Bogotá del Siglo XXI",57,{"$f":"IF(ISERROR(VLOOKUP(K56,[2]Proposito_programa!$C$2:$E$59,2,FALSE)),\" \",VLOOKUP(K56,[2]Proposito_programa!$C$2:$E$59,2,FALSE))","v":"Gestión pública local"},{"$f":"IF(ISERROR(VLOOKUP(K56,[2]Proposito_programa!$C$2:$E$59,3,FALSE)),\" \",VLOOKUP(K56,[2]Proposito_programa!$C$2:$E$59,3,FALSE))","v":"Propósito 5: Construir Bogotá - Región con gobierno abierto, transparente y ciudadanía consciente"},1783,1,1098775570,"YENNY KATHERINE SILVA PICO","Persona Natural",null,null,null,38934000,null,1,5047000,43981000,39655000,"2021-02-26","2021-02-26","2021-12-31","274 DÍAS",1,35,null,null,null,null,null,null,"X",null,0.89]
[44,2021,"FDLF-CD-44-2021","https://community.secop.gov.co/Public/Tendering/OpportunityDetail/Index?noticeUID=CO1.NTC.1793690&isFromPublicArea=True&isModal=true&asPopupView=true","Contratos de prestación de servicios profesionales y de apoyo a la gestión","Contratación directa","Prestación de servicios profesionales y de apoyo a la gestión, o para la ejecución de trabajos artísticos que sólo puedan encomendarse a determinadas personas naturales;","APOYO PROFESIONAL PARA LOS TEMAS DE GESTIÓN DE RIESGO Y GESTIÓN AMBIENTAL DEL ÁREA DE GESTIÓN DE DESARROLLO LOCAL","Inversión","Un nuevo Contrato Social y ambiental para la Bogotá del Siglo XXI",57,{"$f":"IF(ISERROR(VLOOKUP(K57,[2]Proposito_programa!$C$2:$E$59,2,FALSE)),\" \",VLOOKUP(K57,[2]Proposito_programa!$C$2:$E$59,2,FALSE))","v":"Gestión pública local"},{"$f":"IF(ISERROR(VLOOKUP(K57,[2]Proposito_programa!$C$2:$E$59,3,FALSE)),\" \",VLOOKUP(K57,[2]Proposito_programa!$C$2:$E$59,3,FALSE))","v":"Propósito 5: Construir Bogotá - Región con gobierno abierto, transparente y ciudadanía consciente"},1783,1,1024563513,"NAYIB SELENIA CALIFA GARZON","Persona Natural",null,null,null,39249000,null,1,5087833,44336833,39975833,"2021-02-26","2021-02-26","2021-12-31","274 DÍAS",1,35,null,null,null,null,null,null,"X",null,0.89]
[45,2021,"FDLF-CD-45-2021","https://community.secop.gov.co/Public/Tendering/OpportunityDetail/Index?noticeUID=CO1.NTC.1797990&isFromPublicArea=True&isModal=true&asPopupView=true","Contratos de prestación de servicios profesionales y de apoyo a la gestión","Contratación directa","Prestación de servicios profesionales y de apoyo a la gestión, o para la ejecución de trabajos artísticos que sólo puedan encomendarse a determinadas personas naturales;","PRESTAR SERVICIOS PARA APOYAR LAS LABORES DE ENTREGA Y RECIBO DE LAS COMUNICACIONES EMITIDAS O RECIBIDAS POR LAS INSPECCIONES DE POLICÍA DE LA LOCALIDAD DE FONTIBÓN.","Inversión","Un nuevo Contrato Social y ambiental para la Bogotá del Siglo XXI",57,{"$f":"IF(ISERROR(VLOOKUP(K58,[2]Proposito_programa!$C$2:$E$59,2,FALSE)),\" \",VLOOKUP(K58,[2]Proposito_programa!$C$2:$E$59,2,FALSE))","v":"Gestión pública local"},{"$f":"IF(ISERROR(VLOOKUP(K58,[2]Proposito_programa!$C$2:$E$59,3,FALSE)),\" \",VLOOKUP(K58,[2]Proposito_programa!$C$2:$E$59,3,FALSE))","v":"Propósito 5: Construir Bogotá - Región con gobierno abierto, transparente y ciudadanía consciente"},1784,1,1016034743,"JUAN ANTONIO ESPITIA ACERO","Persona Natural",null,null,null,5200000,null,1,2600000,7800000,7800000,"2021-02-26","2021-02-26","2021-05-25","60 DÍAS",1,30,null,null,null,null,null,null,"X",null,0.67]
[46,2021,"FDLF-CD-46-2021","https://community.secop.gov.co/Public/Tendering/OpportunityDetail/Index?noticeUID=CO1.NTC.1790615&isFromPublicArea=True&isModal=true&asPopupView=true","Contratos de prestación de servicios profesionales y de apoyo a la gestión","Contratación directa","Prestación de servicios profesionales y de apoyo a la gestión, o para la ejecución de trabajos artísticos que sólo puedan encomendarse a determinadas personas naturales;","SERVICIOS DE APOYO OPERATIVO PARA LAS ACTIVIDADES RELACIONADAS CON EL MANTENIMIENTO Y REPARACIONES MENORES DE LA SEDE Y DEMÁS DEPENDENCIAS DE LA ALCALDÍA LOCAL DE FONTIBÓN","Inversión","Un nuevo Contrato Social y ambiental para la Bogotá del Siglo XXI",57,{"$f":"IF(ISERROR(VLOOKUP(K59,[2]Proposito_programa!$C$2:$E$59,2,FALSE)),\" \",VLOOKUP(K59,[2]Proposito_programa!$C$2:$E$59,2,FALSE))","v":"Gestión pública local"},{"$f":"IF(ISERROR(VLOOKUP(K59,[2]Proposito_programa!$C$2:$E$59,3,FALSE)),\" \",VLOOKUP(K59,[2]Proposito_programa!$C$2:$E$59,3,FALSE))","v":"Propósito 5: Construir Bogotá - Región con gobierno abierto, transparente y ciudadanía consciente"},1783,1,79122866,"ALVARO ACEVEDO CAJAMARCA","Persona Natural",null,null,null,12169450,null,1,6084725,18254175,18254175,"2021-02-23","2021-02-23","2021-10-07","152 DÍAS",1,75,null,null,null,null,null,null,"X",null,0.67]
[47,2021,"FDLF-CD-47-2021","https://community.secop.gov.co/Public/Tendering/OpportunityDetail/Index?noticeUID=CO1.NTC.1795253&isFromPublicArea=True&isModal=true&asPopupView=true","Contratos de prestación de servicios profesionales y de apoyo a la gestión","Contratación directa","Prestación de servicios profesionales y de apoyo a la gestión, o para la ejecución de trabajos artísticos que sólo puedan encomendarse a determinadas personas naturales;","PRESTAR SERVICIOS TÉCNICOS PARA EL APOYO ADMINISTRATIVO Y LOGÍSTICO DEL DESPACHO DE LA ALCALDÍA LOCAL DE FONTIBÓN.","Inversión","Un nuevo Contrato Social y ambiental para la Bogotá del Siglo XXI",57,{"$f":"IF(ISERROR(VLOOKUP(K60,[2]Proposito_programa!$C$2:$E$59,2,FALSE)),\" \",VLOOKUP(K60,[2]Proposito_programa!$C$2:$E$59,2,FALSE))","v":"Gestión pública local"},{"$f":"IF(ISERROR(VLOOKUP(K60,[2]Proposito_programa!$C$2:$E$59,3,FALSE)),\" \",VLOOKUP(K60,[2]Proposito_programa!$C$2:$E$59,3,FALSE))","v":"Propósito 5: Construir Bogotá - Región con gobierno abierto, transparente y ciudadanía consciente"},1783,1,52974047,"ANGELICA MARIA SALAZAR BAYONA","Persona Natural",null,null,null,35226000,null,1,4566333,39792333,35878333,"2021-02-26","2021-02-26","2021-12-31","274 DÍAS",1,35,null,null,null,null,null,null,"X",null,0.89]
[48,2021,"FDLF-CD-48-2021","https://community.secop.gov.co/Public/Tendering/OpportunityDetail/Index?noticeUID=CO1.NTC.1797203&isFromPublicArea=True&isModal=true&asPopupView=true","Contratos de prestación de servicios profesionales y de apoyo a la gestión","Contratación directa","Prestación de servicios profesionales y de apoyo a la gestión, o para la ejecución de trabajos artísticos que sólo puedan encomendarse a determinadas personas naturales;","PRESTAR SERVICIOS PROFESIONALES PARA APOYAR EL ÁREA DE GESTIÓN DE DESARROLLO LOCAL DE FONTIBÓN ORIENTADO A LOS TEMAS DEPORTIVOS Y RECREATIVOS.","Inversión","Un nuevo Contrato Social y ambiental para la Bogotá del Siglo XXI",20,{"$f":"IF(ISERROR(VLOOKUP(K61,[2]Proposito_programa!$C$2:$E$59,2,FALSE)),\" \",VLOOKUP(K61,[2]Proposito_programa!$C$2:$E$59,2,FALSE))","v":"Bogotá, referente en cultura, deporte, recreación y actividad física, con parques para el desarrollo y la salud"},{"$f":"IF(ISERROR(VLOOKUP(K61,[2]Proposito_programa!$C$2:$E$59,3,FALSE)),\" \",VLOOKUP(K61,[2]Proposito_programa!$C$2:$E$59,3,FALSE))","v":"Propósito 1: Hacer un nuevo contrato social para incrementar la inclusión social, productiva y política"},1757,1,1032430030,"MIGUEL ANGEL GONZALEZ GARCIA","Persona Natural",null,null,null,54000000,null,2,9000000,63000000,48000000,"2021-03-01","2021-03-01","2022-01-15","274 DÍAS",1,45,null,null,null,null,null,null,"X",null,0.76]
[49,2021,"FDLF-CD-49-2021","https://community.secop.gov.co/Public/Tendering/OpportunityDetail/Index?noticeUID=CO1.NTC.1799436&isFromPublicArea=True&isModal=true&asPopupView=true","Contratos de prestación de servicios profesionales y de apoyo a la gestión","Contratación directa","Prestación de servicios profesionales y de apoyo a la gestión, o para la ejecución de trabajos artísticos que sólo puedan encomendarse a determinadas personas naturales;","PRESTAR SERVICIOS PROFESIONALES PARA APOYAR EL ÁREA DE GESTIÓN DE DESARROLLO LOCAL DE FONTIBÓN ORIENTADOS A LOS TEMAS CULTURALES.","Inversión","Un nuevo Contrato Social y ambiental para la Bogotá del Siglo XXI",21,{"$f":"IF(ISERROR(VLOOKUP(K62,[2]Proposito_programa!$C$2:$E$59,2,FALSE)),\" \",VLOOKUP(K62,[2]Proposito_programa!$C$2:$E$59,2,FALSE))","v":"Creación y vida cotidiana: Apropiación ciudadana del arte, la cultura y el patrimonio, para la democracia cultural"},{"$f":"IF(ISERROR(VLOOKUP(K62,[2]Proposito_programa!$C$2:$E$59,3,FALSE)),\" \",VLOOKUP(K62,[2]Proposito_programa!$C$2:$E$59,3,FALSE))","v":"Propósito 1: Hacer un nuevo contrato social para incrementar la inclusión social, productiva y política"},1758,1,53165749,"ROCIO DEL PILAR BECERRA FARIETA","Persona Natural",null,null,null,49500000,null,1,9900000,59400000,49500000,"2021-03-01","2021-03-01","2022-01-24","274 DÍAS",1,54,null,null,null,null,null,null,"X",null,0.83]
[50,2021,"FDLF-CD-50-2021","https://community.secop.gov.co/Public/Tendering/OpportunityDetail/Index?noticeUID=CO1.NTC.1799405&isFromPublicArea=True&isModal=true&asPopupView=true","Contratos de prestación de servicios profesionales y de apoyo a la gestión","Contratación directa","Prestación de servicios profesionales y de apoyo a la gestión, o para la ejecución de trabajos artísticos que sólo puedan encomendarse a determinadas personas naturales;","PRESTAR SERVICIOS PARA APOYAR LAS LABORES DE NOTIFICACIÓN DE CORRESPONDENCIA DE LA ALCALDÍA LOCAL DE FONTIBÓN","Inversión","Un nuevo Contrato Social y ambiental para la Bogotá del Siglo XXI",57,{"$f":"IF(ISERROR(VLOOKUP(K63,[2]Proposito_programa!$C$2:$E$59,2,FALSE)),\" \",VLOOKUP(K63,[2]Proposito_programa!$C$2:$E$59,2,FALSE))","v":"Gestión pública local"},{"$f":"IF(ISERROR(VLOOKUP(K63,[2]Proposito_programa!$C$2:$E$59,3,FALSE)),\" \",VLOOKUP(K63,[2]Proposito_programa!$C$2:$E$59,3,FALSE))","v":"Propósito 5: Construir Bogotá - Región con gobierno abierto, transparente y ciudadanía consciente"},1783,1,86004084,"JOSE OCTAVIO CRUZ NINCOR","Persona Natural",null,null,null,21905010,null,2,3813094,25718104,21905010,"2021-03-01","2021-03-01","2022-01-17","274 DÍAS",2,47,null,null,null,null,null,null,"X",null,0.85]
[51,2021,"FDLF-CD-51-2021","https://community.secop.gov.co/Public/Tendering/OpportunityDetail/Index?noticeUID=CO1.NTC.1801612&isFromPublicArea=True&isModal=true&asPopupView=true","Contratos de prestación de servicios profesionales y de apoyo a la gestión","Contratación directa","Prestación de servicios profesionales y de apoyo a la gestión, o para la ejecución de trabajos artísticos que sólo puedan encomendarse a determinadas personas naturales;","PRESTAR SERVICIOS PROFESIONALES PARA APOYAR EL ÁREA DE GESTIÓN DE DESARROLLO LOCAL DE FONTIBÓN ORIENTADOS A LOS TEMAS CULTURALES.","Inversión","Un nuevo Contrato Social y ambiental para la Bogotá del Siglo XXI",21,{"$f":"IF(ISERROR(VLOOKUP(K64,[2]Proposito_programa!$C$2:$E$59,2,FALSE)),\" \",VLOOKUP(K64,[2]Proposito_programa!$C$2:$E$59,2,FALSE))","v":"Creación y vida cotidiana: Apropiación ciudadana del arte, la cultura y el patrimonio, para la democracia cultural"},{"$f":"IF(ISERROR(VLOOKUP(K64,[2]Proposito_programa!$C$2:$E$59,3,FALSE)),\" \",VLOOKUP(K64,[2]Proposito_programa!$C$2:$E$59,3,FALSE))","v":"Propósito 1: Hacer un nuevo contrato social para incrementar la inclusión social, productiva y política"},1758,1,1014185339,"LUISA FERNANDA LEON LUQUE","Persona Natural",null,null,null,49500000,null,1,10816666,60316666,44916667,"2021-02-26","2021-02-26","2022-01-24","274 DÍAS",1,59,null,null,null,null,null,null,"X",null,0.74]
[52,2021,"FDLF-CD-52-2021","https://community.secop.gov.co/Public/Tendering/OpportunityDetail/Index?noticeUID=CO1.NTC.1803976&isFromPublicArea=True&isModal=true&asPopupView=true","Contratos de prestación de servicios profesionales y de apoyo a la gestión","Contratación directa","Prestación de servicios profesionales y de apoyo a la gestión, o para la ejecución de trabajos artísticos que sólo puedan encomendarse a determinadas personas naturales;","PRESTAR SERVICIOS PARA APOYAR JURÍDICAMENTE LA EJECUCIÓN DE LAS ACCIONES REQUERIDAS PARA LA DEPURACIÓN DE LAS ACTUACIONES ADMINISTRATIVAS QUE CURSAN EN LA ALCALDÍA LOCAL DE FONTIBÓN","Inversión","Un nuevo Contrato Social y ambiental para la Bogotá del Siglo XXI",57,{"$f":"IF(ISERROR(VLOOKUP(K65,[2]Proposito_programa!$C$2:$E$59,2,FALSE)),\" \",VLOOKUP(K65,[2]Proposito_programa!$C$2:$E$59,2,FALSE))","v":"Gestión pública local"},{"$f":"IF(ISERROR(VLOOKUP(K65,[2]Proposito_programa!$C$2:$E$59,3,FALSE)),\" \",VLOOKUP(K65,[2]Proposito_programa!$C$2:$E$59,3,FALSE))","v":"Propósito 5: Construir Bogotá - Región con gobierno abierto, transparente y ciudadanía consciente"},1784,1,1032454002,"DANIEL RICARDO GONZALEZ RODRIGUEZ","Persona Natural",null,null,null,9852980,null,1,4926490,14779470,14779470,"2021-03-01","2021-03-01","2021-05-30","60 DÍAS",1,30,null,null,null,null,null,null,"X",null,0.67]
[53,2021,"FDLF-CD-53-2021","https://community.secop.gov.co/Public/Tendering/OpportunityDetail/Index?noticeUID=CO1.NTC.1805432&isFromPublicArea=True&isModal=true&asPopupView=true","Contratos de prestación de servicios profesionales y de apoyo a la gestión","Contratación directa","Prestación de servicios profesionales y de apoyo a la gestión, o para la ejecución de trabajos artísticos que sólo puedan encomendarse a determinadas personas naturales;","PRESTAR SERVICIOS PARA APOYAR JURÍDICAMENTE LA EJECUCIÓN DE LAS ACCIONES REQUERIDAS PARA LA DEPURACIÓN DE LAS ACTUACIONES ADMINISTRATIVAS QUE CURSAN EN LA ALCALDÍA LOCAL DE FONTIBÓN","Inversión","Un nuevo Contrato Social y ambiental para la Bogotá del Siglo XXI",57,{"$f":"IF(ISERROR(VLOOKUP(K66,[2]Proposito_programa!$C$2:$E$59,2,FALSE)),\" \",VLOOKUP(K66,[2]Proposito_programa!$C$2:$E$59,2,FALSE))","v":"Gestión pública local"},{"$f":"IF(ISERROR(VLOOKUP(K66,[2]Proposito_programa!$C$2:$E$59,3,FALSE)),\" \",VLOOKUP(K66,[2]Proposito_programa!$C$2:$E$59,3,FALSE))","v":"Propósito 5: Construir Bogotá - Región con gobierno abierto, transparente y ciudadanía consciente"},1784,1,79572785,"JORGE ARMANDO SUAREZ MEDINA","Persona Natural",null,null,null,9852980,null,1,4926490,14779470,14779470,"2021-03-01","2021-03-01","2021-05-30","60 DÍAS",1,30,null,null,null,null,null,null,"X",null,0.67]
[54,2021,"FDLF-CD-54-2021","https://community.secop.gov.co/Public/Tendering/OpportunityDetail/Index?noticeUID=CO1.NTC.1805048&isFromPublicArea=True&isModal=true&asPopupView=true","Contratos de prestación de servicios profesionales y de apoyo a la gestión","Contratación directa","Prestación de servicios profesionales y de apoyo a la gestión, o para la ejecución de trabajos artísticos que sólo puedan encomendarse a determinadas personas naturales;","PRESTAR SERVICIOS PROFESIONALES PARA LA OPERACIÓN DEL PROYECTO PUNTO VIVE DIGITAL DE LA LOCALIDAD DE FONTIBÓN.","Inversión","Un nuevo Contrato Social y ambiental para la Bogotá del Siglo XXI",57,{"$f":"IF(ISERROR(VLOOKUP(K67,[2]Proposito_programa!$C$2:$E$59,2,FALSE)),\" \",VLOOKUP(K67,[2]Proposito_programa!$C$2:$E$59,2,FALSE))","v":"Gestión pública local"},{"$f":"IF(ISERROR(VLOOKUP(K67,[2]Proposito_programa!$C$2:$E$59,3,FALSE)),\" \",VLOOKUP(K67,[2]Proposito_programa!$C$2:$E$59,3,FALSE))","v":"Propósito 5: Construir Bogotá - Región con gobierno abierto, transparente y ciudadanía consciente"},1783,1,80801120,"STEVE LEONARDO CHAMUCERO BARBOSA","Persona Natural",null,null,null,38934000,null,1,4326000,43260000,38934000,"2021-03-01","2021-03-01","2021-12-31","274 DÍAS",1,30,null,null,null,null,null,null,"X",null,0.9]
[55,2021,"FDLF-CD-55-2021","https://community.secop.gov.co/Public/Tendering/OpportunityDetail/Index?noticeUID=CO1.NTC.1805729&isFromPublicArea=True&isModal=true&asPopupView=true","Contratos de prestación de servicios profesionales y de apoyo a la gestión","Contratación directa","Prestación de servicios profesionales y de apoyo a la gestión, o para la ejecución de trabajos artísticos que sólo puedan encomendarse a determinadas personas naturales;","SERVICIOS DE APOYO TÉCNICO A LA GESTIÓN DE LA ALCALDÍA LOCAL DE FONTIBÓN EN LA RECEPCIÓN DE CORRESPONDENCIA INTERNA Y EXTERNA, ASÍ COMO LA CLASIFICACIÓN, ASIGNACIÓN INTERNA DE LAS SOLICITUDES Y/O CORRESPONDENCIA RECIBIDA","Inversión","Un nuevo Contrato Social y ambiental para la Bogotá del Siglo XXI",57,{"$f":"IF(ISERROR(VLOOKUP(K68,[2]Proposito_programa!$C$2:$E$59,2,FALSE)),\" \",VLOOKUP(K68,[2]Proposito_programa!$C$2:$E$59,2,FALSE))","v":"Gestión pública local"},{"$f":"IF(ISERROR(VLOOKUP(K68,[2]Proposito_programa!$C$2:$E$59,3,FALSE)),\" \",VLOOKUP(K68,[2]Proposito_programa!$C$2:$E$59,3,FALSE))","v":"Propósito 5: Construir Bogotá - Región con gobierno abierto, transparente y ciudadanía consciente"},1783,1,53925244,"XIMENA ANDREA PARRAGA GOMEZ","Persona Natural",null,null,null,35226000,null,1,3914000,39140000," $                          -  ","2021-03-01","2021-03-01","2021-12-31","274 DÍAS",1,30,null,null,null,null,null,null,"X",null,0]
[56,2021,"FDLF-CD-56-2021","https://community.secop.gov.co/Public/Tendering/OpportunityDetail/Index?noticeUID=CO1.NTC.1808823&isFromPublicArea=True&isModal=true&asPopupView=true","Contratos de prestación de servicios profesionales y de apoyo a la gestión","Contratación directa","Prestación de servicios profesionales y de apoyo a la gestión, o para la ejecución de trabajos artísticos que sólo puedan encomendarse a determinadas personas naturales;","SERVICIOS PROFESIONALES ESPECIALIZADOS PARA ORIENTAR EL GRUPO JURÍDICO DE CONTRATACIÓN DE LA ALCALDÍA LOCAL DE FONTIBÓN","Inversión","Un nuevo Contrato Social y ambiental para la Bogotá del Siglo XXI",57,{"$f":"IF(ISERROR(VLOOKUP(K69,[2]Proposito_programa!$C$2:$E$59,2,FALSE)),\" \",VLOOKUP(K69,[2]Proposito_programa!$C$2:$E$59,2,FALSE))","v":"Gestión pública local"},{"$f":"IF(ISERROR(VLOOKUP(K69,[2]Proposito_programa!$C$2:$E$59,3,FALSE)),\" \",VLOOKUP(K69,[2]Proposito_programa!$C$2:$E$59,3,FALSE))","v":"Propósito 5: Construir Bogotá - Región con gobierno abierto, transparente y ciudadanía consciente"},1783,1,40390477,"BLANCA OLIVA CORDOBA MARTINEZ","Persona Natural",null,null,null,80100000,null,0,null,80100000,62003333,"2021-03-02","2021-03-02","2021-10-18","274 DÍAS",0,0,null,null,null,null,null,null,"X",null,0.77]
[57,2021,"FDLF-CD-57-2021","https://community.secop.gov.co/Public/Tendering/OpportunityDetail/Index?noticeUID=CO1.NTC.1810329&isFromPublicArea=True&isModal=true&asPopupView=true","Contratos de prestación de servicios profesionales y de apoyo a la gestión","Contratación directa","Prestación de servicios profesionales y de apoyo a la gestión, o para la ejecución de trabajos artísticos que sólo puedan encomendarse a determinadas personas naturales;","PRESTAR SERVICIOS PROFESIONALES PARA APOYAR EL ÁREA DE GESTIÓN DE DESARROLLO LOCAL DE FONTIBÓN ORIENTADOS A LOS TEMAS DE EDUCACIÓN","Inversión","Un nuevo Contrato Social y ambiental para la Bogotá del Siglo XXI",12,{"$f":"IF(ISERROR(VLOOKUP(K70,[2]Proposito_programa!$C$2:$E$59,2,FALSE)),\" \",VLOOKUP(K70,[2]Proposito_programa!$C$2:$E$59,2,FALSE))","v":"Educación inicial: Bases sólidas para la vida."},{"$f":"IF(ISERROR(VLOOKUP(K70,[2]Proposito_programa!$C$2:$E$59,3,FALSE)),\" \",VLOOKUP(K70,[2]Proposito_programa!$C$2:$E$59,3,FALSE))","v":"Propósito 1: Hacer un nuevo contrato social para incrementar la inclusión social, productiva y política"},1753,1,1016015853,"LINA MARCELA ROMERO RODRIGUEZ","Persona Natural",null,null,null,21630000,null,0,null,21630000,21197400,"2021-03-04","2021-03-04","2021-08-03","152 DÍAS",0,0,null,null,null,null,null,null,"X",null,0.98]
[58,2021,"FDLF-CD-58-2021","https://community.secop.gov.co/Public/Tendering/OpportunityDetail/Index?noticeUID=CO1.NTC.1810616&isFromPublicArea=True&isModal=true&asPopupView=true","Contratos de prestación de servicios profesionales y de apoyo a la gestión","Contratación directa","Prestación de servicios profesionales y de apoyo a la gestión, o para la ejecución de trabajos artísticos que sólo puedan encomendarse a determinadas personas naturales;","APOYAR JURÍDICAMENTE LA EJECUCIÓN DE LAS ACCIONES REQUERIDAS PARA LA DEPURACIÓN DE LAS ACTUACIONES ADMINISTRATIVAS QUE CURSAN EN LA ALCALDÍA LOCAL DE FONTIBÓN","Inversión","Un nuevo Contrato Social y ambiental para la Bogotá del Siglo XXI",57,{"$f":"IF(ISERROR(VLOOKUP(K71,[2]Proposito_programa!$C$2:$E$59,2,FALSE)),\" \",VLOOKUP(K71,[2]Proposito_programa!$C$2:$E$59,2,FALSE))","v":"Gestión pública local"},{"$f":"IF(ISERROR(VLOOKUP(K71,[2]Proposito_programa!$C$2:$E$59,3,FALSE)),\" \",VLOOKUP(K71,[2]Proposito_programa!$C$2:$E$59,3,FALSE))","v":"Propósito 5: Construir Bogotá - Región con gobierno abierto, transparente y ciudadanía consciente"},1784,1,1016053840,"EVELYN LORENA GOMEZ ORTIZ","Persona Natural",null,null,null,9852980,null,1,4926490,14779470,14286821,"2021-03-04","2021-03-04","2021-06-03","60 DÍAS",1,30,null,null,null,null,null,null,"X",null,0.63]
[59,2021,"FDLF-CD-59-2021","https://community.secop.gov.co/Public/Tendering/OpportunityDetail/Index?noticeUID=CO1.NTC.1809495&isFromPublicArea=True&isModal=true&asPopupView=true","Contratos de prestación de servicios profesionales y de apoyo a la gestión","Contratación directa","Prestación de servicios profesionales y de apoyo a la gestión, o para la ejecución de trabajos artísticos que sólo puedan encomendarse a determinadas personas naturales;","PRESTAR SERVICIOS TÉCNICOS PARA LA OPERACIÓN, SEGUIMIENTO Y CUMPLIMIENTO DE LOS PROCESOS Y PROCEDIMIENTOS DEL SERVICIO SOCIAL APOYO PARA LA SEGURIDAD ECONÓMICA TIPO C, REQUERIDOS PARA EL OPORTUNO Y ADECUADO REGISTRO, CRUCE Y REPORTE DE DATOS EN EL SISTEMA DE INFORMACIÓN Y REGISTRO DE BENEFICIARIOS SIRBE, QUE CONTRIBUYAN A LA GARANTÍA DE LOS DERECHOS DE LA POBLACIÓN MAYOR EN EL MARCO DE LA POLÍTICA PÚBLICA SOCIAL PARA EL ENVEJECIMIENTO Y LA VEJEZ EN EL DISTRITO CAPITAL A CARGO DE LA ALCALDÍA LOCAL","Inversión","Un nuevo Contrato Social y ambiental para la Bogotá del Siglo XXI",1,{"$f":"IF(ISERROR(VLOOKUP(K72,[2]Proposito_programa!$C$2:$E$59,2,FALSE)),\" \",VLOOKUP(K72,[2]Proposito_programa!$C$2:$E$59,2,FALSE))","v":"Subsidios y transferencias para la equidad"},{"$f":"IF(ISERROR(VLOOKUP(K72,[2]Proposito_programa!$C$2:$E$59,3,FALSE)),\" \",VLOOKUP(K72,[2]Proposito_programa!$C$2:$E$59,3,FALSE))","v":"Propósito 1: Hacer un nuevo contrato social para incrementar la inclusión social, productiva y política"},1752,1,52483298,"JENNY GISELA CUERVO LÓPEZ","Persona Natural",null,null,null,39009533,null,1,3261667,42271200,34965066,"2021-03-03","2021-03-03","2022-01-26","303 DÍAS",1,25,52540324,"OLGA LUCIA LOPEZ RAMIREZ","2021-03-11",37704866,null,null,"X",null,0]
[60,2021,"FDLF-CD-60-2021","https://community.secop.gov.co/Public/Tendering/OpportunityDetail/Index?noticeUID=CO1.NTC.1809777&isFromPublicArea=True&isModal=true&asPopupView=true","Contratos de prestación de servicios profesionales y de apoyo a la gestión","Contratación directa","Prestación de servicios profesionales y de apoyo a la gestión, o para la ejecución de trabajos artísticos que sólo puedan encomendarse a determinadas personas naturales;","PRESTAR SERVICIOS DE APOYO AL ÁREA DE GESTIÓN DEL DESARROLLO LOCAL DE LA ALCALDÍA LOCAL DE FONTIBÓN.","Inversión","Un nuevo Contrato Social y ambiental para la Bogotá del Siglo XXI",57,{"$f":"IF(ISERROR(VLOOKUP(K73,[2]Proposito_programa!$C$2:$E$59,2,FALSE)),\" \",VLOOKUP(K73,[2]Proposito_programa!$C$2:$E$59,2,FALSE))","v":"Gestión pública local"},{"$f":"IF(ISERROR(VLOOKUP(K73,[2]Proposito_programa!$C$2:$E$59,3,FALSE)),\" \",VLOOKUP(K73,[2]Proposito_programa!$C$2:$E$59,3,FALSE))","v":"Propósito 5: Construir Bogotá - Región con gobierno abierto, transparente y ciudadanía consciente"},1783,1,80492422,"JAIR ALFONSO BUSTOS HERRERA","Persona Natural",null,null,null,4867780,null,0,0,4867780,4624391,"2021-03-04","2021-03-04","2021-05-03","60 DÍAS",0,0,null,null,null,null,null,null,"X",null,0.95]
[61,2021,"FDLF-CD-61-2021","https://community.secop.gov.co/Public/Tendering/OpportunityDetail/Index?noticeUID=CO1.NTC.1812095&isFromPublicArea=True&isModal=true&asPopupView=true","Contratos de prestación de servicios profesionales y de apoyo a la gestión","Contratación directa","Prestación de servicios profesionales y de apoyo a la gestión, o para la ejecución de trabajos artísticos que sólo puedan encomendarse a determinadas personas naturales;","EL CONTRATO QUE SE PRETENDE CELEBRAR TENDRÁ POR OBJETO COORDINAR, LIDERAR Y ASESORAR LOS PLANES Y ESTRATEGIAS DE COMUNICACIÓN INTERNA Y EXTERNA PARA LA DIVULGACIÓN DE LOS PROGRAMAS, PROYECTOS Y ACTIVIDADES DE ALCALDÍA LOCAL DE FONTIBÓN.","Inversión","Un nuevo Contrato Social y ambiental para la Bogotá del Siglo XXI",57,{"$f":"IF(ISERROR(VLOOKUP(K74,[2]Proposito_programa!$C$2:$E$59,2,FALSE)),\" \",VLOOKUP(K74,[2]Proposito_programa!$C$2:$E$59,2,FALSE))","v":"Gestión pública local"},{"$f":"IF(ISERROR(VLOOKUP(K74,[2]Proposito_programa!$C$2:$E$59,3,FALSE)),\" \",VLOOKUP(K74,[2]Proposito_programa!$C$2:$E$59,3,FALSE))","v":"Propósito 5: Construir Bogotá - Región con gobierno abierto, transparente y ciudadanía consciente"},1783,1,79654994,"JORGE ENRIQUE CAÑON UBAQUE","Persona Natural",null,null,null,58500000,null,0,0,58500000,51350000,"2021-03-04","2021-03-04","2021-12-03","274 DÍAS",0,0,null,null,null,null,null,null,"X",null,0.88]
[62,2021,"FDLF-CD-62-2021","https://community.secop.gov.co/Public/Tendering/OpportunityDetail/Index?noticeUID=CO1.NTC.1813663&isFromPublicArea=True&isModal=true&asPopupView=true","Contratos de prestación de servicios profesionales y de apoyo a la gestión","Contratación directa","Prestación de servicios profesionales y de apoyo a la gestión, o para la ejecución de trabajos artísticos que sólo puedan encomendarse a determinadas personas naturales;","PRESTAR SERVICIOS DE APOYO PROFESIONAL AL ÁREA DE GESTIÓN DE DESARROLLO LOCAL DE FONTIBÓN ORIENTADO A LOS TEMAS DEPORTIVOS Y RECREATIVOS","Inversión","Un nuevo Contrato Social y ambiental para la Bogotá del Siglo XXI",20,{"$f":"IF(ISERROR(VLOOKUP(K75,[2]Proposito_programa!$C$2:$E$59,2,FALSE)),\" \",VLOOKUP(K75,[2]Proposito_programa!$C$2:$E$59,2,FALSE))","v":"Bogotá, referente en cultura, deporte, recreación y actividad física, con parques para el desarrollo y la salud"},{"$f":"IF(ISERROR(VLOOKUP(K75,[2]Proposito_programa!$C$2:$E$59,3,FALSE)),\" \",VLOOKUP(K75,[2]Proposito_programa!$C$2:$E$59,3,FALSE))","v":"Propósito 1: Hacer un nuevo contrato social para incrementar la inclusión social, productiva y política"},1757,1,1016006281,"JOHN FREDDY AMAYA MORENO","Persona Natural",null,null,null,39249000,null,0,0,39249000,38812900,"2021-03-04","2021-03-04","2021-12-03","274 DÍAS",0,0,null,null,null,null,null,null,"X",null,0.99]
[63,2021,"FDLF-CD-63-2021","https://community.secop.gov.co/Public/Tendering/OpportunityDetail/Index?noticeUID=CO1.NTC.1813672&isFromPublicArea=True&isModal=true&asPopupView=true","Contratos de prestación de servicios profesionales y de apoyo a la gestión","Contratación directa","Prestación de servicios profesionales y de apoyo a la gestión, o para la ejecución de trabajos artísticos que sólo puedan encomendarse a determinadas personas naturales;","PRESTAR SERVICIOS PROFESIONALES PARA APOYAR TÉCNICAMENTE A LOS RESPONSABLES E INTEGRANTES DE LOS PROCESOS EN LA IMPLEMENTACIÓN DE HERRAMIENTAS DE GESTIÓN, SIGUIENDO LOS LINEAMIENTOS METODOLÓGICOS ESTABLECIDOS POR LA OFICINA ASESORA DE PLANEACIÓN DE LA SECRETARÍA DISTRITAL DE GOBIERNO.","Inversión","Un nuevo Contrato Social y ambiental para la Bogotá del Siglo XXI",57,{"$f":"IF(ISERROR(VLOOKUP(K76,[2]Proposito_programa!$C$2:$E$59,2,FALSE)),\" \",VLOOKUP(K76,[2]Proposito_programa!$C$2:$E$59,2,FALSE))","v":"Gestión pública local"},{"$f":"IF(ISERROR(VLOOKUP(K76,[2]Proposito_programa!$C$2:$E$59,3,FALSE)),\" \",VLOOKUP(K76,[2]Proposito_programa!$C$2:$E$59,3,FALSE))","v":"Propósito 5: Construir Bogotá - Región con gobierno abierto, transparente y ciudadanía consciente"},1783,1,9022215,"JORGE ISAAC GARAVITO JIMENEZ","Persona Natural",null,null,null,54000000,null,1,5200000,59200000,53200000,"2021-03-05","2021-03-05","2021-12-30","300 DÍAS",1,26,null,null,null,null,null,null,"X",null,0.9]
[64,2021,"FDLF-CD-64-2021","https://community.secop.gov.co/Public/Tendering/OpportunityDetail/Index?noticeUID=CO1.NTC.1819754&isFromPublicArea=True&isModal=true&asPopupView=true","Contratos de prestación de servicios profesionales y de apoyo a la gestión","Contratación directa","Prestación de servicios profesionales y de apoyo a la gestión, o para la ejecución de trabajos artísticos que sólo puedan encomendarse a determinadas personas naturales;","PRESTAR SERVICIOS COMO PROFESIONAL ESPECIALIZADO PARA REALIZAR EL PROCESO DE LIQUIDACIONES DE LOS CONTRATOS SUSCRITOS POR EL FONDO DE DESARROLLO LOCAL DE FONTIBÓN","Inversión","Un nuevo Contrato Social y ambiental para la Bogotá del Siglo XXI",57,{"$f":"IF(ISERROR(VLOOKUP(K77,[2]Proposito_programa!$C$2:$E$59,2,FALSE)),\" \",VLOOKUP(K77,[2]Proposito_programa!$C$2:$E$59,2,FALSE))","v":"Gestión pública local"},{"$f":"IF(ISERROR(VLOOKUP(K77,[2]Proposito_programa!$C$2:$E$59,3,FALSE)),\" \",VLOOKUP(K77,[2]Proposito_programa!$C$2:$E$59,3,FALSE))","v":"Propósito 5: Construir Bogotá - Región con gobierno abierto, transparente y ciudadanía consciente"},1783,1,79582465,"FRANCISCO JIMENEZ BEDOYA","Persona Natural",null,null,null,63000000,null,1,6066667,69066667,62066667,"2021-03-05","2021-03-05","2021-12-30","300 DÍAS",1,26,null,null,null,null,null,null,"X",null,0.9]
[65,2021,"FDLF-CD-65-2021","https://community.secop.gov.co/Public/Tendering/OpportunityDetail/Index?noticeUID=CO1.NTC.1819900&isFromPublicArea=True&isModal=true&asPopupView=true","Contratos de prestación de servicios profesionales y de apoyo a la gestión","Contratación directa","Prestación de servicios profesionales y de apoyo a la gestión, o para la ejecución de trabajos artísticos que sólo puedan encomendarse a determinadas personas naturales;","PRESTAR SERVICIOS PARA APOYAR ADMINISTRATIVA Y ASISTENCIALMENTE AL ÁREA DE GESTIÓN POLICIVA DE LA LOCALIDAD","Inversión","Un nuevo Contrato Social y ambiental para la Bogotá del Siglo XXI",57,{"$f":"IF(ISERROR(VLOOKUP(K78,[2]Proposito_programa!$C$2:$E$59,2,FALSE)),\" \",VLOOKUP(K78,[2]Proposito_programa!$C$2:$E$59,2,FALSE))","v":"Gestión pública local"},{"$f":"IF(ISERROR(VLOOKUP(K78,[2]Proposito_programa!$C$2:$E$59,3,FALSE)),\" \",VLOOKUP(K78,[2]Proposito_programa!$C$2:$E$59,3,FALSE))","v":"Propósito 5: Construir Bogotá - Región con gobierno abierto, transparente y ciudadanía consciente"},1784,1,53038737,"JENNY VIBIANA ACOSTA TORRES","Persona Natural",null,null,null,21905010,null,0,0,{"$f":"Y78+V78+W78","v":21905010},14278821,"2021-03-05","2021-03-05","2021-12-04","274 DÍAS",0,0,null,null,null,null,null,null,"X",null,0.65]
[66,2021,"FDLF-CD-66-2021","https://community.secop.gov.co/Public/Tendering/OpportunityDetail/Index?noticeUID=CO1.NTC.1813907&isFromPublicArea=True&isModal=true&asPopupView=true","Contratos de prestación de servicios profesionales y de apoyo a la gestión","Contratación directa","Prestación de servicios profesionales y de apoyo a la gestión, o para la ejecución de trabajos artísticos que sólo puedan encomendarse a determinadas personas naturales;","PRESTAR SERVICIOS PROFESIONALES PARA APOYAR EL ÁREA DE GESTIÓN DE DESARROLLO LOCAL EN LA EJECUCIÓN DEL PROYECTO UN NUEVO CONTRATO PARA MOVILIDAD EN FONTIBÓN","Inversión","Un nuevo Contrato Social y ambiental para la Bogotá del Siglo XXI",49,{"$f":"IF(ISERROR(VLOOKUP(K79,[2]Proposito_programa!$C$2:$E$59,2,FALSE)),\" \",VLOOKUP(K79,[2]Proposito_programa!$C$2:$E$59,2,FALSE))","v":"Movilidad segura, sostenible y accesible"},{"$f":"IF(ISERROR(VLOOKUP(K79,[2]Proposito_programa!$C$2:$E$59,3,FALSE)),\" \",VLOOKUP(K79,[2]Proposito_programa!$C$2:$E$59,3,FALSE))","v":"Propósito 4: Hacer de Bogotá Región un modelo de movilidad multimodal, incluyente y sostenible"},1780,1,79757415,"RAUL TOVAR MARTINEZ","Persona Natural",null,null,null,34000000,null,1,3400000,37400000,33093333,"2021-03-05","2021-03-05","2021-08-19","152 DÍAS",1,15,null,null,null,null,null,null,"X",null,0.88]
[67,2021,"FDLF-CD-67-2021","https://community.secop.gov.co/Public/Tendering/OpportunityDetail/Index?noticeUID=CO1.NTC.1816587&isFromPublicArea=True&isModal=true&asPopupView=true","Contratos de prestación de servicios profesionales y de apoyo a la gestión","Contratación directa","Prestación de servicios profesionales y de apoyo a la gestión, o para la ejecución de trabajos artísticos que sólo puedan encomendarse a determinadas personas naturales;","PRESTACIÓN DE SERVICIOS PROFESIONALES DE APOYO PARA LA GESTIÓN DE FORTALECIMIENTO A MIPYMES Y DEMÁS ASUNTOS RELACIONADOS CON EL CUMPLIMIENTO DE ACTIVIDADES DE COMPETITIVIDAD Y DESARROLLO ECONÓMICO DE LA LOCALIDAD DE FONTIBÓN","Inversión","Un nuevo Contrato Social y ambiental para la Bogotá del Siglo XXI",6,{"$f":"IF(ISERROR(VLOOKUP(K80,[2]Proposito_programa!$C$2:$E$59,2,FALSE)),\" \",VLOOKUP(K80,[2]Proposito_programa!$C$2:$E$59,2,FALSE))","v":"Sistema Distrital de Cuidado"},{"$f":"IF(ISERROR(VLOOKUP(K80,[2]Proposito_programa!$C$2:$E$59,3,FALSE)),\" \",VLOOKUP(K80,[2]Proposito_programa!$C$2:$E$59,3,FALSE))","v":"Propósito 1: Hacer un nuevo contrato social para incrementar la inclusión social, productiva y política"},1761,1,1010192601,"FELIPE ARMANDO CESPEDES MOLINA","Persona Natural",null,null,null,21630000,null,0,0,21630000,21630000,"2021-03-05","2021-03-05","2021-08-04","152 DÍAS",0,0,null,null,null,null,null,null,"X",null,1]
[68,2021,"FDLF-CD-68-2021","https://community.secop.gov.co/Public/Tendering/OpportunityDetail/Index?noticeUID=CO1.NTC.1827845&isFromPublicArea=True&isModal=true&asPopupView=true","Contratos de prestación de servicios profesionales y de apoyo a la gestión","Contratación directa","Prestación de servicios profesionales y de apoyo a la gestión, o para la ejecución de trabajos artísticos que sólo puedan encomendarse a determinadas personas naturales;","PRESTAR SERVICIOS DE APOYO PROFESIONAL\nAL ÁREA DE GESTIÓN ADMINISTRATIVA Y FINANCIERA DEL FONDO DE DESARROLLO LOCAL DE FONTIBÓN EN LOS TRAMITES, MANEJO CONTABLE Y DE ARCHIVO; EN FORMA PERMANENTE EN\nEL DESARROLLO DEL PROCESO DE CONSOLIDACIÓN DE INFORMACIÓN DEL SISTEMA CONTABLE\nY FINANCIERO.","Inversión","Un nuevo Contrato Social y ambiental para la Bogotá del Siglo XXI",57,{"$f":"IF(ISERROR(VLOOKUP(K81,[2]Proposito_programa!$C$2:$E$59,2,FALSE)),\" \",VLOOKUP(K81,[2]Proposito_programa!$C$2:$E$59,2,FALSE))","v":"Gestión pública local"},{"$f":"IF(ISERROR(VLOOKUP(K81,[2]Proposito_programa!$C$2:$E$59,3,FALSE)),\" \",VLOOKUP(K81,[2]Proposito_programa!$C$2:$E$59,3,FALSE))","v":"Propósito 5: Construir Bogotá - Región con gobierno abierto, transparente y ciudadanía consciente"},1783,1,78759631,"OSCAR JOSE SUAREZ PEÑA","Persona Natural",null,null,null,21805000,null,0,0,21805000,20642067,"2021-03-09","2021-03-09","2021-08-08","152 DÍAS",0,0,null,null,null,null,null,null,"X",null,0.95]
[69,2021,"FDLF-CD-69-2021","https://community.secop.gov.co/Public/Tendering/OpportunityDetail/Index?noticeUID=CO1.NTC.1817426&isFromPublicArea=True&isModal=true&asPopupView=true","Contratos de prestación de servicios profesionales y de apoyo a la gestión","Contratación directa","Prestación de servicios profesionales y de apoyo a la gestión, o para la ejecución de trabajos artísticos que sólo puedan encomendarse a determinadas personas naturales;","PRESTAR LOS SERVICIOS PROFESIONALES PARA APOYAR LAS ACTIVIDADES DE REACTIVACIÓN ECONÓMICA DESARROLLADAS POR LA ALCALDÍA LOCAL DE FONTIBÓN","Inversión","Un nuevo Contrato Social y ambiental para la Bogotá del Siglo XXI",57,{"$f":"IF(ISERROR(VLOOKUP(K82,[2]Proposito_programa!$C$2:$E$59,2,FALSE)),\" \",VLOOKUP(K82,[2]Proposito_programa!$C$2:$E$59,2,FALSE))","v":"Gestión pública local"},{"$f":"IF(ISERROR(VLOOKUP(K82,[2]Proposito_programa!$C$2:$E$59,3,FALSE)),\" \",VLOOKUP(K82,[2]Proposito_programa!$C$2:$E$59,3,FALSE))","v":"Propósito 5: Construir Bogotá - Región con gobierno abierto, transparente y ciudadanía consciente"},1783,1,1010215699,"MATEO BANGUERO AGUDELO","Persona Natural",null,null,null,21630000,null,0,0,21630000,21053200,"2021-03-05","2021-03-05","2021-08-04","152 DÍAS",0,0,null,null,null,null,null,null,"X",null,0.97]
[70,2021,"FDLF-CD-70-2021","https://community.secop.gov.co/Public/Tendering/OpportunityDetail/Index?noticeUID=CO1.NTC.1817489&isFromPublicArea=True&isModal=true&asPopupView=true","Contratos de prestación de servicios profesionales y de apoyo a la gestión","Contratación directa","Prestación de servicios profesionales y de apoyo a la gestión, o para la ejecución de trabajos artísticos que sólo puedan encomendarse a determinadas personas naturales;","PRESTAR SERVICIOS PROFESIONALES PARA APOYAR EL ÁREA DE GESTIÓN DE DESARROLLO LOCAL EN TEMAS DE PLANEACIÓN DE LOS PROCESOS CONTRACTUALES","Inversión","Un nuevo Contrato Social y ambiental para la Bogotá del Siglo XXI",57,{"$f":"IF(ISERROR(VLOOKUP(K83,[2]Proposito_programa!$C$2:$E$59,2,FALSE)),\" \",VLOOKUP(K83,[2]Proposito_programa!$C$2:$E$59,2,FALSE))","v":"Gestión pública local"},{"$f":"IF(ISERROR(VLOOKUP(K83,[2]Proposito_programa!$C$2:$E$59,3,FALSE)),\" \",VLOOKUP(K83,[2]Proposito_programa!$C$2:$E$59,3,FALSE))","v":"Propósito 5: Construir Bogotá - Región con gobierno abierto, transparente y ciudadanía consciente"},1783,1,52515689,"BIBIANA BAUTISTA ZABALETA","Persona Natural",null,null,null,50985000,null,1,4909667,55894667,50229667,"2021-03-05","2021-03-05","2021-12-30","300 DÍAS",1,26,null,null,null,null,null,null,"X",null,0.9]
[71,2021,"FDLF-CD-71-2021","https://community.secop.gov.co/Public/Tendering/OpportunityDetail/Index?noticeUID=CO1.NTC.1828856&isFromPublicArea=True&isModal=true&asPopupView=true","Contratos de prestación de servicios profesionales y de apoyo a la gestión","Contratación directa","Prestación de servicios profesionales y de apoyo a la gestión, o para la ejecución de trabajos artísticos que sólo puedan encomendarse a determinadas personas naturales;","PRESTAR SERVICIOS PARA APOYAR LA GESTIÓN DOCUMENTAL DE LA ALCALDÍA LOCAL EN LA IMPLEMENTACIÓN DE LOS PROCESOS DE CLASIFICACIÓN, ORDENACIÓN, SELECCIÓN NATURAL, FOLIACIÓN, IDENTIFICACIÓN, LEVANTAMIENTO DE INVENTARIOS, ALMACENAMIENTO Y APLICACIÓN DE PROTOCOLOS DE ELIMINACIÓN Y TRANSFERENCIAS DOCUMENTALES","Inversión","Un nuevo Contrato Social y ambiental para la Bogotá del Siglo XXI",57,{"$f":"IF(ISERROR(VLOOKUP(K84,[2]Proposito_programa!$C$2:$E$59,2,FALSE)),\" \",VLOOKUP(K84,[2]Proposito_programa!$C$2:$E$59,2,FALSE))","v":"Gestión pública local"},{"$f":"IF(ISERROR(VLOOKUP(K84,[2]Proposito_programa!$C$2:$E$59,3,FALSE)),\" \",VLOOKUP(K84,[2]Proposito_programa!$C$2:$E$59,3,FALSE))","v":"Propósito 5: Construir Bogotá - Región con gobierno abierto, transparente y ciudadanía consciente"},1783,1,80804691,"JOHAN MANUEL RAMOS RODRIGUEZ","Persona Natural",null,null,null,12169450,null,0,0,12169450,12169450,"2021-03-11","2021-03-11","2021-08-10","152 DÍAS",0,0,null,null,null,null,null,null,"X",null,1]
[72,2021,"FDLF-CD-72-2021","https://community.secop.gov.co/Public/Tendering/OpportunityDetail/Index?noticeUID=CO1.NTC.1827222&isFromPublicArea=True&isModal=true&asPopupView=true","Contratos de prestación de servicios profesionales y de apoyo a la gestión","Contratación directa","Prestación de servicios profesionales y de apoyo a la gestión, o para la ejecución de trabajos artísticos que sólo puedan encomendarse a determinadas personas naturales;","PRESTAR SERVICIOS DE APOYO AL ÁREA DE\nGESTIÓN DEL DESARROLLO LOCAL DE LA ALCALDÍA LOCAL DE FONTIBÓN","Inversión","Un nuevo Contrato Social y ambiental para la Bogotá del Siglo XXI",57,{"$f":"IF(ISERROR(VLOOKUP(K85,[2]Proposito_programa!$C$2:$E$59,2,FALSE)),\" \",VLOOKUP(K85,[2]Proposito_programa!$C$2:$E$59,2,FALSE))","v":"Gestión pública local"},{"$f":"IF(ISERROR(VLOOKUP(K85,[2]Proposito_programa!$C$2:$E$59,3,FALSE)),\" \",VLOOKUP(K85,[2]Proposito_programa!$C$2:$E$59,3,FALSE))","v":"Propósito 5: Construir Bogotá - Región con gobierno abierto, transparente y ciudadanía consciente"},1783,1,1016026485,"FABIOLA ANDREA CASTRO GOMEZ","Persona Natural",null,null,null,4867780,null,0,0,4867780,4867780,"2021-03-10","2021-03-10","2021-05-09","60 DÍAS",0,0,null,null,null,null,null,null,"X",null,1]
[73,2021,"FDLF-CD-73-2021","https://community.secop.gov.co/Public/Tendering/OpportunityDetail/Index?noticeUID=CO1.NTC.1830368&isFromPublicArea=True&isModal=true&asPopupView=true","Contratos de prestación de servicios profesionales y de apoyo a la gestión","Contratación directa","Prestación de servicios profesionales y de apoyo a la gestión, o para la ejecución de trabajos artísticos que sólo puedan encomendarse a determinadas personas naturales;"," PRESTAR SERVICIOS DE APOYO TÉCNICO ADMINISTRATIVO AL ÁREA DE GESTIÓN DEL DESARROLLO LOCAL DE FONTIBÓN","Inversión","Un nuevo Contrato Social y ambiental para la Bogotá del Siglo XXI",57,{"$f":"IF(ISERROR(VLOOKUP(K86,[2]Proposito_programa!$C$2:$E$59,2,FALSE)),\" \",VLOOKUP(K86,[2]Proposito_programa!$C$2:$E$59,2,FALSE))","v":"Gestión pública local"},{"$f":"IF(ISERROR(VLOOKUP(K86,[2]Proposito_programa!$C$2:$E$59,3,FALSE)),\" \",VLOOKUP(K86,[2]Proposito_programa!$C$2:$E$59,3,FALSE))","v":"Propósito 5: Construir Bogotá - Región con gobierno abierto, transparente y ciudadanía consciente"},1783,1,52358174,"MARIA ISABEL BUITRAGO POLOCHE","Persona Natural",null,null,null,35226000,null,1,3914000,39140000,33921333,"2021-03-11","2021-03-11","2022-01-10","274 DÍAS",1,30,null,null,null,null,null,null,"X",null,0.87]
[74,2021,"FDLF-CD-74-2021","https://community.secop.gov.co/Public/Tendering/OpportunityDetail/Index?noticeUID=CO1.NTC.1830473&isFromPublicArea=True&isModal=true&asPopupView=true","Contratos de prestación de servicios profesionales y de apoyo a la gestión","Contratación directa","Prestación de servicios profesionales y de apoyo a la gestión, o para la ejecución de trabajos artísticos que sólo puedan encomendarse a determinadas personas naturales;","PRESTAR LOS SERVICIOS PROFESIONALES\nPARA APOYAR LAS ACTIVIDADES ESTRATÉGICAS DESARROLLADAS POR EL DESPACHO DE LA\nALCALDÍA LOCAL DE FONTIBÓN","Inversión","Un nuevo Contrato Social y ambiental para la Bogotá del Siglo XXI",57,{"$f":"IF(ISERROR(VLOOKUP(K87,[2]Proposito_programa!$C$2:$E$59,2,FALSE)),\" \",VLOOKUP(K87,[2]Proposito_programa!$C$2:$E$59,2,FALSE))","v":"Gestión pública local"},{"$f":"IF(ISERROR(VLOOKUP(K87,[2]Proposito_programa!$C$2:$E$59,3,FALSE)),\" \",VLOOKUP(K87,[2]Proposito_programa!$C$2:$E$59,3,FALSE))","v":"Propósito 5: Construir Bogotá - Región con gobierno abierto, transparente y ciudadanía consciente"},1783,1,1016063780,"CAMILO  ANDRES BERNAL GOMEZ","Persona Natural",null,null,null,38934000,null,0,0,38934000,37492000,"2021-03-11","2021-03-11","2021-12-10","274 DÍAS",0,0,null,null,null,null,null,null,"X",null,0.96]
[75,2021,"FDLF-CD-75-2021","https://community.secop.gov.co/Public/Tendering/OpportunityDetail/Index?noticeUID=CO1.NTC.1828531&isFromPublicArea=True&isModal=true&asPopupView=true","Contratos de prestación de servicios profesionales y de apoyo a la gestión","Contratación directa","Prestación de servicios profesionales y de apoyo a la gestión, o para la ejecución de trabajos artísticos que sólo puedan encomendarse a determinadas personas naturales;","PRESTAR SERVICIOS PROFESIONALES PARA APOYAR EL ÁREA DE GESTIÓN DEL DESARROLLO LOCAL EN LA EJECUCIÓN DEL PROYECTO UN NUEVO CONTRATO PARA LOS PARQUES DE FONTIBÓN","Inversión","Un nuevo Contrato Social y ambiental para la Bogotá del Siglo XXI",33,{"$f":"IF(ISERROR(VLOOKUP(K88,[2]Proposito_programa!$C$2:$E$59,2,FALSE)),\" \",VLOOKUP(K88,[2]Proposito_programa!$C$2:$E$59,2,FALSE))","v":"Más árboles y más y mejor espacio público"},{"$f":"IF(ISERROR(VLOOKUP(K88,[2]Proposito_programa!$C$2:$E$59,3,FALSE)),\" \",VLOOKUP(K88,[2]Proposito_programa!$C$2:$E$59,3,FALSE))","v":"Propósito 2 : Cambiar Nuestros Hábitos de Vida para Reverdecer a Bogotá y Adaptarnos y Mitigar la Crisis Climática"},1770,1,79964006,"JAVIER ERNESTO ROJAS DIAZ","Persona Natural",null,null,null,47700000,null,0,0,47700000,46286667,"2021-03-09","2021-03-09","2021-12-08","274 DÍAS",0,0,null,null,null,null,null,null,"X",null,0.97]
[76,2021,"FDLF-CD-76-2021","https://community.secop.gov.co/Public/Tendering/OpportunityDetail/Index?noticeUID=CO1.NTC.1830471&isFromPublicArea=True&isModal=true&asPopupView=true","Contratos de prestación de servicios profesionales y de apoyo a la gestión","Contratación directa","Prestación de servicios profesionales y de apoyo a la gestión, o para la ejecución de trabajos artísticos que sólo puedan encomendarse a determinadas personas naturales;","SERVICIOS DE APOYO TÉCNICO ADMINISTRATIVO PARA PROCESOS DE COBRO PERSUASIVO DE LAS OBLIGACIONES CLARAS, EXPRESAS Y ACTUALMENTE EXIGIBLES, POR CONCEPTO DE\nMULTAS IMPUESTAS POR EL ÁREA DE GESTIÓN POLICIVA.","Inversión","Un nuevo Contrato Social y ambiental para la Bogotá del Siglo XXI",57,{"$f":"IF(ISERROR(VLOOKUP(K89,[2]Proposito_programa!$C$2:$E$59,2,FALSE)),\" \",VLOOKUP(K89,[2]Proposito_programa!$C$2:$E$59,2,FALSE))","v":"Gestión pública local"},{"$f":"IF(ISERROR(VLOOKUP(K89,[2]Proposito_programa!$C$2:$E$59,3,FALSE)),\" \",VLOOKUP(K89,[2]Proposito_programa!$C$2:$E$59,3,FALSE))","v":"Propósito 5: Construir Bogotá - Región con gobierno abierto, transparente y ciudadanía consciente"},1784,1,52848705,"CAROLINA HERNANDEZ HERRERA","Persona Natural",null,null,null,35226000,null,1,5349133,40575133,33921333,"2021-03-11","2021-03-11","2022-01-21","274 DÍAS",1,41,null,null,null,null,null,null,"X",null,0.84]
[77,2021,"FDLF-CD-77-2021","https://community.secop.gov.co/Public/Tendering/OpportunityDetail/Index?noticeUID=CO1.NTC.1828487&isFromPublicArea=True&isModal=true&asPopupView=true","Contratos de prestación de servicios profesionales y de apoyo a la gestión","Contratación directa","Prestación de servicios profesionales y de apoyo a la gestión, o para la ejecución de trabajos artísticos que sólo puedan encomendarse a determinadas personas naturales;","PRESTAR SERVICIOS PARA APOYAR ADMINISTRATIVA Y ASISTENCIALMENTE AL ÁREA DE GESTIÓN POLICIVA DE LA LOCALIDAD","Inversión","Un nuevo Contrato Social y ambiental para la Bogotá del Siglo XXI",57,{"$f":"IF(ISERROR(VLOOKUP(K90,[2]Proposito_programa!$C$2:$E$59,2,FALSE)),\" \",VLOOKUP(K90,[2]Proposito_programa!$C$2:$E$59,2,FALSE))","v":"Gestión pública local"},{"$f":"IF(ISERROR(VLOOKUP(K90,[2]Proposito_programa!$C$2:$E$59,3,FALSE)),\" \",VLOOKUP(K90,[2]Proposito_programa!$C$2:$E$59,3,FALSE))","v":"Propósito 5: Construir Bogotá - Región con gobierno abierto, transparente y ciudadanía consciente"},1784,1,1016064829,"CARLOS EDUARDO FLOREZ TORRES","Persona Natural",null,null,null,21905010,null,1,3488576,25393586,21255973,"2021-03-11","2021-03-11","2022-01-21","274 DÍAS",1,43,null,null,null,null,null,null,"X",null,0.84]
[78,2021,"FDLF-CD-78-2021","https://community.secop.gov.co/Public/Tendering/OpportunityDetail/Index?noticeUID=CO1.NTC.1829608&isFromPublicArea=True&isModal=true&asPopupView=true","Contratos de prestación de servicios profesionales y de apoyo a la gestión","Contratación directa","Prestación de servicios profesionales y de apoyo a la gestión, o para la ejecución de trabajos artísticos que sólo puedan encomendarse a determinadas personas naturales;","LA PRESTACIÓN DE SERVICIOS PROFESIONALES PARA APOYAR EL ÁREA DE GESTIÓN DE DESARROLLO LOCAL DE FONTIBÓN EN TEMAS ORIENTADOS A SALUD EN LA LOCALIDAD","Inversión","Un nuevo Contrato Social y ambiental para la Bogotá del Siglo XXI",6,{"$f":"IF(ISERROR(VLOOKUP(K91,[2]Proposito_programa!$C$2:$E$59,2,FALSE)),\" \",VLOOKUP(K91,[2]Proposito_programa!$C$2:$E$59,2,FALSE))","v":"Sistema Distrital de Cuidado"},{"$f":"IF(ISERROR(VLOOKUP(K91,[2]Proposito_programa!$C$2:$E$59,3,FALSE)),\" \",VLOOKUP(K91,[2]Proposito_programa!$C$2:$E$59,3,FALSE))","v":"Propósito 1: Hacer un nuevo contrato social para incrementar la inclusión social, productiva y política"},1764,1,53080759,"VIVIANA ANDREA OJEDA VILLALBA","Persona Natural",null,null,null,21805000,null,0,0,21805000,21805000,"2021-03-09","2021-03-09","2021-08-08","152 DÍAS",0,0,null,null,null,null,null,null,"X",null,1]
[79,2021,"FDLF-CD-79-2021","https://community.secop.gov.co/Public/Tendering/OpportunityDetail/Index?noticeUID=CO1.NTC.1831022&isFromPublicArea=True&isModal=true&asPopupView=true","Contratos de prestación de servicios profesionales y de apoyo a la gestión","Contratación directa","Prestación de servicios profesionales y de apoyo a la gestión, o para la ejecución de trabajos artísticos que sólo puedan encomendarse a determinadas personas naturales;","PRESTAR SERVICIOS DE APOYO OPERATIVO PARA LAS ACTIVIDADES RELACIONADAS CON EL MANTENIMIENTO Y REPARACIONES MENORES DE LA SEDE Y DEMÁS DEPENDENCIAS DE LA ALCALDÍA LOCAL DE FONTIBÓN.","Inversión","Un nuevo Contrato Social y ambiental para la Bogotá del Siglo XXI",57,{"$f":"IF(ISERROR(VLOOKUP(K92,[2]Proposito_programa!$C$2:$E$59,2,FALSE)),\" \",VLOOKUP(K92,[2]Proposito_programa!$C$2:$E$59,2,FALSE))","v":"Gestión pública local"},{"$f":"IF(ISERROR(VLOOKUP(K92,[2]Proposito_programa!$C$2:$E$59,3,FALSE)),\" \",VLOOKUP(K92,[2]Proposito_programa!$C$2:$E$59,3,FALSE))","v":"Propósito 5: Construir Bogotá - Región con gobierno abierto, transparente y ciudadanía consciente"},1783,1,79138055,"RENE JAVIER MELO MAZABEL","Persona Natural",null,null,null,12169450,null,1,2758409,14927859,10546857,"2021-03-12","2021-03-12","2022-01-21","152 DÍAS",1,34,79859514,"GIOVANNI ENRIQUE CORTES GARZON","2021-11-24",null,null,null,"X",null,0.87]
[80,2021,"FDLF-CD-80-2021","https://community.secop.gov.co/Public/Tendering/OpportunityDetail/Index?noticeUID=CO1.NTC.1830925&isFromPublicArea=True&isModal=true&asPopupView=true","Contratos de prestación de servicios profesionales y de apoyo a la gestión","Contratación directa","Prestación de servicios profesionales y de apoyo a la gestión, o para la ejecución de trabajos artísticos que sólo puedan encomendarse a determinadas personas naturales;","PRESTAR SERVICIOS DE APOYO OPERATIVO PARA LAS ACTIVIDADES RELACIONADAS CON EL MANTENIMIENTO Y REPARACIONES MENORES DE LA SEDE Y DEMÁS DEPENDENCIAS DE LA ALCALDÍA LOCAL DE FONTIBÓN.","Inversión","Un nuevo Contrato Social y ambiental para la Bogotá del Siglo XXI",57,{"$f":"IF(ISERROR(VLOOKUP(K93,[2]Proposito_programa!$C$2:$E$59,2,FALSE)),\" \",VLOOKUP(K93,[2]Proposito_programa!$C$2:$E$59,2,FALSE))","v":"Gestión pública local"},{"$f":"IF(ISERROR(VLOOKUP(K93,[2]Proposito_programa!$C$2:$E$59,3,FALSE)),\" \",VLOOKUP(K93,[2]Proposito_programa!$C$2:$E$59,3,FALSE))","v":"Propósito 5: Construir Bogotá - Región con gobierno abierto, transparente y ciudadanía consciente"},1783,1,79127015,"WILLIAM MORENO RINCON","Persona Natural",null,null,null,12169450,null,1,6084725,18254175,18254175,"2021-03-12","2021-03-12","2021-10-26","152 DÍAS",1,75,null,null,null,null,null,null,"X",null,0.67]
[81,2021,"FDLF-CD-81-2021","https://community.secop.gov.co/Public/Tendering/OpportunityDetail/Index?noticeUID=CO1.NTC.1831515&isFromPublicArea=True&isModal=true&asPopupView=true","Contratos de prestación de servicios profesionales y de apoyo a la gestión","Contratación directa","Prestación de servicios profesionales y de apoyo a la gestión, o para la ejecución de trabajos artísticos que sólo puedan encomendarse a determinadas personas naturales;","LA PRESTACIÓN DE SERVICIOS PROFESIONALES PARA APOYAR EL ÁREA DE GESTIÓN DE DESARROLLO LOCAL DE FONTIBÓN EN TEMAS ORIENTADOS A SALUD EN LA LOCALIDAD","Inversión","Un nuevo Contrato Social y ambiental para la Bogotá del Siglo XXI",6,{"$f":"IF(ISERROR(VLOOKUP(K94,[2]Proposito_programa!$C$2:$E$59,2,FALSE)),\" \",VLOOKUP(K94,[2]Proposito_programa!$C$2:$E$59,2,FALSE))","v":"Sistema Distrital de Cuidado"},{"$f":"IF(ISERROR(VLOOKUP(K94,[2]Proposito_programa!$C$2:$E$59,3,FALSE)),\" \",VLOOKUP(K94,[2]Proposito_programa!$C$2:$E$59,3,FALSE))","v":"Propósito 1: Hacer un nuevo contrato social para incrementar la inclusión social, productiva y política"},1764,1,1030678752,"ANGIE HASBLEIDIY MARTINEZ SOTO","Persona Natural",null,null,null,21805000,null,0,0,21805000,21805000,"2021-03-12","2021-03-12","2021-08-11","152 DÍAS",0,0,null,null,null,null,null,null,"X",null,1]
[82,2021,"FDLF-CD-82-2021","https://community.secop.gov.co/Public/Tendering/OpportunityDetail/Index?noticeUID=CO1.NTC.1832424&isFromPublicArea=True&isModal=true&asPopupView=true","Contratos de prestación de servicios profesionales y de apoyo a la gestión","Contratación directa","Prestación de servicios profesionales y de apoyo a la gestión, o para la ejecución de trabajos artísticos que sólo puedan encomendarse a determinadas personas naturales;","PRESTAR SERVICIOS DE APOYO AL ÁREA DE GESTIÓN DEL DESARROLLO LOCAL DE FONTIBÓN EN ACTIVIDADES INHERENTES A LA PLANEACIÓN.","Inversión","Un nuevo Contrato Social y ambiental para la Bogotá del Siglo XXI",57,{"$f":"IF(ISERROR(VLOOKUP(K95,[2]Proposito_programa!$C$2:$E$59,2,FALSE)),\" \",VLOOKUP(K95,[2]Proposito_programa!$C$2:$E$59,2,FALSE))","v":"Gestión pública local"},{"$f":"IF(ISERROR(VLOOKUP(K95,[2]Proposito_programa!$C$2:$E$59,3,FALSE)),\" \",VLOOKUP(K95,[2]Proposito_programa!$C$2:$E$59,3,FALSE))","v":"Propósito 5: Construir Bogotá - Región con gobierno abierto, transparente y ciudadanía consciente"},1783,1,51583073,"IRMA LUCIA SUAREZ DE ZULUAGA","Persona Natural",null,null,null,4867780,null,0,0,4867780,4867780,"2021-03-12","2021-03-12","2021-05-11","60 DÍAS",0,0,null,null,null,null,null,null,"X",null,1]
[83,2021,"FDLF-CD-83-2021","https://community.secop.gov.co/Public/Tendering/OpportunityDetail/Index?noticeUID=CO1.NTC.1838685&isFromPublicArea=True&isModal=true&asPopupView=true","Contratos de prestación de servicios profesionales y de apoyo a la gestión","Contratación directa","Prestación de servicios profesionales y de apoyo a la gestión, o para la ejecución de trabajos artísticos que sólo puedan encomendarse a determinadas personas naturales;","PRESTAR SERVICIOS PROFESIONALES PARA LIDERAR Y GARANTIZAR LA IMPLEMENTACIÓN Y SEGUIMIENTO DE LOS PROCESOS Y PROCEDIMIENTOS DEL SERVICIO SOCIAL EN LA LOCALIDAD DE FONTIBÓN","Inversión","Un nuevo Contrato Social y ambiental para la Bogotá del Siglo XXI",1,{"$f":"IF(ISERROR(VLOOKUP(K96,[2]Proposito_programa!$C$2:$E$59,2,FALSE)),\" \",VLOOKUP(K96,[2]Proposito_programa!$C$2:$E$59,2,FALSE))","v":"Subsidios y transferencias para la equidad"},{"$f":"IF(ISERROR(VLOOKUP(K96,[2]Proposito_programa!$C$2:$E$59,3,FALSE)),\" \",VLOOKUP(K96,[2]Proposito_programa!$C$2:$E$59,3,FALSE))","v":"Propósito 1: Hacer un nuevo contrato social para incrementar la inclusión social, productiva y política"},1752,1,52783244,"DUDLEY JOHANNA PALACIOS GARCIA","Persona Natural",null,null,null,53411920,null,1,4990041,58401961,47867430,"2021-03-12","2021-03-12","2022-01-24","293 DÍAS",0,0,null,null,null,null,null,null,"X",null,0.8]
[84,2021,"FDLF-CD-84-2021","https://community.secop.gov.co/Public/Tendering/OpportunityDetail/Index?noticeUID=CO1.NTC.1833511&isFromPublicArea=True&isModal=true&asPopupView=true","Contratos de prestación de servicios profesionales y de apoyo a la gestión","Contratación directa","Prestación de servicios profesionales y de apoyo a la gestión, o para la ejecución de trabajos artísticos que sólo puedan encomendarse a determinadas personas naturales;","EL CONTRATO QUE SE PRETENDE CELEBRAR, TENDRÁ POR OBJETO PRESTAR SERVICIOS COMO PROFESIONAL DE APOYO EN\nFORMULACIÓN, EJECUCIÓN Y SEGUIMIENTO PARA LAS ACTIVIDADES DE MANTENIMIENTO Y SOSTENIBILIDAD DE LAS SEDES\nDE LA ALCALDÍA LOCAL DE FONTIBÓN.","Inversión","Un nuevo Contrato Social y ambiental para la Bogotá del Siglo XXI",57,{"$f":"IF(ISERROR(VLOOKUP(K97,[2]Proposito_programa!$C$2:$E$59,2,FALSE)),\" \",VLOOKUP(K97,[2]Proposito_programa!$C$2:$E$59,2,FALSE))","v":"Gestión pública local"},{"$f":"IF(ISERROR(VLOOKUP(K97,[2]Proposito_programa!$C$2:$E$59,3,FALSE)),\" \",VLOOKUP(K97,[2]Proposito_programa!$C$2:$E$59,3,FALSE))","v":"Propósito 5: Construir Bogotá - Región con gobierno abierto, transparente y ciudadanía consciente"},1783,1,1593091,"JOHN HEYLER MOSQUERA ASPRILLA","Persona Natural",null,null,null,45000000,null,1,3166667,48166667,43166666,"2021-03-12","2021-03-12","2021-12-30","274 DÍAS",1,19,null,null,null,null,null,null,"X",null,0.9]
[85,2021,"FDLF-CD-85-2021","https://community.secop.gov.co/Public/Tendering/OpportunityDetail/Index?noticeUID=CO1.NTC.1833512&isFromPublicArea=True&isModal=true&asPopupView=true","Contratos de prestación de servicios profesionales y de apoyo a la gestión","Contratación directa","Prestación de servicios profesionales y de apoyo a la gestión, o para la ejecución de trabajos artísticos que sólo puedan encomendarse a determinadas personas naturales;","EL CONTRATO QUE SE PRETENDE CELEBRAR, TENDRÁ POR OBJETO PRESTAR SERVICIOS PROFESIONALES ESPECIALIZADOS PARA\nREALIZAR EL CONTROL SEGUIMIENTO ACTUALIZACIÓN Y ANÁLISIS DEL BANCO DE PROGRAMAS Y PROYECTOS, ASÍ COMO\nTAMBIÉN LOS INSTRUMENTOS DE LA PLANEACIÓN Y GESTIÓN EN EL ÁREA DE GESTIÓN DEL DESARROLLO LOCAL DE LA ALCALDÍA\nLOCAL DE FONTIBÓN.","Inversión","Un nuevo Contrato Social y ambiental para la Bogotá del Siglo XXI",57,{"$f":"IF(ISERROR(VLOOKUP(K98,[2]Proposito_programa!$C$2:$E$59,2,FALSE)),\" \",VLOOKUP(K98,[2]Proposito_programa!$C$2:$E$59,2,FALSE))","v":"Gestión pública local"},{"$f":"IF(ISERROR(VLOOKUP(K98,[2]Proposito_programa!$C$2:$E$59,3,FALSE)),\" \",VLOOKUP(K98,[2]Proposito_programa!$C$2:$E$59,3,FALSE))","v":"Propósito 5: Construir Bogotá - Región con gobierno abierto, transparente y ciudadanía consciente"},1783,1,1030553619,"LUIS FERNANDO MOSCOSO GAVIRIA","Persona Natural",null,null,null,63000000,null,1,7000000,70000000,60433333,"2021-03-12","2021-03-12","2022-01-25","274 DÍAS",1,30,null,null,null,null,null,null,"X",null,0.86]
[86,2021,"FDLF-CD-86-2021","https://community.secop.gov.co/Public/Tendering/OpportunityDetail/Index?noticeUID=CO1.NTC.1833513&isFromPublicArea=True&isModal=true&asPopupView=true","Contratos de prestación de servicios profesionales y de apoyo a la gestión","Contratación directa","Prestación de servicios profesionales y de apoyo a la gestión, o para la ejecución de trabajos artísticos que sólo puedan encomendarse a determinadas personas naturales;","EL CONTRATO QUE SE PRETENDE CELEBRAR, TENDRÁ POR OBJETO PRESTAR SERVICIOS PROFESIONALES PARA APOYAR EL\nFORTALECIMIENTO DE LA GESTIÓN LOCAL DE RIESGO Y CAMBIO CLIMÁTICO EN EL MARCO DEL SISTEMA DISTRITAL DE GESTIÓN\nDE RIESGOS Y CAMBIO CLIMÁTICO DSGR-CC.","Inversión","Un nuevo Contrato Social y ambiental para la Bogotá del Siglo XXI",30,{"$f":"IF(ISERROR(VLOOKUP(K99,[2]Proposito_programa!$C$2:$E$59,2,FALSE)),\" \",VLOOKUP(K99,[2]Proposito_programa!$C$2:$E$59,2,FALSE))","v":"Eficiencia en la atención de emergencias"},{"$f":"IF(ISERROR(VLOOKUP(K99,[2]Proposito_programa!$C$2:$E$59,3,FALSE)),\" \",VLOOKUP(K99,[2]Proposito_programa!$C$2:$E$59,3,FALSE))","v":"Propósito 2 : Cambiar Nuestros Hábitos de Vida para Reverdecer a Bogotá y Adaptarnos y Mitigar la Crisis Climática"},1768,1,80166442,"CARLOS ANDRES MARIN BAUTISTA","Persona Natural",null,null,null,46800000,null,1,7453333,54253333,44893333,"2021-03-12","2021-03-12","2022-01-24","274 DÍAS",1,43,null,null,null,null,null,null,"X",null,0.83]
[87,2021,"FDLF-CD-87-2021","https://community.secop.gov.co/Public/Tendering/OpportunityDetail/Index?noticeUID=CO1.NTC.1834704&isFromPublicArea=True&isModal=true&asPopupView=true","Contratos de prestación de servicios profesionales y de apoyo a la gestión","Contratación directa","Prestación de servicios profesionales y de apoyo a la gestión, o para la ejecución de trabajos artísticos que sólo puedan encomendarse a determinadas personas naturales;","PRESTAR SERVICIOS PROFESIONALES EN INGENIERÍA PARA APOYAR LAS ACTIVIDADES TÉCNICAS Y ADMINISTRATIVAS PROPIAS DE LA CASA DEL CONSUMIDOR, EN EL MARCO DEL CONVENIO SUSCRITO ENTRE LA SUPERINTENDENCIA DE INDUSTRIA Y COMERCIO Y LA ALCALDÍA LOCAL DE FONTIBÓN","Inversión","Un nuevo Contrato Social y ambiental para la Bogotá del Siglo XXI",57,{"$f":"IF(ISERROR(VLOOKUP(K100,[2]Proposito_programa!$C$2:$E$59,2,FALSE)),\" \",VLOOKUP(K100,[2]Proposito_programa!$C$2:$E$59,2,FALSE))","v":"Gestión pública local"},{"$f":"IF(ISERROR(VLOOKUP(K100,[2]Proposito_programa!$C$2:$E$59,3,FALSE)),\" \",VLOOKUP(K100,[2]Proposito_programa!$C$2:$E$59,3,FALSE))","v":"Propósito 5: Construir Bogotá - Región con gobierno abierto, transparente y ciudadanía consciente"},1784,1,19374118,"JUAN BAUTISTA VANEGAS QUINTERO","Persona Natural",null,null,null,44338410,null,1,6568653,50907063,42532030,"2021-03-12","2021-03-12","2022-01-21","274 DÍAS",1,40,null,null,null,null,null,null,"X",null,0.84]
[88,2021,"FDLF-CD-88-2021","https://community.secop.gov.co/Public/Tendering/OpportunityDetail/Index?noticeUID=CO1.NTC.1834538&isFromPublicArea=True&isModal=true&asPopupView=true","Contratos de prestación de servicios profesionales y de apoyo a la gestión","Contratación directa","Prestación de servicios profesionales y de apoyo a la gestión, o para la ejecución de trabajos artísticos que sólo puedan encomendarse a determinadas personas naturales;","PRESTAR LOS SERVICIOS PROFESIONALES A LA ALCALDÍA LOCAL DE FONTIBÓN EN LA ADMINISTRACIÓN DE LA RED DE VOZ Y DATOS, EN LA ACTUALIZACIÓN Y SOPORTE CON LAS TECNOLOGÍAS Y SISTEMAS DE INFORMACIÓN, ASÍ COMO EL APOYO A LA SUPERVISIÓN DE LOS CONTRATOS QUE TIENEN RELACIÓN CON SOPORTES TECNOLÓGICOS Y TEMAS RELACIONADOS.","Inversión","Un nuevo Contrato Social y ambiental para la Bogotá del Siglo XXI",57,{"$f":"IF(ISERROR(VLOOKUP(K101,[2]Proposito_programa!$C$2:$E$59,2,FALSE)),\" \",VLOOKUP(K101,[2]Proposito_programa!$C$2:$E$59,2,FALSE))","v":"Gestión pública local"},{"$f":"IF(ISERROR(VLOOKUP(K101,[2]Proposito_programa!$C$2:$E$59,3,FALSE)),\" \",VLOOKUP(K101,[2]Proposito_programa!$C$2:$E$59,3,FALSE))","v":"Propósito 5: Construir Bogotá - Región con gobierno abierto, transparente y ciudadanía consciente"},1783,1,79955070,"CARLOS FERNANDO HUERFANO GUIZA","Persona Natural",null,null,null,45000000,null,2,{"$f":"3333333+2500000","v":5833333},50833333,43333333,"2021-03-11","2021-03-11","2022-01-15","274 DÍAS",1,35,null,null,null,null,null,null,"X",null,0.85]
[89,2021,"FDLF-CD-89-2021","https://community.secop.gov.co/Public/Tendering/OpportunityDetail/Index?noticeUID=CO1.NTC.1834745&isFromPublicArea=True&isModal=true&asPopupView=true","Contratos de prestación de servicios profesionales y de apoyo a la gestión","Contratación directa","Prestación de servicios profesionales y de apoyo a la gestión, o para la ejecución de trabajos artísticos que sólo puedan encomendarse a determinadas personas naturales;","PRESTAR SERVICIOS PARA APOYAR JURÍDICAMENTE LA EJECUCIÓN DE LAS ACCIONES REQUERIDAS PARA EL TRÁMITE E IMPULSO PROCESAL DE LAS ACTUACIONES CONTRAVENCIONALES Y/O QUERELLAS QUE CURSEN EN LAS INSPECCIONES DE POLICÍA DE LA LOCALIDAD","Inversión","Un nuevo Contrato Social y ambiental para la Bogotá del Siglo XXI",57,{"$f":"IF(ISERROR(VLOOKUP(K102,[2]Proposito_programa!$C$2:$E$59,2,FALSE)),\" \",VLOOKUP(K102,[2]Proposito_programa!$C$2:$E$59,2,FALSE))","v":"Gestión pública local"},{"$f":"IF(ISERROR(VLOOKUP(K102,[2]Proposito_programa!$C$2:$E$59,3,FALSE)),\" \",VLOOKUP(K102,[2]Proposito_programa!$C$2:$E$59,3,FALSE))","v":"Propósito 5: Construir Bogotá - Región con gobierno abierto, transparente y ciudadanía consciente"},1784,1,33307650,"LUZ MERY PATERNINA MEDINA","Persona Natural",null,null,null,24632450,null,0,0,24632450,24632450,"2021-03-11","2021-03-11","2021-08-10","152 DÍAS",0,0,null,null,null,null,null,null,"X",null,1]
[90,2021,"FDLF-CD-90-2021","https://community.secop.gov.co/Public/Tendering/OpportunityDetail/Index?noticeUID=CO1.NTC.1838472&isFromPublicArea=True&isModal=true&asPopupView=true","Contratos de prestación de servicios profesionales y de apoyo a la gestión","Contratación directa","Prestación de servicios profesionales y de apoyo a la gestión, o para la ejecución de trabajos artísticos que sólo puedan encomendarse a determinadas personas naturales;","EL CONTRATO QUE SE PRETENDE CELEBRAR, TENDRÁ POR OBJETO PRESTAR SERVICIOS PROFESIONALES PARA APOYAR AL\nDESPACHO DE LA ALCALDÍA LOCAL EN LA PROMOCIÓN, ACOMPAÑAMIENTO, COORDINACIÓN Y ATENCIÓN DE LAS INSTANCIAS\nDE COORDINACIÓN INTERINSTITUCIONALES Y LAS INSTANCIAS DE PARTICIPACIÓN LOCALES, ASÍ COMO LOS PROCESOS\nCOMUNITARIOS EN LA LOCALIDAD.","Inversión","Un nuevo Contrato Social y ambiental para la Bogotá del Siglo XXI",55,{"$f":"IF(ISERROR(VLOOKUP(K103,[2]Proposito_programa!$C$2:$E$59,2,FALSE)),\" \",VLOOKUP(K103,[2]Proposito_programa!$C$2:$E$59,2,FALSE))","v":"Fortalecimiento de cultura ciudadana y su institucionalidad"},{"$f":"IF(ISERROR(VLOOKUP(K103,[2]Proposito_programa!$C$2:$E$59,3,FALSE)),\" \",VLOOKUP(K103,[2]Proposito_programa!$C$2:$E$59,3,FALSE))","v":"Propósito 5: Construir Bogotá - Región con gobierno abierto, transparente y ciudadanía consciente"},1782,1,43558926,"LAYDA MARIA ZULUAGA RIVERA","Persona Natural",null,null,null,25000000,null,0,0,25000000,25000000,"2021-03-17","2021-03-17","2021-08-16","152 DÍAS",0,0,null,null,null,null,null,null,"X",null,1]
[92,2021,"FDLF-CD-92-2021","https://community.secop.gov.co/Public/Tendering/OpportunityDetail/Index?noticeUID=CO1.NTC.1841992&isFromPublicArea=True&isModal=true&asPopupView=true","Contratos de prestación de servicios profesionales y de apoyo a la gestión","Contratación directa","Prestación de servicios profesionales y de apoyo a la gestión, o para la ejecución de trabajos artísticos que sólo puedan encomendarse a determinadas personas naturales;","PRESTAR SERVICIOS COMO AUXILIAR QUE APOYE LA DIGITALIZACIÓN Y SUBIDA AL APLICATIVO SI ACTUA PARA EL ÁREA DE GESTIÓN POLICIVA DE LA ALCALDÍA LOCAL DE FONTIBÓN.","Inversión","Un nuevo Contrato Social y ambiental para la Bogotá del Siglo XXI",57,{"$f":"IF(ISERROR(VLOOKUP(K104,[2]Proposito_programa!$C$2:$E$59,2,FALSE)),\" \",VLOOKUP(K104,[2]Proposito_programa!$C$2:$E$59,2,FALSE))","v":"Gestión pública local"},{"$f":"IF(ISERROR(VLOOKUP(K104,[2]Proposito_programa!$C$2:$E$59,3,FALSE)),\" \",VLOOKUP(K104,[2]Proposito_programa!$C$2:$E$59,3,FALSE))","v":"Propósito 5: Construir Bogotá - Región con gobierno abierto, transparente y ciudadanía consciente"},1784,1,51874701,"CLAUDIA TERESA MORENO BOBADILLA","Persona Natural",null,null,null,21905010,null,1,2758409,24663419,20444676,"2021-03-19","2021-03-19","2022-01-21","274 DÍAS",1,34,null,null,null,null,null,null,"X",null,0.83]
[93,2021,"FDLF-CD-93-2021","https://community.secop.gov.co/Public/Tendering/OpportunityDetail/Index?noticeUID=CO1.NTC.1840818&isFromPublicArea=True&isModal=true&asPopupView=true","Contratos de prestación de servicios profesionales y de apoyo a la gestión","Contratación directa","Prestación de servicios profesionales y de apoyo a la gestión, o para la ejecución de trabajos artísticos que sólo puedan encomendarse a determinadas personas naturales;","PRESTAR SERVICIOS PARA APOYAR ADMINISTRATIVA Y ASISTENCIALMENTE AL ÁREA DE GESTIÓN POLICIVA DE LA LOCALIDAD","Inversión","Un nuevo Contrato Social y ambiental para la Bogotá del Siglo XXI",57,{"$f":"IF(ISERROR(VLOOKUP(K105,[2]Proposito_programa!$C$2:$E$59,2,FALSE)),\" \",VLOOKUP(K105,[2]Proposito_programa!$C$2:$E$59,2,FALSE))","v":"Gestión pública local"},{"$f":"IF(ISERROR(VLOOKUP(K105,[2]Proposito_programa!$C$2:$E$59,3,FALSE)),\" \",VLOOKUP(K105,[2]Proposito_programa!$C$2:$E$59,3,FALSE))","v":"Propósito 5: Construir Bogotá - Región con gobierno abierto, transparente y ciudadanía consciente"},1784,1,1016019536,"INGREE YOMARA DELGADO ARIZA","Persona Natural",null,null,null,21905010,null,1,2433890,24338900,20688065,"2021-03-16","2021-03-16","2022-01-15","274 DÍAS",1,30,null,null,null,null,null,null,"X",null,0.85]
[94,2021,"FDLF-CD-94-2021","https://community.secop.gov.co/Public/Tendering/OpportunityDetail/Index?noticeUID=CO1.NTC.1845245&isFromPublicArea=True&isModal=true&asPopupView=true","Contratos de prestación de servicios profesionales y de apoyo a la gestión","Contratación directa","Prestación de servicios profesionales y de apoyo a la gestión, o para la ejecución de trabajos artísticos que sólo puedan encomendarse a determinadas personas naturales;","PRESTAR LOS SERVICIOS PROFESIONALES PARA APOYAR JURÍDICAMENTE LA EJECUCIÓN DE ACCIONES REQUERIDAS PARA DESCONGESTIONAR LA RECEPCIÓN Y RESPUESTA DE PETICIONES ALLEGADAS AL ÁREA DE GESTIÓN POLICIVA Y JURÍDICA DE LA ALCALDÍA, EN ACTUACIONES ADMINISTRATIVAS Y PRIMERA RESPUESTA DE REQUERIMIENTOS RELACIONADOS CON EL INICIO DEL PROCESO VERBAL ABREVIADO Y LAS OBJECIONES Y/O APELACIONES GENERADAS EN EL PROCESO VERBAL INMEDIATO, ANTES DE REALIZAR SU RESPECTIVO REPARTO","Inversión","Un nuevo Contrato Social y ambiental para la Bogotá del Siglo XXI",57,{"$f":"IF(ISERROR(VLOOKUP(K106,[2]Proposito_programa!$C$2:$E$59,2,FALSE)),\" \",VLOOKUP(K106,[2]Proposito_programa!$C$2:$E$59,2,FALSE))","v":"Gestión pública local"},{"$f":"IF(ISERROR(VLOOKUP(K106,[2]Proposito_programa!$C$2:$E$59,3,FALSE)),\" \",VLOOKUP(K106,[2]Proposito_programa!$C$2:$E$59,3,FALSE))","v":"Propósito 5: Construir Bogotá - Región con gobierno abierto, transparente y ciudadanía consciente"},1784,1,1147687727,"KAREN DAYANA ANGARITA RINCON","Persona Natural",null,null,null,38934000,null,0,0,38934000,36771000,"2021-03-16","2021-03-16","2021-12-15","274 DÍAS",0,0,null,null,null,null,null,null,"X",null,0.94]
[95,2021,"FDLF-CD-95-2021","https://community.secop.gov.co/Public/Tendering/OpportunityDetail/Index?noticeUID=CO1.NTC.1845684&isFromPublicArea=True&isModal=true&asPopupView=true","Contratos de prestación de servicios profesionales y de apoyo a la gestión","Contratación directa","Prestación de servicios profesionales y de apoyo a la gestión, o para la ejecución de trabajos artísticos que sólo puedan encomendarse a determinadas personas naturales;","PRESTAR LOS SERVICIOS PROFESIONALES PARA APOYAR JURÍDICAMENTE LA EJECUCIÓN DE ACCIONES REQUERIDAS PARA DESCONGESTIONAR LA RECEPCIÓN Y RESPUESTA DE PETICIONES ALLEGADAS AL ÁREA DE GESTIÓN POLICIVA Y JURÍDICA DE LA ALCALDÍA, EN ACTUACIONES ADMINISTRATIVAS Y PRIMERA RESPUESTA DE REQUERIMIENTOS RELACIONADOS CON EL INICIO DEL PROCESO VERBAL ABREVIADO Y LAS OBJECIONES Y/O APELACIONES GENERADAS EN EL PROCESO VERBAL INMEDIATO, ANTES DE REALIZAR SU RESPECTIVO REPARTO","Inversión","Un nuevo Contrato Social y ambiental para la Bogotá del Siglo XXI",57,{"$f":"IF(ISERROR(VLOOKUP(K107,[2]Proposito_programa!$C$2:$E$59,2,FALSE)),\" \",VLOOKUP(K107,[2]Proposito_programa!$C$2:$E$59,2,FALSE))","v":"Gestión pública local"},{"$f":"IF(ISERROR(VLOOKUP(K107,[2]Proposito_programa!$C$2:$E$59,3,FALSE)),\" \",VLOOKUP(K107,[2]Proposito_programa!$C$2:$E$59,3,FALSE))","v":"Propósito 5: Construir Bogotá - Región con gobierno abierto, transparente y ciudadanía consciente"},1784,1,1026585989,"MARIA ALEJANDRA QUINTERO MARTINEZ","Persona Natural",null,null,null,38934000,null,1,4326000,43260000,36771000,"2021-03-16","2021-03-16","2022-01-15","274 DÍAS",1,30,null,null,null,null,null,null,"X",null,0.85]
[96,2021,"FDLF-CD-96-2021","https://community.secop.gov.co/Public/Tendering/OpportunityDetail/Index?noticeUID=CO1.NTC.1848132&isFromPublicArea=True&isModal=true&asPopupView=true","Contratos de prestación de servicios profesionales y de apoyo a la gestión","Contratación directa","Prestación de servicios profesionales y de apoyo a la gestión, o para la ejecución de trabajos artísticos que sólo puedan encomendarse a determinadas personas naturales;","PRESTAR SERVICIOS DE APOYO AL ÁREA DE GESTIÓN DEL DESARROLLO LOCAL DE LA ALCALDÍA LOCAL DE FONTIBÓN","Inversión","Un nuevo Contrato Social y ambiental para la Bogotá del Siglo XXI",57,{"$f":"IF(ISERROR(VLOOKUP(K108,[2]Proposito_programa!$C$2:$E$59,2,FALSE)),\" \",VLOOKUP(K108,[2]Proposito_programa!$C$2:$E$59,2,FALSE))","v":"Gestión pública local"},{"$f":"IF(ISERROR(VLOOKUP(K108,[2]Proposito_programa!$C$2:$E$59,3,FALSE)),\" \",VLOOKUP(K108,[2]Proposito_programa!$C$2:$E$59,3,FALSE))","v":"Propósito 5: Construir Bogotá - Región con gobierno abierto, transparente y ciudadanía consciente"},1783,1,80812015,"DAVID ALFONSO CORDOBA FARIETA ","Persona Natural",null,null,null,4867780,null,0,0,4867780,2028242,"2021-04-06","2021-04-06","2021-06-05","60 DÍAS",0,0,null,null,null,null,null,null,"X",null,0.42]
[97,2021,"FDLF-CD-97-2021","https://community.secop.gov.co/Public/Tendering/OpportunityDetail/Index?noticeUID=CO1.NTC.1846473&isFromPublicArea=True&isModal=true&asPopupView=true","Contratos de prestación de servicios profesionales y de apoyo a la gestión","Contratación directa","Prestación de servicios profesionales y de apoyo a la gestión, o para la ejecución de trabajos artísticos que sólo puedan encomendarse a determinadas personas naturales;","SERVICIOS PROFESIONALES PARA APOYAR LAS ACTIVIDADES PROPIAS DEL ÁREA DE GESTIÓN POLICIVA EN RELACIÓN CON LOS PROCESOS DE OBRAS, ESPACIOS PÚBLICOS Y ESTABLECIMIENTOS DE COMERCIO DE LA ALCALDÍA LOCAL DE FONTIBÓN.","Inversión","Un nuevo Contrato Social y ambiental para la Bogotá del Siglo XXI",57,{"$f":"IF(ISERROR(VLOOKUP(K109,[2]Proposito_programa!$C$2:$E$59,2,FALSE)),\" \",VLOOKUP(K109,[2]Proposito_programa!$C$2:$E$59,2,FALSE))","v":"Gestión pública local"},{"$f":"IF(ISERROR(VLOOKUP(K109,[2]Proposito_programa!$C$2:$E$59,3,FALSE)),\" \",VLOOKUP(K109,[2]Proposito_programa!$C$2:$E$59,3,FALSE))","v":"Propósito 5: Construir Bogotá - Región con gobierno abierto, transparente y ciudadanía consciente"},1784,1,79108533,"JOSE JULIAN CARDENAS ZUÑIGA","Persona Natural",null,null,null,54000000,null,1,6000000,60000000,27000000,"2021-03-16","2021-03-16","2022-01-15","274 DÍAS",1,30,null,null,null,null,null,null,"X",null,0.45]
[98,2021,"FDLF-CD-98-2021","https://community.secop.gov.co/Public/Tendering/OpportunityDetail/Index?noticeUID=CO1.NTC.1849710&isFromPublicArea=True&isModal=true&asPopupView=true","Contratos de prestación de servicios profesionales y de apoyo a la gestión","Contratación directa","Prestación de servicios profesionales y de apoyo a la gestión, o para la ejecución de trabajos artísticos que sólo puedan encomendarse a determinadas personas naturales;","APOYAR LA FORMULACIÓN, EJECUCIÓN, SEGUIMIENTO Y MEJORA CONTINUA DE LAS HERRAMIENTAS QUE CONFORMAN LA GESTIÓN AMBIENTAL INSTITUCIONAL DE LA ALCALDÍA LOCAL\nDE FONTIBÓN.","Inversión","Un nuevo Contrato Social y ambiental para la Bogotá del Siglo XXI",57,{"$f":"IF(ISERROR(VLOOKUP(K110,[2]Proposito_programa!$C$2:$E$59,2,FALSE)),\" \",VLOOKUP(K110,[2]Proposito_programa!$C$2:$E$59,2,FALSE))","v":"Gestión pública local"},{"$f":"IF(ISERROR(VLOOKUP(K110,[2]Proposito_programa!$C$2:$E$59,3,FALSE)),\" \",VLOOKUP(K110,[2]Proposito_programa!$C$2:$E$59,3,FALSE))","v":"Propósito 5: Construir Bogotá - Región con gobierno abierto, transparente y ciudadanía consciente"},1783,1,52351073,"SANDRA MILENA CORTES PINEDA","Persona Natural",null,null,null,44338410,null,0,0,{"$f":"Y110+V110+W110","v":44338410},40561434,"2021-03-24","2021-03-24","2021-12-23","274 DÍAS",0,0,null,null,null,null,null,null,"X",null,0.91]
[99,2021,"FDLF-CD-99-2021","https://community.secop.gov.co/Public/Tendering/OpportunityDetail/Index?noticeUID=CO1.NTC.1848869&isFromPublicArea=True&isModal=true&asPopupView=true","Contratos de prestación de servicios profesionales y de apoyo a la gestión","Contratación directa","Prestación de servicios profesionales y de apoyo a la gestión, o para la ejecución de trabajos artísticos que sólo puedan encomendarse a determinadas personas naturales;","APOYAR TÉCNICAMENTE LAS DISTINTAS ETAPAS DE LOS PROCESOS DE COMPETENCIA DE LA ALCALDÍA LOCAL PARA LA DEPURACIÓN DE ACTUACIONES ADMINISTRATIVAS.","Inversión","Un nuevo Contrato Social y ambiental para la Bogotá del Siglo XXI",57,{"$f":"IF(ISERROR(VLOOKUP(K111,[2]Proposito_programa!$C$2:$E$59,2,FALSE)),\" \",VLOOKUP(K111,[2]Proposito_programa!$C$2:$E$59,2,FALSE))","v":"Gestión pública local"},{"$f":"IF(ISERROR(VLOOKUP(K111,[2]Proposito_programa!$C$2:$E$59,3,FALSE)),\" \",VLOOKUP(K111,[2]Proposito_programa!$C$2:$E$59,3,FALSE))","v":"Propósito 5: Construir Bogotá - Región con gobierno abierto, transparente y ciudadanía consciente"},1784,1,19487206,"DARIO PLAZAS MONTAÑEZ","Persona Natural",null,null,null,52200000,null,0,0,8313333,8313333,"2021-03-18","2021-03-18","2021-04-30","274 DÍAS",0,0,null,null,null,null,null,null,"X",null,0.16]
[100,2021,"FDLF-CD-100-2021","https://community.secop.gov.co/Public/Tendering/OpportunityDetail/Index?noticeUID=CO1.NTC.1849640&isFromPublicArea=True&isModal=true&asPopupView=true","Contratos de prestación de servicios profesionales y de apoyo a la gestión","Contratación directa","Prestación de servicios profesionales y de apoyo a la gestión, o para la ejecución de trabajos artísticos que sólo puedan encomendarse a determinadas personas naturales;","PRESTAR LOS SERVICIOS PROFESIONALES PARA APOYAR LAS ACTIVIDADES DE REACTIVACIÓN ECONÓMICA DESARROLLADAS POR LA ALCALDÍA LOCAL DE FONTIBÓN.","Inversión","Un nuevo Contrato Social y ambiental para la Bogotá del Siglo XXI",57,{"$f":"IF(ISERROR(VLOOKUP(K112,[2]Proposito_programa!$C$2:$E$59,2,FALSE)),\" \",VLOOKUP(K112,[2]Proposito_programa!$C$2:$E$59,2,FALSE))","v":"Gestión pública local"},{"$f":"IF(ISERROR(VLOOKUP(K112,[2]Proposito_programa!$C$2:$E$59,3,FALSE)),\" \",VLOOKUP(K112,[2]Proposito_programa!$C$2:$E$59,3,FALSE))","v":"Propósito 5: Construir Bogotá - Región con gobierno abierto, transparente y ciudadanía consciente"},1783,1,1016089405,"JUAN MIGUEL RIAÑO ABRIL","Persona Natural",null,null,null,21630000,null,0,0,{"$f":"Y112+V112+W112","v":21630000},21630000,"2021-03-18","2021-03-18","2021-08-17","152 DÍAS",0,0,null,null,null,null,null,null,"X",null,1]
[101,2021,"FDLF-CD-101-2021","https://community.secop.gov.co/Public/Tendering/OpportunityDetail/Index?noticeUID=CO1.NTC.1849463&isFromPublicArea=True&isModal=true&asPopupView=true","Contratos de prestación de servicios profesionales y de apoyo a la gestión","Contratación directa","Prestación de servicios profesionales y de apoyo a la gestión, o para la ejecución de trabajos artísticos que sólo puedan encomendarse a determinadas personas naturales;","PRESTAR LOS SERVICIOS PROFESIONALES PARA APOYAR LAS ACTIVIDADES DE REACTIVACIÓN ECONÓMICA DESARROLLADAS POR LA ALCALDÍA LOCAL DE FONTIBÓN","Inversión","Un nuevo Contrato Social y ambiental para la Bogotá del Siglo XXI",57,{"$f":"IF(ISERROR(VLOOKUP(K113,[2]Proposito_programa!$C$2:$E$59,2,FALSE)),\" \",VLOOKUP(K113,[2]Proposito_programa!$C$2:$E$59,2,FALSE))","v":"Gestión pública local"},{"$f":"IF(ISERROR(VLOOKUP(K113,[2]Proposito_programa!$C$2:$E$59,3,FALSE)),\" \",VLOOKUP(K113,[2]Proposito_programa!$C$2:$E$59,3,FALSE))","v":"Propósito 5: Construir Bogotá - Región con gobierno abierto, transparente y ciudadanía consciente"},1783,1,79128466,"WILSON EDUARDO SANCHEZ BOJACA","Persona Natural",null,null,null,4867780,null,0,0,4867780,4867780,"2021-03-24","2021-03-24","2021-05-23","60 DÍAS",0,0,null,null,null,null,null,null,"X",null,1]
[102,2021,"FDLF-CD-102-2021","https://community.secop.gov.co/Public/Tendering/OpportunityDetail/Index?noticeUID=CO1.NTC.1849868&isFromPublicArea=True&isModal=true&asPopupView=true","Contratos de prestación de servicios profesionales y de apoyo a la gestión","Contratación directa","Prestación de servicios profesionales y de apoyo a la gestión, o para la ejecución de trabajos artísticos que sólo puedan encomendarse a determinadas personas naturales;","PRESTAR SERVICIOS PROFESIONALES PARA APOYAR EL ÁREA DE GESTIÓN DE DESARROLLO LOCAL ORIENTADO A LOS TEMAS DE EDUCACIÓN","Inversión","Un nuevo Contrato Social y ambiental para la Bogotá del Siglo XXI",17,{"$f":"IF(ISERROR(VLOOKUP(K114,[2]Proposito_programa!$C$2:$E$59,2,FALSE)),\" \",VLOOKUP(K114,[2]Proposito_programa!$C$2:$E$59,2,FALSE))","v":"Jóvenes con capacidades: Proyecto de vida para la ciudadanía, la innovación y el trabajo del siglo XXI"},{"$f":"IF(ISERROR(VLOOKUP(K114,[2]Proposito_programa!$C$2:$E$59,3,FALSE)),\" \",VLOOKUP(K114,[2]Proposito_programa!$C$2:$E$59,3,FALSE))","v":"Propósito 1: Hacer un nuevo contrato social para incrementar la inclusión social, productiva y política"},1755,1,80803689,"HOSMAN YESID HUERTAS QUIROGA","Persona Natural",null,null,null,59247000,null,1,6802433,66049433,55297200,"2021-03-19","2021-03-19","2022-01-19","274 DÍAS",1,31,null,null,null,null,null,null,"X",null,0.84]
[103,2021,"FDLF-CD-103-2021","https://community.secop.gov.co/Public/Tendering/OpportunityDetail/Index?noticeUID=CO1.NTC.1852464&isFromPublicArea=True&isModal=true&asPopupView=true","Contratos de prestación de servicios profesionales y de apoyo a la gestión","Contratación directa","Prestación de servicios profesionales y de apoyo a la gestión, o para la ejecución de trabajos artísticos que sólo puedan encomendarse a determinadas personas naturales;","PRESTAR SERVICIOS PROFESIONALES PARA APOYAR EL ÁREA DE GESTIÓN DE DESARROLLO LOCAL ORIENTADO A LOS TEMAS DE EDUCACIÓN","Inversión","Un nuevo Contrato Social y ambiental para la Bogotá del Siglo XXI",17,{"$f":"IF(ISERROR(VLOOKUP(K115,[2]Proposito_programa!$C$2:$E$59,2,FALSE)),\" \",VLOOKUP(K115,[2]Proposito_programa!$C$2:$E$59,2,FALSE))","v":"Jóvenes con capacidades: Proyecto de vida para la ciudadanía, la innovación y el trabajo del siglo XXI"},{"$f":"IF(ISERROR(VLOOKUP(K115,[2]Proposito_programa!$C$2:$E$59,3,FALSE)),\" \",VLOOKUP(K115,[2]Proposito_programa!$C$2:$E$59,3,FALSE))","v":"Propósito 1: Hacer un nuevo contrato social para incrementar la inclusión social, productiva y política"},1755,1,53031238,"JENNY PAOLA MALAGON BARAHONA","Persona Natural",null,null,null,59247000,null,1,6583000,65830000,55297200,"2021-03-19","2021-03-19","2022-01-18","274 DÍAS",1,30,null,null,null,null,null,null,"X",null,0.84]
[104,2021,"FDLF-CD-104-2021","https://community.secop.gov.co/Public/Tendering/OpportunityDetail/Index?noticeUID=CO1.NTC.1853462&isFromPublicArea=True&isModal=true&asPopupView=true","Contratos de prestación de servicios profesionales y de apoyo a la gestión","Contratación directa","Prestación de servicios profesionales y de apoyo a la gestión, o para la ejecución de trabajos artísticos que sólo puedan encomendarse a determinadas personas naturales;","APOYAR EL CUBRIMIENTO DE LAS ACTIVIDADES, CRONOGRAMAS Y AGENDA DE LA ALCALDÍA LOCAL A NIVEL INTERNO Y EXTERNO, ASÍ COMO LA GENERACIÓN DE CONTENIDOS PERIODÍSTICOS","Inversión","Un nuevo Contrato Social y ambiental para la Bogotá del Siglo XXI",57,{"$f":"IF(ISERROR(VLOOKUP(K116,[2]Proposito_programa!$C$2:$E$59,2,FALSE)),\" \",VLOOKUP(K116,[2]Proposito_programa!$C$2:$E$59,2,FALSE))","v":"Gestión pública local"},{"$f":"IF(ISERROR(VLOOKUP(K116,[2]Proposito_programa!$C$2:$E$59,3,FALSE)),\" \",VLOOKUP(K116,[2]Proposito_programa!$C$2:$E$59,3,FALSE))","v":"Propósito 5: Construir Bogotá - Región con gobierno abierto, transparente y ciudadanía consciente"},1783,1,53095880,"SANDRA STELLA PINEDO ARRIETA","Persona Natural",null,null,null,21630000,null,0,0,21630000,21630000,"2021-03-18","2021-03-18","2021-08-17","152 DÍAS",0,0,null,null,null,null,null,null,"X",null,1]
[105,2021,"FDLF-CD-105-2021","https://community.secop.gov.co/Public/Tendering/OpportunityDetail/Index?noticeUID=CO1.NTC.1853581&isFromPublicArea=True&isModal=true&asPopupView=true","Contratos de prestación de servicios profesionales y de apoyo a la gestión","Contratación directa","Prestación de servicios profesionales y de apoyo a la gestión, o para la ejecución de trabajos artísticos que sólo puedan encomendarse a determinadas personas naturales;","PRESTAR SERVICIOS PROFESIONALES COMO ABOGADO PARA BRINDAR APOYO JURÍDICO EN EL TRÁMITE Y DESARROLLO DE LOS DESPACHOS COMISORIOS QUE POR COMPETENCIA CORRESPONDEN A LA ALCALDÍA LOCAL DE FONTIBÓN","Inversión","Un nuevo Contrato Social y ambiental para la Bogotá del Siglo XXI",57,{"$f":"IF(ISERROR(VLOOKUP(K117,[2]Proposito_programa!$C$2:$E$59,2,FALSE)),\" \",VLOOKUP(K117,[2]Proposito_programa!$C$2:$E$59,2,FALSE))","v":"Gestión pública local"},{"$f":"IF(ISERROR(VLOOKUP(K117,[2]Proposito_programa!$C$2:$E$59,3,FALSE)),\" \",VLOOKUP(K117,[2]Proposito_programa!$C$2:$E$59,3,FALSE))","v":"Propósito 5: Construir Bogotá - Región con gobierno abierto, transparente y ciudadanía consciente"},1783,1,80228231,"CRHISTIAN ANDRES PINTO GONZALEZ","Persona Natural",null,null,null,52200000,null,1,3866667,56066667,48913333,"2021-03-18","2021-03-18","2022-01-18","274 DÍAS",1,20,null,null,null,null,null,null,"X",null,0.87]
[106,2021,"FDLF-CD-106-2021","https://community.secop.gov.co/Public/Tendering/OpportunityDetail/Index?noticeUID=CO1.NTC.1855850&isFromPublicArea=True&isModal=true&asPopupView=true","Contratos de prestación de servicios profesionales y de apoyo a la gestión","Contratación directa","Prestación de servicios profesionales y de apoyo a la gestión, o para la ejecución de trabajos artísticos que sólo puedan encomendarse a determinadas personas naturales;","PRESTAR SERVICIOS DE APOYO AL ÁREA DE GESTIÓN DE DESARROLLO LOCAL, DE LA ALCALDÍA LOCAL DE FONTIBÓN EN LA RECEPCIÓN DE CORRESPONDENCIA INTERNA Y EXTERNA, ASÍ COMO LA ASIGNACIÓN INTERNA DE LAS SOLICITUDES Y/O CORRESPONDENCIA RECIBIDA","Inversión","Un nuevo Contrato Social y ambiental para la Bogotá del Siglo XXI",57,{"$f":"IF(ISERROR(VLOOKUP(K118,[2]Proposito_programa!$C$2:$E$59,2,FALSE)),\" \",VLOOKUP(K118,[2]Proposito_programa!$C$2:$E$59,2,FALSE))","v":"Gestión pública local"},{"$f":"IF(ISERROR(VLOOKUP(K118,[2]Proposito_programa!$C$2:$E$59,3,FALSE)),\" \",VLOOKUP(K118,[2]Proposito_programa!$C$2:$E$59,3,FALSE))","v":"Propósito 5: Construir Bogotá - Región con gobierno abierto, transparente y ciudadanía consciente"},1783,1,1007703316,"JORGE ALEXANDER LOPEZ UMBARILA","Persona Natural",null,null,null,21905010,null,1,2028242,23933252,19957898,"2021-03-25","2021-03-25","2022-01-19","274 DÍAS",1,25,null,null,null,null,null,null,"X",null,0.83]
[107,2021,"FDLF-CD-107-2021","https://community.secop.gov.co/Public/Tendering/OpportunityDetail/Index?noticeUID=CO1.NTC.1855276&isFromPublicArea=True&isModal=true&asPopupView=true","Contratos de prestación de servicios profesionales y de apoyo a la gestión","Contratación directa","Prestación de servicios profesionales y de apoyo a la gestión, o para la ejecución de trabajos artísticos que sólo puedan encomendarse a determinadas personas naturales;","PRESTAR SERVICIOS PROFESIONALES PARA APOYAR AL ÁREA DE GESTIÓN DE DESARROLLO LOCAL EN LA PROMOCIÓN, ACOMPAÑAMIENTO Y ATENCIÓN DE LAS INSTANCIAS DE PARTICIPACIÓN LOCALES, ASÍ COMO LOS PROCESOS COMUNITARIOS EN LA LOCALIDAD","Inversión","Un nuevo Contrato Social y ambiental para la Bogotá del Siglo XXI",55,{"$f":"IF(ISERROR(VLOOKUP(K119,[2]Proposito_programa!$C$2:$E$59,2,FALSE)),\" \",VLOOKUP(K119,[2]Proposito_programa!$C$2:$E$59,2,FALSE))","v":"Fortalecimiento de cultura ciudadana y su institucionalidad"},{"$f":"IF(ISERROR(VLOOKUP(K119,[2]Proposito_programa!$C$2:$E$59,3,FALSE)),\" \",VLOOKUP(K119,[2]Proposito_programa!$C$2:$E$59,3,FALSE))","v":"Propósito 5: Construir Bogotá - Región con gobierno abierto, transparente y ciudadanía consciente"},1782,1,1032496258,"JULIAN OSORIO ARROYO","Persona Natural",null,null,null,39249000,null,1,4651733,43900733,36050933,"2021-03-23","2021-03-23","2022-01-24","274 DÍAS",1,32,null,null,null,null,null,null,"X",null,0.82]
[108,2021,"FDLF-CD-108-2021","https://community.secop.gov.co/Public/Tendering/OpportunityDetail/Index?noticeUID=CO1.NTC.1858559&isFromPublicArea=True&isModal=true&asPopupView=true","Contratos de prestación de servicios profesionales y de apoyo a la gestión","Contratación directa","Prestación de servicios profesionales y de apoyo a la gestión, o para la ejecución de trabajos artísticos que sólo puedan encomendarse a determinadas personas naturales;","PRESTAR SERVICIOS PROFESIONALES PARA BRINDAR APOYO AL ALMACÉN EN LA PROYECCIÓN, SEGUIMIENTO Y APOYO A LA SUPERVISIÓN DE COMODATOS","Inversión","Un nuevo Contrato Social y ambiental para la Bogotá del Siglo XXI",57,{"$f":"IF(ISERROR(VLOOKUP(K120,[2]Proposito_programa!$C$2:$E$59,2,FALSE)),\" \",VLOOKUP(K120,[2]Proposito_programa!$C$2:$E$59,2,FALSE))","v":"Gestión pública local"},{"$f":"IF(ISERROR(VLOOKUP(K120,[2]Proposito_programa!$C$2:$E$59,3,FALSE)),\" \",VLOOKUP(K120,[2]Proposito_programa!$C$2:$E$59,3,FALSE))","v":"Propósito 5: Construir Bogotá - Región con gobierno abierto, transparente y ciudadanía consciente"},1783,1,1016055959,"JAIR ANDRES ACEVEDO RINCON","Persona Natural",null,null,null,38934000,null,1,2451400,41385400,31291400,"2021-03-24","2021-03-24","2022-01-10","274 DÍAS",1,17,null,null,null,null,null,null,"X",null,0.76]
[109,2021,"FDLF-CD-109-2021","https://community.secop.gov.co/Public/Tendering/OpportunityDetail/Index?noticeUID=CO1.NTC.1865310&isFromPublicArea=True&isModal=true&asPopupView=true","Contratos de prestación de servicios profesionales y de apoyo a la gestión","Contratación directa","Prestación de servicios profesionales y de apoyo a la gestión, o para la ejecución de trabajos artísticos que sólo puedan encomendarse a determinadas personas naturales;","PRESTAR LOS SERVICIOS PROFESIONALES A LA ALCALDÍA LOCAL DE FONTIBÓN, PARA LA EJECUCIÓN DE LAS ACTIVIDADES Y PROCESOS ADMINISTRATIVOS Y DE CAMPO RELACIONADOS CON LA REACTIVACIÓN ECONÓMICA EN EL MARCO DE LAS NECESIDADES DEL FONDO DE DESARROLLO LOCAL A CAUSA DE LA EMERGENCIA PRESENTADA POR EL COVID 19.","Inversión","Un nuevo Contrato Social y ambiental para la Bogotá del Siglo XXI",57,{"$f":"IF(ISERROR(VLOOKUP(K121,[2]Proposito_programa!$C$2:$E$59,2,FALSE)),\" \",VLOOKUP(K121,[2]Proposito_programa!$C$2:$E$59,2,FALSE))","v":"Gestión pública local"},{"$f":"IF(ISERROR(VLOOKUP(K121,[2]Proposito_programa!$C$2:$E$59,3,FALSE)),\" \",VLOOKUP(K121,[2]Proposito_programa!$C$2:$E$59,3,FALSE))","v":"Propósito 5: Construir Bogotá - Región con gobierno abierto, transparente y ciudadanía consciente"},1783,1,78038616,"OSCAR IGNACIO SALABARRIA BEDOYA","Persona Natural",null,null,null,24632350,null,0,0,24632450,24632450,"2021-03-25","2021-03-25","2021-08-24","152 DÍAS",0,0,null,null,null,null,null,null,"X",null,1]
[110,2021,"FDLF-CD-110-2021","https://community.secop.gov.co/Public/Tendering/OpportunityDetail/Index?noticeUID=CO1.NTC.1860283&isFromPublicArea=True&isModal=true&asPopupView=true","Contratos de prestación de servicios profesionales y de apoyo a la gestión","Contratación directa","Prestación de servicios profesionales y de apoyo a la gestión, o para la ejecución de trabajos artísticos que sólo puedan encomendarse a determinadas personas naturales;","APOYAR EL ALCALDE LOCAL EN LA GESTIÓN DE LOS ASUNTOS RELACIONADOS CON SEGURIDAD CIUDADANA, CONVIVENCIA Y PREVENCIÓN DE CONFLICTIVIDADES, VIOLENCIAS Y DELITOS EN LA LOCALIDAD, DE CONFORMIDAD CON EL MARCO NORMATIVO APLICABLE EN LA MATERIA.","Inversión","Un nuevo Contrato Social y ambiental para la Bogotá del Siglo XXI",48,{"$f":"IF(ISERROR(VLOOKUP(K122,[2]Proposito_programa!$C$2:$E$59,2,FALSE)),\" \",VLOOKUP(K122,[2]Proposito_programa!$C$2:$E$59,2,FALSE))","v":"Plataforma institucional para la seguridad y justicia"},{"$f":"IF(ISERROR(VLOOKUP(K122,[2]Proposito_programa!$C$2:$E$59,3,FALSE)),\" \",VLOOKUP(K122,[2]Proposito_programa!$C$2:$E$59,3,FALSE))","v":"Propósito 3: Inspirar confianza y legitimidad para vivir sin miedo y ser epicentro de cultura ciudadana, paz y reconciliación"},2007,1,1019045244,"JULIETH JOHANA GARCIA LOPEZ","Persona Natural",null,null,null,25000000,null,0,0,{"$f":"Y122+V122+W122","v":25000000},21166667,"2021-03-24","2021-03-24","2021-08-23","152 DÍAS",0,0,null,null,null,null,null,null,"X",null,0.85]
[111,2021,"FDLF-CD-111-2021","https://community.secop.gov.co/Public/Tendering/OpportunityDetail/Index?noticeUID=CO1.NTC.1860246&isFromPublicArea=True&isModal=true&asPopupView=true","Contratos de prestación de servicios profesionales y de apoyo a la gestión","Contratación directa","Prestación de servicios profesionales y de apoyo a la gestión, o para la ejecución de trabajos artísticos que sólo puedan encomendarse a determinadas personas naturales;","PRESTAR LOS SERVICIOS PROFESIONALES PARA APOYAR JURÍDICAMENTE LA EJECUCIÓN DE ACCIONES REQUERIDAS PARA DESCONGESTIONAR LA RECEPCIÓN Y RESPUESTA DE PETICIONES ALLEGADAS AL ÁREA DE GESTIÓN POLICIVA Y JURÍDICA DE LA ALCALDÍA, EN ACTUACIONES ADMINISTRATIVAS Y PRIMERA RESPUESTA DE REQUERIMIENTOS RELACIONADOS CON EL INICIO DEL PROCESO VERBAL ABREVIADO Y LAS OBJECIONES Y/O APELACIONES GENERADAS EN EL PROCESO VERBAL INMEDIATO, ANTES DE REALIZAR SU RESPECTIVO REPARTO.","Inversión","Un nuevo Contrato Social y ambiental para la Bogotá del Siglo XXI",57,{"$f":"IF(ISERROR(VLOOKUP(K123,[2]Proposito_programa!$C$2:$E$59,2,FALSE)),\" \",VLOOKUP(K123,[2]Proposito_programa!$C$2:$E$59,2,FALSE))","v":"Gestión pública local"},{"$f":"IF(ISERROR(VLOOKUP(K123,[2]Proposito_programa!$C$2:$E$59,3,FALSE)),\" \",VLOOKUP(K123,[2]Proposito_programa!$C$2:$E$59,3,FALSE))","v":"Propósito 5: Construir Bogotá - Región con gobierno abierto, transparente y ciudadanía consciente"},1784,1,52783302,"CLAUDIA PATRICIA VILLAMIZAR ALCALA","Persona Natural","-","-",null,38934000,null,1,3172400,42106400,35329000,"2021-03-24","2021-03-24","2022-01-15","274 DÍAS",1,22,39745121,"SONIA LORENA MENDOZA BUSTOS","2021-08-02",20332200,null,null,"X",null,0]
[112,2021,"FDLF-CD-112-2021","https://community.secop.gov.co/Public/Tendering/OpportunityDetail/Index?noticeUID=CO1.NTC.1868088&isFromPublicArea=True&isModal=true&asPopupView=true","Contratos de prestación de servicios profesionales y de apoyo a la gestión","Contratación directa","Prestación de servicios profesionales y de apoyo a la gestión, o para la ejecución de trabajos artísticos que sólo puedan encomendarse a determinadas personas naturales;","PRESTAR SERVICIOS PROFESIONALES PARA APOYAR EL ÁREA DE GESTIÓN DE DESARROLLO LOCAL ORIENTADO A LOS TEMAS DEL DESARROLLO SOCIAL, CULTURAL Y DE LA ECONOMÍA LOCAL","Inversión","Un nuevo Contrato Social y ambiental para la Bogotá del Siglo XXI",6,{"$f":"IF(ISERROR(VLOOKUP(K124,[2]Proposito_programa!$C$2:$E$59,2,FALSE)),\" \",VLOOKUP(K124,[2]Proposito_programa!$C$2:$E$59,2,FALSE))","v":"Sistema Distrital de Cuidado"},{"$f":"IF(ISERROR(VLOOKUP(K124,[2]Proposito_programa!$C$2:$E$59,3,FALSE)),\" \",VLOOKUP(K124,[2]Proposito_programa!$C$2:$E$59,3,FALSE))","v":"Propósito 1: Hacer un nuevo contrato social para incrementar la inclusión social, productiva y política"},1761,1,1121820333,"JESSIKA LORENA BECERRA MORALES","Persona Natural","-","-",null,21805000,null,0,0,21805000,21805000,"2021-03-26","2021-03-26","2021-08-25","152 DÍAS",0,0,null,null,null,null,null,null,"X",null,1]
[114,2021,"FDLF-CD-114-2021","https://community.secop.gov.co/Public/Tendering/OpportunityDetail/Index?noticeUID=CO1.NTC.1869031&isFromPublicArea=True&isModal=true&asPopupView=true","Contratos de prestación de servicios profesionales y de apoyo a la gestión","Contratación directa","Prestación de servicios profesionales y de apoyo a la gestión, o para la ejecución de trabajos artísticos que sólo puedan encomendarse a determinadas personas naturales;","PRESTAR SERVICIOS DE APOYO PROFESIONAL AL ÁREA DE GESTIÓN DE DESARROLLO LOCAL DE FONTIBÓN ORIENTADO A LOS TEMAS DEPORTIVOS Y RECREATIVOS","Inversión","Un nuevo Contrato Social y ambiental para la Bogotá del Siglo XXI",20,{"$f":"IF(ISERROR(VLOOKUP(K125,[2]Proposito_programa!$C$2:$E$59,2,FALSE)),\" \",VLOOKUP(K125,[2]Proposito_programa!$C$2:$E$59,2,FALSE))","v":"Bogotá, referente en cultura, deporte, recreación y actividad física, con parques para el desarrollo y la salud"},{"$f":"IF(ISERROR(VLOOKUP(K125,[2]Proposito_programa!$C$2:$E$59,3,FALSE)),\" \",VLOOKUP(K125,[2]Proposito_programa!$C$2:$E$59,3,FALSE))","v":"Propósito 1: Hacer un nuevo contrato social para incrementar la inclusión social, productiva y política"},1757,1,1026585031,"LEONARDO NARVAEZ PUERTA","Persona Natural","-","-",null,39249000,null,1,3634167,42883167,35760200,"2021-03-25","2021-03-25","2022-01-19","274 DÍAS",1,25,null,null,null,null,null,null,"X",null,0.83]
[115,2021,"FDLF-CD-115-2021","https://community.secop.gov.co/Public/Tendering/OpportunityDetail/Index?noticeUID=CO1.NTC.1873697&isFromPublicArea=True&isModal=true&asPopupView=true","Contratos de prestación de servicios profesionales y de apoyo a la gestión","Contratación directa","Prestación de servicios profesionales y de apoyo a la gestión, o para la ejecución de trabajos artísticos que sólo puedan encomendarse a determinadas personas naturales;","APOYAR TÉCNICAMENTE LAS DISTINTAS ETAPAS DE LOS PROCESOS DE COMPETENCIA DE LA ALCALDÍA LOCAL PARA LA DEPURACIÓN DE ACTUACIONES ADMINISTRATIVAS","Inversión","Un nuevo Contrato Social y ambiental para la Bogotá del Siglo XXI",57,{"$f":"IF(ISERROR(VLOOKUP(K126,[2]Proposito_programa!$C$2:$E$59,2,FALSE)),\" \",VLOOKUP(K126,[2]Proposito_programa!$C$2:$E$59,2,FALSE))","v":"Gestión pública local"},{"$f":"IF(ISERROR(VLOOKUP(K126,[2]Proposito_programa!$C$2:$E$59,3,FALSE)),\" \",VLOOKUP(K126,[2]Proposito_programa!$C$2:$E$59,3,FALSE))","v":"Propósito 5: Construir Bogotá - Región con gobierno abierto, transparente y ciudadanía consciente"},1784,1,39536092,"ANA YANET LEGUIZAMON FANDIÑO","Persona Natural","-","-",null,52200000,null,1,3866667,56066667,47366667,"2021-03-26","2021-03-26","2022-01-15","274 DÍAS",1,20,null,null,null,null,null,null,"X",null,0.84]
[116,2021,"FDLF-CD-116-2021","https://community.secop.gov.co/Public/Tendering/OpportunityDetail/Index?noticeUID=CO1.NTC.1873843&isFromPublicArea=True&isModal=true&asPopupView=true","Contratos de prestación de servicios profesionales y de apoyo a la gestión","Contratación directa","Prestación de servicios profesionales y de apoyo a la gestión, o para la ejecución de trabajos artísticos que sólo puedan encomendarse a determinadas personas naturales;","SERVICIOS PROFESIONALES PARA LA OPERACIÓN, PRESTACIÓN, SEGUIMIENTO Y CUMPLIMIENTO DE LOS PROCEDIMIENTOS ADMINISTRATIVOS, OPERATIVOS Y PROGRAMÁTICOS DEL SERVICIO APOYO ECONÓMICO TIPO C, QUE CONTRIBUYAN A LA GARANTÍA DE LOS DERECHOS DE LA POBLACIÓN MAYOR EN EL MARCO DE LA POLÍTICA PÚBLICA SOCIAL PARA EL ENVEJECIMIENTO Y LA VEJEZ EN EL DISTRITO CAPITAL A CARGO DE LA ALCALDÍA LOCAL","Inversión","Un nuevo Contrato Social y ambiental para la Bogotá del Siglo XXI",1,{"$f":"IF(ISERROR(VLOOKUP(K127,[2]Proposito_programa!$C$2:$E$59,2,FALSE)),\" \",VLOOKUP(K127,[2]Proposito_programa!$C$2:$E$59,2,FALSE))","v":"Subsidios y transferencias para la equidad"},{"$f":"IF(ISERROR(VLOOKUP(K127,[2]Proposito_programa!$C$2:$E$59,3,FALSE)),\" \",VLOOKUP(K127,[2]Proposito_programa!$C$2:$E$59,3,FALSE))","v":"Propósito 1: Hacer un nuevo contrato social para incrementar la inclusión social, productiva y política"},1752,1,39750866,"EDITH LUCIA QUECANO CARDENAS","Persona Natural","-","-",null,45159491,null,1,4433841,49593332,40233002,"2021-03-26","2021-03-26","2022-01-24","279 DÍAS",1,27,null,null,null,null,null,null,"X",null,0.81]
[117,2021,"FDLF-CD-117-2021","https://community.secop.gov.co/Public/Tendering/OpportunityDetail/Index?noticeUID=CO1.NTC.1874892&isFromPublicArea=True&isModal=true&asPopupView=true","Contratos de prestación de servicios profesionales y de apoyo a la gestión","Contratación directa","Prestación de servicios profesionales y de apoyo a la gestión, o para la ejecución de trabajos artísticos que sólo puedan encomendarse a determinadas personas naturales;","PRESTAR SERVICIOS PROFESIONALES PARA APOYAR AL ÁREA DE GESTIÓN DE DESARROLLO LOCAL EN LA PROMOCIÓN, ACOMPAÑAMIENTO Y ATENCIÓN DE LAS INSTANCIAS DE PARTICIPACIÓN LOCALES, ASÍ COMO EN LA FORMULACIÓN Y SEGUIMIENTO DE LOS PROYECTOS DE INVERSIÓN RELACIONADOS.","Inversión","Un nuevo Contrato Social y ambiental para la Bogotá del Siglo XXI",55,{"$f":"IF(ISERROR(VLOOKUP(K128,[2]Proposito_programa!$C$2:$E$59,2,FALSE)),\" \",VLOOKUP(K128,[2]Proposito_programa!$C$2:$E$59,2,FALSE))","v":"Fortalecimiento de cultura ciudadana y su institucionalidad"},{"$f":"IF(ISERROR(VLOOKUP(K128,[2]Proposito_programa!$C$2:$E$59,3,FALSE)),\" \",VLOOKUP(K128,[2]Proposito_programa!$C$2:$E$59,3,FALSE))","v":"Propósito 5: Construir Bogotá - Región con gobierno abierto, transparente y ciudadanía consciente"},1782,1,1121908758,"DANIEL FERNANDO BELTRAN","Persona Natural","-","-",null,39249000,null,1,4361000,43610000,35178733,"2021-03-29","2021-03-29","2022-01-24","274 DÍAS",1,30,1030654701,"MARIA PAULA MALDONADO ROLDAN","2021-06-03",29800167,null,null,"X",null,0]
[118,2021,"FDLF-CD-118-2021","https://community.secop.gov.co/Public/Tendering/OpportunityDetail/Index?noticeUID=CO1.NTC.1892854&isFromPublicArea=True&isModal=False\n","Contratos de prestación de servicios profesionales y de apoyo a la gestión","Contratación directa","Prestación de servicios profesionales y de apoyo a la gestión, o para la ejecución de trabajos artísticos que sólo puedan encomendarse a determinadas personas naturales;","PRESTAR SERVICIOS PROFESIONALES PARA APOYAR TÉCNICAMENTE LAS DISTINTAS ETAPAS DE LOS PROCESOS DE COMPETENCIA DE LAS INSPECCIONES DE POLICÍA DE LA LOCALIDAD, SEGÚN REPARTO.","Inversión","Un nuevo Contrato Social y ambiental para la Bogotá del Siglo XXI",57,{"$f":"IF(ISERROR(VLOOKUP(K129,[2]Proposito_programa!$C$2:$E$59,2,FALSE)),\" \",VLOOKUP(K129,[2]Proposito_programa!$C$2:$E$59,2,FALSE))","v":"Gestión pública local"},{"$f":"IF(ISERROR(VLOOKUP(K129,[2]Proposito_programa!$C$2:$E$59,3,FALSE)),\" \",VLOOKUP(K129,[2]Proposito_programa!$C$2:$E$59,3,FALSE))","v":"Propósito 5: Construir Bogotá - Región con gobierno abierto, transparente y ciudadanía consciente"},1784,1,1013601563,"JENNY ANGELICA MALAGON CORTES","Persona Natural","-","-",null,50460000,null,1,5026667,55486667,39246667,"2021-04-08","2021-04-08","2021-12-28","274 DÍAS",0,0,null,null,null,null,null,null,"X",null,0.71]
[119,2021,"FDLF-CD-119-2021","https://community.secop.gov.co/Public/Tendering/OpportunityDetail/Index?noticeUID=CO1.NTC.1880228&isFromPublicArea=True&isModal=true&asPopupView=true","Contratos de prestación de servicios profesionales y de apoyo a la gestión","Contratación directa","Prestación de servicios profesionales y de apoyo a la gestión, o para la ejecución de trabajos artísticos que sólo puedan encomendarse a determinadas personas naturales;","PRESTAR SERVICIOS DE APOYO AL ÁREA DE GESTIÓN DEL DESARROLLO LOCAL DE LA ALCALDÍA LOCAL DE FONTIBÓN.","Inversión","Un nuevo Contrato Social y ambiental para la Bogotá del Siglo XXI",57,{"$f":"IF(ISERROR(VLOOKUP(K130,[2]Proposito_programa!$C$2:$E$59,2,FALSE)),\" \",VLOOKUP(K130,[2]Proposito_programa!$C$2:$E$59,2,FALSE))","v":"Gestión pública local"},{"$f":"IF(ISERROR(VLOOKUP(K130,[2]Proposito_programa!$C$2:$E$59,3,FALSE)),\" \",VLOOKUP(K130,[2]Proposito_programa!$C$2:$E$59,3,FALSE))","v":"Propósito 5: Construir Bogotá - Región con gobierno abierto, transparente y ciudadanía consciente"},1783,1,79112311,"PEDRO HERNANDO VARGAS ZAPATA","Persona Natural","-","-",null,4867780,null,0,0,4867780," $                          -  ","2021-04-06","2021-04-06","2021-06-05","60 DÍAS",0,0,null,null,null,null,null,null,"X",null,0]
[120,2021,"FDLF-CD-120-2021","https://community.secop.gov.co/Public/Tendering/OpportunityDetail/Index?noticeUID=CO1.NTC.1883438&isFromPublicArea=True&isModal=true&asPopupView=true","Contratos de prestación de servicios profesionales y de apoyo a la gestión","Contratación directa","Prestación de servicios profesionales y de apoyo a la gestión, o para la ejecución de trabajos artísticos que sólo puedan encomendarse a determinadas personas naturales;","PRESTAR SERVICIOS DE APOYO OPERATIVO PARA LAS ACTIVIDADES RELACIONADAS CON EL MANTENIMIENTO Y REPARACIONES MENORES DE LA SEDE Y DEMÁS DEPENDENCIAS DE LA ALCALDÍA LOCAL DE FONTIBÓN. ","Inversión","Un nuevo Contrato Social y ambiental para la Bogotá del Siglo XXI",57,{"$f":"IF(ISERROR(VLOOKUP(K131,[2]Proposito_programa!$C$2:$E$59,2,FALSE)),\" \",VLOOKUP(K131,[2]Proposito_programa!$C$2:$E$59,2,FALSE))","v":"Gestión pública local"},{"$f":"IF(ISERROR(VLOOKUP(K131,[2]Proposito_programa!$C$2:$E$59,3,FALSE)),\" \",VLOOKUP(K131,[2]Proposito_programa!$C$2:$E$59,3,FALSE))","v":"Propósito 5: Construir Bogotá - Región con gobierno abierto, transparente y ciudadanía consciente"},1783,1,79617288,"PABLO CESAR CALDERON BELTRAN","Persona Natural","-","-",null,12169450,null,0,0,12169450,11763802,"2021-04-06","2021-04-06","2021-09-05","152 DÍAS",0,0,null,null,null,null,null,null,"X",null,0.97]
[121,2021,"FDLF-CD-121-2021","https://community.secop.gov.co/Public/Tendering/OpportunityDetail/Index?noticeUID=CO1.NTC.1893239&isFromPublicArea=True&isModal=true&asPopupView=true","Contratos de prestación de servicios profesionales y de apoyo a la gestión","Contratación directa","Prestación de servicios profesionales y de apoyo a la gestión, o para la ejecución de trabajos artísticos que sólo puedan encomendarse a determinadas personas naturales;","PRESTAR SERVICIOS PROFESIONALES PARA APOYAR TÉCNICAMENTE LAS DISTINTAS ETAPAS DE LOS PROCESOS DE COMPETENCIA DE LAS INSPECCIONES DE POLICÍA DE LA LOCALIDAD, SEGÚN REPARTO.","Inversión","Un nuevo Contrato Social y ambiental para la Bogotá del Siglo XXI",57,{"$f":"IF(ISERROR(VLOOKUP(K132,[2]Proposito_programa!$C$2:$E$59,2,FALSE)),\" \",VLOOKUP(K132,[2]Proposito_programa!$C$2:$E$59,2,FALSE))","v":"Gestión pública local"},{"$f":"IF(ISERROR(VLOOKUP(K132,[2]Proposito_programa!$C$2:$E$59,3,FALSE)),\" \",VLOOKUP(K132,[2]Proposito_programa!$C$2:$E$59,3,FALSE))","v":"Propósito 5: Construir Bogotá - Región con gobierno abierto, transparente y ciudadanía consciente"},1784,1,1030533242,"DIEGO ALEJANDRO HERNANDEZ BOCANEGRA","Persona Natural","-","-",null,50460000,null,1,5026667,55486667,45046667,"2021-04-08","2021-04-08","2022-01-24","264 DÍAS",1,26,null,null,null,null,null,null,"X",null,0.81]
[122,2021,"FDLF-CD-122-2021","https://community.secop.gov.co/Public/Tendering/OpportunityDetail/Index?noticeUID=CO1.NTC.1892342&isFromPublicArea=True&isModal=true&asPopupView=true","Contratos de prestación de servicios profesionales y de apoyo a la gestión","Contratación directa","Prestación de servicios profesionales y de apoyo a la gestión, o para la ejecución de trabajos artísticos que sólo puedan encomendarse a determinadas personas naturales;","PRESTAR SERVICIOS DE APOYO AL ÁREA DE GESTIÓN DE DESARROLLO LOCAL, DE LA ALCALDÍA LOCAL DE FONTIBÓN EN LA RECEPCIÓN DE CORRESPONDENCIA INTERNA Y EXTERNA, ASÍ COMO LA ASIGNACIÓN INTERNA DE LAS SOLICITUDES Y/O CORRESPONDENCIA RECIBIDA'.","Inversión","Un nuevo Contrato Social y ambiental para la Bogotá del Siglo XXI",57,{"$f":"IF(ISERROR(VLOOKUP(K133,[2]Proposito_programa!$C$2:$E$59,2,FALSE)),\" \",VLOOKUP(K133,[2]Proposito_programa!$C$2:$E$59,2,FALSE))","v":"Gestión pública local"},{"$f":"IF(ISERROR(VLOOKUP(K133,[2]Proposito_programa!$C$2:$E$59,3,FALSE)),\" \",VLOOKUP(K133,[2]Proposito_programa!$C$2:$E$59,3,FALSE))","v":"Propósito 5: Construir Bogotá - Región con gobierno abierto, transparente y ciudadanía consciente"},1783,1,53030997,"SONIA ESPERANZA SANTOS GIL","Persona Natural","-","-",null,21174843,null,1,1947112,23121955,18903212,"2021-04-08","2021-04-08","2022-01-22","264 DÍAS",1,24,null,null,null,null,null,null,"X",null,0.82]
[123,2021,"FDLF-CD-123-2021","https://community.secop.gov.co/Public/Tendering/OpportunityDetail/Index?noticeUID=CO1.NTC.1892874&isFromPublicArea=True&isModal=true&asPopupView=true","Contratos de prestación de servicios profesionales y de apoyo a la gestión","Contratación directa","Prestación de servicios profesionales y de apoyo a la gestión, o para la ejecución de trabajos artísticos que sólo puedan encomendarse a determinadas personas naturales;","PRESTAR SERVICIOS COMO PROFESIONAL ESPECIALIZADO PARA APOYAR AL ALCALDE LOCAL EN LA FORMULACIÓN, SEGUIMIENTO E IMPLEMENTACIÓN DE LA ESTRATEGIA LOCAL PARA LA TERMINACIÓN JURÍDICA O INACTIVACIÓN DE LAS ACTUACIONES ADMINISTRATIVAS QUE CURSAN EN LA ALCALDÍA LOCAL.","Inversión","Un nuevo Contrato Social y ambiental para la Bogotá del Siglo XXI",57,{"$f":"IF(ISERROR(VLOOKUP(K134,[2]Proposito_programa!$C$2:$E$59,2,FALSE)),\" \",VLOOKUP(K134,[2]Proposito_programa!$C$2:$E$59,2,FALSE))","v":"Gestión pública local"},{"$f":"IF(ISERROR(VLOOKUP(K134,[2]Proposito_programa!$C$2:$E$59,3,FALSE)),\" \",VLOOKUP(K134,[2]Proposito_programa!$C$2:$E$59,3,FALSE))","v":"Propósito 5: Construir Bogotá - Región con gobierno abierto, transparente y ciudadanía consciente"},1783,1,19447276,"GUSTAVO FRANCISCO MONZON GARZON","Persona Natural","-","-",null,74516666,null,0,0,74516666,57516667,"2021-04-08","2021-04-08","2021-11-08","266 DÍAS",0,0,null,null,null,null,null,null,"X",null,0.77]
[124,2021,"FDLF-CD-124-2021","https://community.secop.gov.co/Public/Tendering/OpportunityDetail/Index?noticeUID=CO1.NTC.1895171&isFromPublicArea=True&isModal=true&asPopupView=true","Contratos de prestación de servicios profesionales y de apoyo a la gestión","Contratación directa","Prestación de servicios profesionales y de apoyo a la gestión, o para la ejecución de trabajos artísticos que sólo puedan encomendarse a determinadas personas naturales;","PRESTAR SERVICIOS PARA APOYAR LA FORMULACIÓN, GESTIÓN Y SEGUIMIENTO DE ACTIVIDADES ENFOCADAS A LA GESTIÓN AMBIENTAL EXTERNA, ENCAMINADAS A LA MITIGACIÓN DE LOS DIFERENTES IMPACTOS AMBIENTALES Y LA CONSERVACIÓN DE LOS RECURSOS NATURALES DE LA LOCALIDAD.","Inversión","Un nuevo Contrato Social y ambiental para la Bogotá del Siglo XXI",27,{"$f":"IF(ISERROR(VLOOKUP(K135,[2]Proposito_programa!$C$2:$E$59,2,FALSE)),\" \",VLOOKUP(K135,[2]Proposito_programa!$C$2:$E$59,2,FALSE))","v":"Cambio cultural para la gestión de la crisis climática"},{"$f":"IF(ISERROR(VLOOKUP(K135,[2]Proposito_programa!$C$2:$E$59,3,FALSE)),\" \",VLOOKUP(K135,[2]Proposito_programa!$C$2:$E$59,3,FALSE))","v":"Propósito 2 : Cambiar Nuestros Hábitos de Vida para Reverdecer a Bogotá y Adaptarnos y Mitigar la Crisis Climática"},1766,1,1014252451,"YIRE PAOLA GARCIA GACHARNA","Persona Natural","-","-",null,43666667,null,1,4666667,48333334,38833333,"2021-04-08","2021-04-08","2022-01-25","265 DÍAS",1,28,null,null,null,null,null,null,"X",null,0.8]
[125,2021,"FDLF-CD-125-2021","https://community.secop.gov.co/Public/Tendering/OpportunityDetail/Index?noticeUID=CO1.NTC.1895170&isFromPublicArea=True&isModal=true&asPopupView=true","Contratos de prestación de servicios profesionales y de apoyo a la gestión","Contratación directa","Prestación de servicios profesionales y de apoyo a la gestión, o para la ejecución de trabajos artísticos que sólo puedan encomendarse a determinadas personas naturales;","PRESTAR SERVICIOS PROFESIONALES PARA APOYAR TÉCNICAMENTE LAS DISTINTAS ETAPAS DE LOS PROCESOS DE COMPETENCIA DE LAS INSPECCIONES DE POLICÍA DE LA LOCALIDAD, SEGÚN REPARTO.","Inversión","Un nuevo Contrato Social y ambiental para la Bogotá del Siglo XXI",57,{"$f":"IF(ISERROR(VLOOKUP(K136,[2]Proposito_programa!$C$2:$E$59,2,FALSE)),\" \",VLOOKUP(K136,[2]Proposito_programa!$C$2:$E$59,2,FALSE))","v":"Gestión pública local"},{"$f":"IF(ISERROR(VLOOKUP(K136,[2]Proposito_programa!$C$2:$E$59,3,FALSE)),\" \",VLOOKUP(K136,[2]Proposito_programa!$C$2:$E$59,3,FALSE))","v":"Propósito 5: Construir Bogotá - Región con gobierno abierto, transparente y ciudadanía consciente"},1784,1,14320959,"JOSE ALBEYRO AVILEZ CRUZ","Persona Natural","-","-",null,50460000,null,0,0,50460000," $                          -  ","2021-04-09","2021-04-09","2021-12-29","264 DÍAS",0,0,null,null,null,null,null,null,"X",null,0]
[126,2021,"FDLF-CD-126-2021","https://community.secop.gov.co/Public/Tendering/OpportunityDetail/Index?noticeUID=CO1.NTC.1895346&isFromPublicArea=True&isModal=true&asPopupView=true","Contratos de prestación de servicios profesionales y de apoyo a la gestión","Contratación directa","Prestación de servicios profesionales y de apoyo a la gestión, o para la ejecución de trabajos artísticos que sólo puedan encomendarse a determinadas personas naturales;","PRESTAR SERVICIOS PROFESIONALES PARA APOYAR TÉCNICAMENTE LAS DISTINTAS ETAPAS DE LOS PROCESOS DE COMPETENCIA DE LAS INSPECCIONES DE POLICÍA DE LA LOCALIDAD, SEGÚN REPARTO.","Inversión","Un nuevo Contrato Social y ambiental para la Bogotá del Siglo XXI",57,{"$f":"IF(ISERROR(VLOOKUP(K137,[2]Proposito_programa!$C$2:$E$59,2,FALSE)),\" \",VLOOKUP(K137,[2]Proposito_programa!$C$2:$E$59,2,FALSE))","v":"Gestión pública local"},{"$f":"IF(ISERROR(VLOOKUP(K137,[2]Proposito_programa!$C$2:$E$59,3,FALSE)),\" \",VLOOKUP(K137,[2]Proposito_programa!$C$2:$E$59,3,FALSE))","v":"Propósito 5: Construir Bogotá - Región con gobierno abierto, transparente y ciudadanía consciente"},1784,1,1121865779,"JUAN DAVID GIRALDO SABOGAL","Persona Natural","-","-",null,50460000,null,1,5026667,55486667,21846667,"2021-04-08","2021-04-08","2022-01-24","264 DÍAS",1,26,79579343,"WILLIAM NIÑO LEAL","2021-05-31",40213333,null,null,"X",null,0.39]
[127,2021,"FDLF-CD-127-2021","https://community.secop.gov.co/Public/Tendering/OpportunityDetail/Index?noticeUID=CO1.NTC.1895933&isFromPublicArea=True&isModal=true&asPopupView=true","Contratos de prestación de servicios profesionales y de apoyo a la gestión","Contratación directa","Prestación de servicios profesionales y de apoyo a la gestión, o para la ejecución de trabajos artísticos que sólo puedan encomendarse a determinadas personas naturales;","COORDINAR LA ARTICULACIÓN, ASISTENCIA Y ACOMPAÑAMIENTO DE LOS PROCESOS DE PLANEACIÓN LOCAL, PARA LA PROMOCIÓN DE LA PARTICIPACIÓN DE LAS MUJERES Y DE LA EQUIDAD DE GÉNERO, PARA MATERIALIZAR EN LA LOCALIDAD LAS ESTRATEGIAS DE TERRITORIALIZACIÓN Y TRANSVERSALIZACIÓN DE LA POLÍTICA PUBLICA DE MUJERES Y EQUIDAD DE GÉNERO, PPMYEG.","Inversión","Un nuevo Contrato Social y ambiental para la Bogotá del Siglo XXI",6,{"$f":"IF(ISERROR(VLOOKUP(K138,[2]Proposito_programa!$C$2:$E$59,2,FALSE)),\" \",VLOOKUP(K138,[2]Proposito_programa!$C$2:$E$59,2,FALSE))","v":"Sistema Distrital de Cuidado"},{"$f":"IF(ISERROR(VLOOKUP(K138,[2]Proposito_programa!$C$2:$E$59,3,FALSE)),\" \",VLOOKUP(K138,[2]Proposito_programa!$C$2:$E$59,3,FALSE))","v":"Propósito 1: Hacer un nuevo contrato social para incrementar la inclusión social, productiva y política"},1762,1,1032413689,"JEISON HERLEY CAMACHO TELLEZ","Persona Natural","-","-",null,36000000,null,1,6300000,42300000,34200000,"2021-04-13","2021-04-13","2022-01-24","243 DÍAS",1,42,null,null,null,null,null,null,"X",null,0.81]
[128,2021,"FDLF-CD-128-2021","https://community.secop.gov.co/Public/Tendering/OpportunityDetail/Index?noticeUID=CO1.NTC.1894976&isFromPublicArea=True&isModal=true&asPopupView=true","Contratos de prestación de servicios profesionales y de apoyo a la gestión","Contratación directa","Prestación de servicios profesionales y de apoyo a la gestión, o para la ejecución de trabajos artísticos que sólo puedan encomendarse a determinadas personas naturales;","PRESTAR SERVICIOS PROFESIONALES PARA APOYAR AL DESPACHO EN LA REALIZACIÓN DE ACTIVIDADES DEFINIDAS POR EL ÁREA DE GESTIÓN PARA EL DESARROLLO LOCAL DE FONTIBÓN, EN RELACIÓN CON LA GESTIÓN INTRAINSTITUCIONAL CON LA JUNTA ADMINISTRADORA LOCAL Y LA LOGÍSTICA REFERIDA AL SECTOR EMPRESARIAL DE LA LOCALIDAD DE FONTIBÓN.","Inversión","Un nuevo Contrato Social y ambiental para la Bogotá del Siglo XXI",57,{"$f":"IF(ISERROR(VLOOKUP(K139,[2]Proposito_programa!$C$2:$E$59,2,FALSE)),\" \",VLOOKUP(K139,[2]Proposito_programa!$C$2:$E$59,2,FALSE))","v":"Gestión pública local"},{"$f":"IF(ISERROR(VLOOKUP(K139,[2]Proposito_programa!$C$2:$E$59,3,FALSE)),\" \",VLOOKUP(K139,[2]Proposito_programa!$C$2:$E$59,3,FALSE))","v":"Propósito 5: Construir Bogotá - Región con gobierno abierto, transparente y ciudadanía consciente"},1783,1,79662711,"ARNOLDO RIAÑO ARCINIEGAS","Persona Natural","-","-",null,21630000,null,0,0,21630000,21630000,"2021-04-09","2021-04-09","2021-09-08","152 DÍAS",0,0,null,null,null,null,null,null,"X",null,1]
[129,2021,"FDLF-CD-129-2021","https://community.secop.gov.co/Public/Tendering/OpportunityDetail/Index?noticeUID=CO1.NTC.1896219&isFromPublicArea=True&isModal=true&asPopupView=true","Contratos de prestación de servicios profesionales y de apoyo a la gestión","Contratación directa","Prestación de servicios profesionales y de apoyo a la gestión, o para la ejecución de trabajos artísticos que sólo puedan encomendarse a determinadas personas naturales;","PRESTAR SERVICIOS PARA APOYAR JURÍDICAMENTE LA EJECUCIÓN DE LAS ACCIONES REQUERIDAS PARA LA DEPURACIÓN DE LAS ACTUACIONES ADMINISTRATIVAS QUE CURSAN EN LA ALCALDÍA LOCAL DE FONTIBÓN","Inversión","Un nuevo Contrato Social y ambiental para la Bogotá del Siglo XXI",57,{"$f":"IF(ISERROR(VLOOKUP(K140,[2]Proposito_programa!$C$2:$E$59,2,FALSE)),\" \",VLOOKUP(K140,[2]Proposito_programa!$C$2:$E$59,2,FALSE))","v":"Gestión pública local"},{"$f":"IF(ISERROR(VLOOKUP(K140,[2]Proposito_programa!$C$2:$E$59,3,FALSE)),\" \",VLOOKUP(K140,[2]Proposito_programa!$C$2:$E$59,3,FALSE))","v":"Propósito 5: Construir Bogotá - Región con gobierno abierto, transparente y ciudadanía consciente"},1784,1,39636097,"MARIA ELINA PLAZAS LOPEZ","Persona Natural","-","-",null,9852980,null,1,4926490,14779470,13465739,"2021-04-09","2021-04-09","2021-07-08","60 DÍAS",1,30,null,null,null,null,null,null,"X",null,0.57999999999999996]
[130,2021,"FDLF-CD-130-2021","https://community.secop.gov.co/Public/Tendering/OpportunityDetail/Index?noticeUID=CO1.NTC.1896183&isFromPublicArea=True&isModal=true&asPopupView=true","Contratos de prestación de servicios profesionales y de apoyo a la gestión","Contratación directa","Prestación de servicios profesionales y de apoyo a la gestión, o para la ejecución de trabajos artísticos que sólo puedan encomendarse a determinadas personas naturales;","PRESTAR SERVICIOS COMO PROFESIONAL DE APOYO A LA GESTIÓN RELACIONADA CON EL ESPACIO PÚBLICO, ESTABLECIMIENTOS DE COMERCIO Y LAS ACCIONES OPERATIVAS PARA EL CONTROL AMBIENTAL PARA EL ÁREA DE GESTIÓN POLICIVA DE LA ALCALDÍA LOCAL DE FONTIBÓN","Inversión","Un nuevo Contrato Social y ambiental para la Bogotá del Siglo XXI",57,{"$f":"IF(ISERROR(VLOOKUP(K141,[2]Proposito_programa!$C$2:$E$59,2,FALSE)),\" \",VLOOKUP(K141,[2]Proposito_programa!$C$2:$E$59,2,FALSE))","v":"Gestión pública local"},{"$f":"IF(ISERROR(VLOOKUP(K141,[2]Proposito_programa!$C$2:$E$59,3,FALSE)),\" \",VLOOKUP(K141,[2]Proposito_programa!$C$2:$E$59,3,FALSE))","v":"Propósito 5: Construir Bogotá - Región con gobierno abierto, transparente y ciudadanía consciente"},1784,1,1075248329,"TATIANA HERNANDEZ SOTO","Persona Natural","-","-",null,43024679,null,0,0,43024679,33664348,"2021-04-28","2021-04-28","2022-01-19","262 DÍAS",0,0,1121917670,"CARLOS ALBERTO DUARTE DURAN","2021-05-05",41710948,null,null,"X",null,0.78]
[131,2021,"FDLF-CD-131-2021","https://community.secop.gov.co/Public/Tendering/OpportunityDetail/Index?noticeUID=CO1.NTC.1899608&isFromPublicArea=True&isModal=true&asPopupView=true","Contratos de prestación de servicios profesionales y de apoyo a la gestión","Contratación directa","Prestación de servicios profesionales y de apoyo a la gestión, o para la ejecución de trabajos artísticos que sólo puedan encomendarse a determinadas personas naturales;","SERVICIOS DE APOYO TÉCNICO AL ÁREA DE GESTIÓN DESARROLLO LOCAL DE FONTIBÓN EN ACTIVIDADES INHERENTES A LA PLANEACIÓN","Inversión","Un nuevo Contrato Social y ambiental para la Bogotá del Siglo XXI",57,{"$f":"IF(ISERROR(VLOOKUP(K142,[2]Proposito_programa!$C$2:$E$59,2,FALSE)),\" \",VLOOKUP(K142,[2]Proposito_programa!$C$2:$E$59,2,FALSE))","v":"Gestión pública local"},{"$f":"IF(ISERROR(VLOOKUP(K142,[2]Proposito_programa!$C$2:$E$59,3,FALSE)),\" \",VLOOKUP(K142,[2]Proposito_programa!$C$2:$E$59,3,FALSE))","v":"Propósito 5: Construir Bogotá - Región con gobierno abierto, transparente y ciudadanía consciente"},1783,1,1016055638,"SERGIO SEBASTIAN VILLEGAS TORRES","Persona Natural","-","-",null,33921333,null,0,0,14612267,14612267,"2021-04-09","2021-04-09","2021-07-31","180 DÍAS",0,0,null,null,null,null,null,null,"X",null,0.43]
[132,2021,"FDLF-CD-132-2021","https://community.secop.gov.co/Public/Tendering/OpportunityDetail/Index?noticeUID=CO1.NTC.1913155&isFromPublicArea=True&isModal=true&asPopupView=true","Contratos de prestación de servicios profesionales y de apoyo a la gestión","Contratación directa","Prestación de servicios profesionales y de apoyo a la gestión, o para la ejecución de trabajos artísticos que sólo puedan encomendarse a determinadas personas naturales;","PRESTAR SERVICIOS COMO AUXILIAR ADMINISTRATIVO Y OPERATIVO EN EL ÁREA DE GESTIÓN DE DESARROLLO LOCAL DE FONTIBÓN, PARA EL DESARROLLO DE LAS ESCUELAS DE FORMACIÓN DEPORTIVA DE LA LOCALIDAD.","Inversión","Un nuevo Contrato Social y ambiental para la Bogotá del Siglo XXI",20,{"$f":"IF(ISERROR(VLOOKUP(K143,[2]Proposito_programa!$C$2:$E$59,2,FALSE)),\" \",VLOOKUP(K143,[2]Proposito_programa!$C$2:$E$59,2,FALSE))","v":"Bogotá, referente en cultura, deporte, recreación y actividad física, con parques para el desarrollo y la salud"},{"$f":"IF(ISERROR(VLOOKUP(K143,[2]Proposito_programa!$C$2:$E$59,3,FALSE)),\" \",VLOOKUP(K143,[2]Proposito_programa!$C$2:$E$59,3,FALSE))","v":"Propósito 1: Hacer un nuevo contrato social para incrementar la inclusión social, productiva y política"},1757,1,1016047939,"JOHN ALEXANDER CASTAÑO VERA","Persona Natural","-","-",null,21072000,null,1,2985200,{"$f":"Y143+V143+W143","v":24057200},19755000,"2021-04-16","2021-04-16","2022-01-19","243 DÍAS",1,34,null,null,null,null,null,null,"X",null,0.82]
[133,2021,"FDLF-CD-133-2021","https://community.secop.gov.co/Public/Tendering/OpportunityDetail/Index?noticeUID=CO1.NTC.1929963&isFromPublicArea=True&isModal=true&asPopupView=true","Contratos de prestación de servicios profesionales y de apoyo a la gestión","Contratación directa","Prestación de servicios profesionales y de apoyo a la gestión, o para la ejecución de trabajos artísticos que sólo puedan encomendarse a determinadas personas naturales;","PRESTAR SERVICIOS PROFESIONALES AL ÁREA DE GESTIÓN DE DESARROLLO LOCAL DE FONTIBÓN PARA APOYAR A LA ADMINISTRACIÓN EN LA FORMULACIÓN Y SEGUIMIENTO A LOS PROYECTOS DE INVERSIÓN Y GASTOS DE FUNCIONAMIENTO DE LA ALCALDÍA LOCAL DE FONTIBÓN.","Inversión","Un nuevo Contrato Social y ambiental para la Bogotá del Siglo XXI",57,{"$f":"IF(ISERROR(VLOOKUP(K144,[2]Proposito_programa!$C$2:$E$59,2,FALSE)),\" \",VLOOKUP(K144,[2]Proposito_programa!$C$2:$E$59,2,FALSE))","v":"Gestión pública local"},{"$f":"IF(ISERROR(VLOOKUP(K144,[2]Proposito_programa!$C$2:$E$59,3,FALSE)),\" \",VLOOKUP(K144,[2]Proposito_programa!$C$2:$E$59,3,FALSE))","v":"Propósito 5: Construir Bogotá - Región con gobierno abierto, transparente y ciudadanía consciente"},1783,1,52829059,"JULIE PAOLA PACHON MURCIA","Persona Natural","-","-",null,54400000,null,0,0,54400000,49413333,"2021-04-23","2021-04-23","2021-12-22","243 DÍAS",0,0,null,null,null,null,null,null,"X",null,0.91]
[134,2021,"FDLF-CD-134-2021","https://community.secop.gov.co/Public/Tendering/OpportunityDetail/Index?noticeUID=CO1.NTC.1958721&isFromPublicArea=True&isModal=true&asPopupView=true","Contratos de prestación de servicios profesionales y de apoyo a la gestión","Contratación directa","Prestación de servicios profesionales y de apoyo a la gestión, o para la ejecución de trabajos artísticos que sólo puedan encomendarse a determinadas personas naturales;","PRESTAR SERVICIOS COMO AUXILIAR ADMINISTRATIVO Y OPERATIVO EN EL ÁREA DE GESTIÓN DE DESARROLLO LOCAL DE FONTIBÓN, PARA EL DESARROLLO DE LAS ESCUELAS DE FORMACIÓN DEPORTIVA DE LA LOCALIDAD.","Inversión","Un nuevo Contrato Social y ambiental para la Bogotá del Siglo XXI",20,{"$f":"IF(ISERROR(VLOOKUP(K145,[2]Proposito_programa!$C$2:$E$59,2,FALSE)),\" \",VLOOKUP(K145,[2]Proposito_programa!$C$2:$E$59,2,FALSE))","v":"Bogotá, referente en cultura, deporte, recreación y actividad física, con parques para el desarrollo y la salud"},{"$f":"IF(ISERROR(VLOOKUP(K145,[2]Proposito_programa!$C$2:$E$59,3,FALSE)),\" \",VLOOKUP(K145,[2]Proposito_programa!$C$2:$E$59,3,FALSE))","v":"Propósito 1: Hacer un nuevo contrato social para incrementar la inclusión social, productiva y política"},1757,1,1015997258,"OSCAR ALBERTO MANCERA LURDUY","Persona Natural","-","-",null,20545200,null,1,2195000,22740200,10009200,"2021-05-07","2021-05-07","2022-01-25","237 DÍAS",1,25,null,null,null,null,null,null,"X",null,0.44]
[135,2021,"FDLF-CD-135-2021","https://community.secop.gov.co/Public/Tendering/OpportunityDetail/Index?noticeUID=CO1.NTC.1961484&isFromPublicArea=True&isModal=true&asPopupView=true","Contratos de prestación de servicios profesionales y de apoyo a la gestión","Contratación directa","Prestación de servicios profesionales y de apoyo a la gestión, o para la ejecución de trabajos artísticos que sólo puedan encomendarse a determinadas personas naturales;","PRESTAR SERVICIOS PROFESIONALES PARA APOYAR JURÍDICAMENTE LOS DIFERENTES PROCESOS QUE REQUIERA ADELANTAR LA ALCALDÍA LOCAL DE FONTIBÓN DESDE LAS ETAPAS PRECONTRACTUAL, CONTRACTUAL Y POST CONTRACTUAL.","Inversión","Un nuevo Contrato Social y ambiental para la Bogotá del Siglo XXI",57,{"$f":"IF(ISERROR(VLOOKUP(K146,[2]Proposito_programa!$C$2:$E$59,2,FALSE)),\" \",VLOOKUP(K146,[2]Proposito_programa!$C$2:$E$59,2,FALSE))","v":"Gestión pública local"},{"$f":"IF(ISERROR(VLOOKUP(K146,[2]Proposito_programa!$C$2:$E$59,3,FALSE)),\" \",VLOOKUP(K146,[2]Proposito_programa!$C$2:$E$59,3,FALSE))","v":"Propósito 5: Construir Bogotá - Región con gobierno abierto, transparente y ciudadanía consciente"},1783,1,"1.020.726.557\r","GUSTAVO ADOLFO GARCIA VALCARCEL","Persona Natural","-","-",null,52360000,null,0,0,52360000,{"$f":"Z146+W146+X146","v":52360000},"2021-05-10","2021-05-10","2021-12-30","231 DÍAS",0,0,1026289113,"FRANCY YAZMIN OLIVERA AGUILAR","2021-11-16",10426667,null,null,"X",null,0.44]
[136,2021,"FDLF-CD-136-2021","https://community.secop.gov.co/Public/Tendering/OpportunityDetail/Index?noticeUID=CO1.NTC.1976344&isFromPublicArea=True&isModal=true&asPopupView=true","Contratos de prestación de servicios profesionales y de apoyo a la gestión","Contratación directa","Prestación de servicios profesionales y de apoyo a la gestión, o para la ejecución de trabajos artísticos que sólo puedan encomendarse a determinadas personas naturales;","PRESTAR SERVICIOS DE APOYO TÉCNICO AL ÁREA DE GESTIÓN DE DESARROLLO LOCAL DE FONTIBÓN COMO MONITOR DEPORTIVO PARA LA FORMACIÓN DE LAS ESCUELAS DEPORTIVAS DE FONTIBÓN ","Inversión","Un nuevo Contrato Social y ambiental para la Bogotá del Siglo XXI",20,{"$f":"IF(ISERROR(VLOOKUP(K147,[2]Proposito_programa!$C$2:$E$59,2,FALSE)),\" \",VLOOKUP(K147,[2]Proposito_programa!$C$2:$E$59,2,FALSE))","v":"Bogotá, referente en cultura, deporte, recreación y actividad física, con parques para el desarrollo y la salud"},{"$f":"IF(ISERROR(VLOOKUP(K147,[2]Proposito_programa!$C$2:$E$59,3,FALSE)),\" \",VLOOKUP(K147,[2]Proposito_programa!$C$2:$E$59,3,FALSE))","v":"Propósito 1: Hacer un nuevo contrato social para incrementar la inclusión social, productiva y política"},1757,1,1016059864,"ROBINSON GUSTAVO PINZON TORRES","Persona Natural","-","-",null,18506950,null,0,0,18506950,11192298,"2021-05-24","2021-05-24","2021-12-23","210 DÍAS",0,0,null,null,null,null,null,null,"X",null,0.6]
[137,2021,"FDLF-CD-137-2021","https://community.secop.gov.co/Public/Tendering/OpportunityDetail/Index?noticeUID=CO1.NTC.1975532&isFromPublicArea=True&isModal=true&asPopupView=true","Contratos de prestación de servicios profesionales y de apoyo a la gestión","Contratación directa","Prestación de servicios profesionales y de apoyo a la gestión, o para la ejecución de trabajos artísticos que sólo puedan encomendarse a determinadas personas naturales;","SERVICIOS PROFESIONALES DE APOYO CONTABLE EN LOS PROCESOS DE CAUSACIÓN, SISTEMATIZACIÓN Y REGISTROS DE INFORMACIÓN CONTABLE ","Inversión","Un nuevo Contrato Social y ambiental para la Bogotá del Siglo XXI",57,{"$f":"IF(ISERROR(VLOOKUP(K148,[2]Proposito_programa!$C$2:$E$59,2,FALSE)),\" \",VLOOKUP(K148,[2]Proposito_programa!$C$2:$E$59,2,FALSE))","v":"Gestión pública local"},{"$f":"IF(ISERROR(VLOOKUP(K148,[2]Proposito_programa!$C$2:$E$59,3,FALSE)),\" \",VLOOKUP(K148,[2]Proposito_programa!$C$2:$E$59,3,FALSE))","v":"Propósito 5: Construir Bogotá - Región con gobierno abierto, transparente y ciudadanía consciente"},1783,1,79378493,"ELMAN CIFUENTES CASTAÑEDA","Persona Natural","-","-",null,35000000,null,1,5333333,40333333,32000000,"2021-05-19","2021-05-19","2022-01-25","210 DÍAS",1,32,null,null,null,null,null,null,"X",null,0.79]
[138,2021,"FDLF-CD-138-2021","https://community.secop.gov.co/Public/Tendering/OpportunityDetail/Index?noticeUID=CO1.NTC.1976429&isFromPublicArea=True&isModal=true&asPopupView=true","Contratos de prestación de servicios profesionales y de apoyo a la gestión","Contratación directa","Prestación de servicios profesionales y de apoyo a la gestión, o para la ejecución de trabajos artísticos que sólo puedan encomendarse a determinadas personas naturales;","PRESTAR SERVICIOS DE APOYO TÉCNICO AL ÁREA DE GESTIÓN DE DESARROLLO LOCAL DE FONTIBÓN COMO MONITOR DEPORTIVO PARA LA FORMACIÓN DE LAS ESCUELAS DEPORTIVAS DE FONTIBÓN ","Inversión","Un nuevo Contrato Social y ambiental para la Bogotá del Siglo XXI",20,{"$f":"IF(ISERROR(VLOOKUP(K149,[2]Proposito_programa!$C$2:$E$59,2,FALSE)),\" \",VLOOKUP(K149,[2]Proposito_programa!$C$2:$E$59,2,FALSE))","v":"Bogotá, referente en cultura, deporte, recreación y actividad física, con parques para el desarrollo y la salud"},{"$f":"IF(ISERROR(VLOOKUP(K149,[2]Proposito_programa!$C$2:$E$59,3,FALSE)),\" \",VLOOKUP(K149,[2]Proposito_programa!$C$2:$E$59,3,FALSE))","v":"Propósito 1: Hacer un nuevo contrato social para incrementar la inclusión social, productiva y política"},1757,1,1013633911,"JEISON YAIR JIMENEZ REYES","Persona Natural","-","-",null,18506950,null,1,2291337,20798287,16479998,"2021-05-24","2021-05-24","2022-01-19","210 DÍAS",1,26,null,null,null,null,null,null,"X",null,0.79]
[139,2021,"FDLF-CD-139-2021","https://community.secop.gov.co/Public/Tendering/OpportunityDetail/Index?noticeUID=CO1.NTC.1981009&isFromPublicArea=True&isModal=true&asPopupView=true","Contratos de prestación de servicios profesionales y de apoyo a la gestión","Contratación directa","Prestación de servicios profesionales y de apoyo a la gestión, o para la ejecución de trabajos artísticos que sólo puedan encomendarse a determinadas personas naturales;","PRESTAR SERVICIOS DE APOYO TÉCNICO AL ÁREA DE GESTIÓN DE DESARROLLO LOCAL DE FONTIBÓN COMO MONITOR DEPORTIVO PARA LA FORMACIÓN DE LAS ESCUELAS DEPORTIVAS DE FONTIBÓN ","Inversión","Un nuevo Contrato Social y ambiental para la Bogotá del Siglo XXI",20,{"$f":"IF(ISERROR(VLOOKUP(K150,[2]Proposito_programa!$C$2:$E$59,2,FALSE)),\" \",VLOOKUP(K150,[2]Proposito_programa!$C$2:$E$59,2,FALSE))","v":"Bogotá, referente en cultura, deporte, recreación y actividad física, con parques para el desarrollo y la salud"},{"$f":"IF(ISERROR(VLOOKUP(K150,[2]Proposito_programa!$C$2:$E$59,3,FALSE)),\" \",VLOOKUP(K150,[2]Proposito_programa!$C$2:$E$59,3,FALSE))","v":"Propósito 1: Hacer un nuevo contrato social para incrementar la inclusión social, productiva y política"},1757,1,1016097957,"DEIVY ALEJANDRO FIRACATIVE ORTIZ","Persona Natural","-","-",null,18506950,null,1,2291337,20798287,16479998,"2021-05-24","2021-05-24","2022-01-19","210 DÍAS",1,26,null,null,null,null,null,null,"X",null,0.79]
[140,2021,"FDLF-CD-140-2021","https://community.secop.gov.co/Public/Tendering/OpportunityDetail/Index?noticeUID=CO1.NTC.1981129&isFromPublicArea=True&isModal=true&asPopupView=true","Contratos de prestación de servicios profesionales y de apoyo a la gestión","Contratación directa","Prestación de servicios profesionales y de apoyo a la gestión, o para la ejecución de trabajos artísticos que sólo puedan encomendarse a determinadas personas naturales;","PRESTAR SERVICIOS DE APOYO TÉCNICO AL ÁREA DE GESTIÓN DE DESARROLLO LOCAL DE FONTIBÓN COMO MONITOR DEPORTIVO PARA LA FORMACIÓN DE LAS ESCUELAS DEPORTIVAS DE FONTIBÓN ","Inversión","Un nuevo Contrato Social y ambiental para la Bogotá del Siglo XXI",20,{"$f":"IF(ISERROR(VLOOKUP(K151,[2]Proposito_programa!$C$2:$E$59,2,FALSE)),\" \",VLOOKUP(K151,[2]Proposito_programa!$C$2:$E$59,2,FALSE))","v":"Bogotá, referente en cultura, deporte, recreación y actividad física, con parques para el desarrollo y la salud"},{"$f":"IF(ISERROR(VLOOKUP(K151,[2]Proposito_programa!$C$2:$E$59,3,FALSE)),\" \",VLOOKUP(K151,[2]Proposito_programa!$C$2:$E$59,3,FALSE))","v":"Propósito 1: Hacer un nuevo contrato social para incrementar la inclusión social, productiva y política"},1757,1,1015999131,"JENNIFER JOHANNA VILLAMIL DIAZ","Persona Natural","-","-",null,18506950,null,1,2203208,20710158,16391870,"2021-05-25","2021-05-25","2022-01-19","210 DÍAS",1,25,null,null,null,null,null,null,"X",null,0.79]
[141,2021,"FDLF-CD-141-2021","https://community.secop.gov.co/Public/Tendering/OpportunityDetail/Index?noticeUID=CO1.NTC.1981402&isFromPublicArea=True&isModal=true&asPopupView=true","Contratos de prestación de servicios profesionales y de apoyo a la gestión","Contratación directa","Prestación de servicios profesionales y de apoyo a la gestión, o para la ejecución de trabajos artísticos que sólo puedan encomendarse a determinadas personas naturales;","PRESTAR SERVICIOS DE APOYO TÉCNICO AL ÁREA DE GESTIÓN DE DESARROLLO LOCAL DE FONTIBÓN COMO MONITOR DEPORTIVO PARA LA FORMACIÓN DE LAS ESCUELAS DEPORTIVAS DE FONTIBÓN ","Inversión","Un nuevo Contrato Social y ambiental para la Bogotá del Siglo XXI",20,{"$f":"IF(ISERROR(VLOOKUP(K152,[2]Proposito_programa!$C$2:$E$59,2,FALSE)),\" \",VLOOKUP(K152,[2]Proposito_programa!$C$2:$E$59,2,FALSE))","v":"Bogotá, referente en cultura, deporte, recreación y actividad física, con parques para el desarrollo y la salud"},{"$f":"IF(ISERROR(VLOOKUP(K152,[2]Proposito_programa!$C$2:$E$59,3,FALSE)),\" \",VLOOKUP(K152,[2]Proposito_programa!$C$2:$E$59,3,FALSE))","v":"Propósito 1: Hacer un nuevo contrato social para incrementar la inclusión social, productiva y política"},1757,1,1022933464,"DIEGO FERNANDO ALARCON LARA","Persona Natural","-","-",null,18506950,null,1,2203208,20710158,16391870,"2021-05-25","2021-05-25","2022-01-19","210 DÍAS",1,25,null,null,null,null,null,null,"X",null,0.79]
[142,2021,"FDLF-CD-142-2021","https://community.secop.gov.co/Public/Tendering/OpportunityDetail/Index?noticeUID=CO1.NTC.1981271&isFromPublicArea=True&isModal=true&asPopupView=true","Contratos de prestación de servicios profesionales y de apoyo a la gestión","Contratación directa","Prestación de servicios profesionales y de apoyo a la gestión, o para la ejecución de trabajos artísticos que sólo puedan encomendarse a determinadas personas naturales;","PRESTAR SERVICIOS DE APOYO TÉCNICO AL ÁREA DE GESTIÓN DE DESARROLLO LOCAL DE FONTIBÓN COMO MONITOR DEPORTIVO PARA LA FORMACIÓN DE LAS ESCUELAS DEPORTIVAS DE FONTIBÓN ","Inversión","Un nuevo Contrato Social y ambiental para la Bogotá del Siglo XXI",20,{"$f":"IF(ISERROR(VLOOKUP(K153,[2]Proposito_programa!$C$2:$E$59,2,FALSE)),\" \",VLOOKUP(K153,[2]Proposito_programa!$C$2:$E$59,2,FALSE))","v":"Bogotá, referente en cultura, deporte, recreación y actividad física, con parques para el desarrollo y la salud"},{"$f":"IF(ISERROR(VLOOKUP(K153,[2]Proposito_programa!$C$2:$E$59,3,FALSE)),\" \",VLOOKUP(K153,[2]Proposito_programa!$C$2:$E$59,3,FALSE))","v":"Propósito 1: Hacer un nuevo contrato social para incrementar la inclusión social, productiva y política"},1757,1,1073707647,"JESUS ADOLFO MORALES TAMAYO","Persona Natural","-","-",null,18506950,null,1,2115080,20622030,16303742,"2021-05-26","2021-05-26","2022-01-19","213 DÍAS",1,24,null,null,null,null,null,null,"X",null,0.79]
[143,2021,"FDLF-CD-143-2021","https://community.secop.gov.co/Public/Tendering/OpportunityDetail/Index?noticeUID=CO1.NTC.1985719&isFromPublicArea=True&isModal=true&asPopupView=true","Contratos de prestación de servicios profesionales y de apoyo a la gestión","Contratación directa","Prestación de servicios profesionales y de apoyo a la gestión, o para la ejecución de trabajos artísticos que sólo puedan encomendarse a determinadas personas naturales;","PRESTAR SERVICIOS PARA APOYAR ADMINISTRATIVA Y ASISTENCIALMENTE A LAS INSPECCIONES DE POLICÍA DE LA LOCALIDAD. ","Inversión","Un nuevo Contrato Social y ambiental para la Bogotá del Siglo XXI",57,{"$f":"IF(ISERROR(VLOOKUP(K154,[2]Proposito_programa!$C$2:$E$59,2,FALSE)),\" \",VLOOKUP(K154,[2]Proposito_programa!$C$2:$E$59,2,FALSE))","v":"Gestión pública local"},{"$f":"IF(ISERROR(VLOOKUP(K154,[2]Proposito_programa!$C$2:$E$59,3,FALSE)),\" \",VLOOKUP(K154,[2]Proposito_programa!$C$2:$E$59,3,FALSE))","v":"Propósito 5: Construir Bogotá - Región con gobierno abierto, transparente y ciudadanía consciente"},1784,1,88220745,"JULIO CESAR CALDERON SUAREZ","Persona Natural","-","-",null,17037230,null,1,2028242,19065472,12980747,"2021-05-21","2021-05-21","2022-01-15","210 DÍAS",1,25,null,null,null,null,null,null,"X",null,0.26]
[144,2021,"FDLF-CD-144-2021","https://community.secop.gov.co/Public/Tendering/OpportunityDetail/Index?noticeUID=CO1.NTC.1985818&isFromPublicArea=True&isModal=true&asPopupView=true","Contratos de prestación de servicios profesionales y de apoyo a la gestión","Contratación directa","Prestación de servicios profesionales y de apoyo a la gestión, o para la ejecución de trabajos artísticos que sólo puedan encomendarse a determinadas personas naturales;","PRESTAR SERVICIOS PARA APOYAR ADMINISTRATIVA Y ASISTENCIALMENTE A LAS INSPECCIONES DE POLICÍA DE LA LOCALIDAD. ","Inversión","Un nuevo Contrato Social y ambiental para la Bogotá del Siglo XXI",57,{"$f":"IF(ISERROR(VLOOKUP(K155,[2]Proposito_programa!$C$2:$E$59,2,FALSE)),\" \",VLOOKUP(K155,[2]Proposito_programa!$C$2:$E$59,2,FALSE))","v":"Gestión pública local"},{"$f":"IF(ISERROR(VLOOKUP(K155,[2]Proposito_programa!$C$2:$E$59,3,FALSE)),\" \",VLOOKUP(K155,[2]Proposito_programa!$C$2:$E$59,3,FALSE))","v":"Propósito 5: Construir Bogotá - Región con gobierno abierto, transparente y ciudadanía consciente"},1784,1,1016018384,"DIEGO ALEJANDRO CASTRO MUNZA","Persona Natural","-","-",null,17037230,null,1,2028242,19065472,15414637,"2021-05-21","2021-05-21","2022-01-15","210 DÍAS",1,25,null,null,null,null,null,null,"X",null,0.26]
[145,2021,"FDLF-CD-145-2021","https://community.secop.gov.co/Public/Tendering/OpportunityDetail/Index?noticeUID=CO1.NTC.1985830&isFromPublicArea=True&isModal=true&asPopupView=true","Contratos de prestación de servicios profesionales y de apoyo a la gestión","Contratación directa","Prestación de servicios profesionales y de apoyo a la gestión, o para la ejecución de trabajos artísticos que sólo puedan encomendarse a determinadas personas naturales;","PRESTAR SERVICIOS PARA APOYAR ADMINISTRATIVA Y ASISTENCIALMENTE A LAS INSPECCIONES DE POLICÍA DE LA LOCALIDAD. ","Inversión","Un nuevo Contrato Social y ambiental para la Bogotá del Siglo XXI",57,{"$f":"IF(ISERROR(VLOOKUP(K156,[2]Proposito_programa!$C$2:$E$59,2,FALSE)),\" \",VLOOKUP(K156,[2]Proposito_programa!$C$2:$E$59,2,FALSE))","v":"Gestión pública local"},{"$f":"IF(ISERROR(VLOOKUP(K156,[2]Proposito_programa!$C$2:$E$59,3,FALSE)),\" \",VLOOKUP(K156,[2]Proposito_programa!$C$2:$E$59,3,FALSE))","v":"Propósito 5: Construir Bogotá - Región con gobierno abierto, transparente y ciudadanía consciente"},1784,1,39760197,"SONIA YASMIN BAQUERO PARRADO","Persona Natural","-","-",null,17037230,null,1,2028242,19065472,15414637,"2021-05-21","2021-05-21","2022-01-15","210 DÍAS",1,25,null,null,null,null,null,null,"X",null,0.26]
[146,2021,"FDLF-CD-146-2021","https://community.secop.gov.co/Public/Tendering/OpportunityDetail/Index?noticeUID=CO1.NTC.1986138&isFromPublicArea=True&isModal=true&asPopupView=true","Contratos de prestación de servicios profesionales y de apoyo a la gestión","Contratación directa","Prestación de servicios profesionales y de apoyo a la gestión, o para la ejecución de trabajos artísticos que sólo puedan encomendarse a determinadas personas naturales;","PRESTAR SERVICIOS PARA APOYAR ADMINISTRATIVA Y ASISTENCIALMENTE A LAS INSPECCIONES DE POLICÍA DE LA LOCALIDAD. ","Inversión","Un nuevo Contrato Social y ambiental para la Bogotá del Siglo XXI",57,{"$f":"IF(ISERROR(VLOOKUP(K157,[2]Proposito_programa!$C$2:$E$59,2,FALSE)),\" \",VLOOKUP(K157,[2]Proposito_programa!$C$2:$E$59,2,FALSE))","v":"Gestión pública local"},{"$f":"IF(ISERROR(VLOOKUP(K157,[2]Proposito_programa!$C$2:$E$59,3,FALSE)),\" \",VLOOKUP(K157,[2]Proposito_programa!$C$2:$E$59,3,FALSE))","v":"Propósito 5: Construir Bogotá - Región con gobierno abierto, transparente y ciudadanía consciente"},1784,1,52194536,"MIREYA RUGE PARDO","Persona Natural","-","-",null,17037230,null,1,2028242,19065472,15414637,"2021-05-21","2021-05-21","2022-01-15","210 DÍAS",1,25,null,null,null,null,null,null,"X",null,0.81]
[147,2021,"FDLF-CD-147-2021","https://community.secop.gov.co/Public/Tendering/OpportunityDetail/Index?noticeUID=CO1.NTC.1993126&isFromPublicArea=True&isModal=true&asPopupView=true","Contratos de prestación de servicios profesionales y de apoyo a la gestión","Contratación directa","Prestación de servicios profesionales y de apoyo a la gestión, o para la ejecución de trabajos artísticos que sólo puedan encomendarse a determinadas personas naturales;","PRESTAR SERVICIOS DE APOYO TÉCNICO AL ÁREA DE GESTIÓN DE DESARROLLO LOCAL DE FONTIBÓN COMO MONITOR DEPORTIVO PARA LA FORMACIÓN DE LAS ESCUELAS DEPORTIVAS DE FONTIBÓN","Inversión","Un nuevo Contrato Social y ambiental para la Bogotá del Siglo XXI",20,{"$f":"IF(ISERROR(VLOOKUP(K158,[2]Proposito_programa!$C$2:$E$59,2,FALSE)),\" \",VLOOKUP(K158,[2]Proposito_programa!$C$2:$E$59,2,FALSE))","v":"Bogotá, referente en cultura, deporte, recreación y actividad física, con parques para el desarrollo y la salud"},{"$f":"IF(ISERROR(VLOOKUP(K158,[2]Proposito_programa!$C$2:$E$59,3,FALSE)),\" \",VLOOKUP(K158,[2]Proposito_programa!$C$2:$E$59,3,FALSE))","v":"Propósito 1: Hacer un nuevo contrato social para incrementar la inclusión social, productiva y política"},1757,1,1016005310,"FREDDY ALEJANDRO ROJAS GONZALEZ","Persona Natural","-","-",null,18506950,null,1,2291337,20798287,16391870,"2021-05-25","2021-05-25","2022-01-20","210 DÍAS",1,26,null,null,null,null,null,null,"X",null,0.79]
[148,2021,"FDLF-CD-148-2021","https://community.secop.gov.co/Public/Tendering/OpportunityDetail/Index?noticeUID=CO1.NTC.1998673&isFromPublicArea=True&isModal=true&asPopupView=true","Arrendamiento de bienes inmuebles","Contratación directa","Prestación de servicios profesionales y de apoyo a la gestión, o para la ejecución de trabajos artísticos que sólo puedan encomendarse a determinadas personas naturales;","ARRENDAMIENTO BODEGA Y PARQUEADERO PARA LOS DIFERENTES ELEMENTOS Y VEHÍCULOS, MAQUINARIA PESADA DEL FONDO DE DESARROLLO LOCAL DE FONTIBÓN","Funcionamiento","Un nuevo Contrato Social y ambiental para la Bogotá del Siglo XXI","No aplica",{"$f":"IF(ISERROR(VLOOKUP(K159,[2]Proposito_programa!$C$2:$E$59,2,FALSE)),\" \",VLOOKUP(K159,[2]Proposito_programa!$C$2:$E$59,2,FALSE))","v":" "},{"$f":"IF(ISERROR(VLOOKUP(K159,[2]Proposito_programa!$C$2:$E$59,3,FALSE)),\" \",VLOOKUP(K159,[2]Proposito_programa!$C$2:$E$59,3,FALSE))","v":" "},201,1,900200519,"INVERSIONES CAOVA SAS","Persona Jurídica","-","-",null,56700000,null,0,0,56700000,47250000,"2021-05-27","2021-05-27","2021-11-26","180 DÍAS",0,0,null,null,null,null,null,null,"X",null,0.5]
[149,2021,"FDLF-CD-149-2021","https://community.secop.gov.co/Public/Tendering/OpportunityDetail/Index?noticeUID=CO1.NTC.1999962&isFromPublicArea=True&isModal=true&asPopupView=true","Contratos de prestación de servicios profesionales y de apoyo a la gestión","Contratación directa","Prestación de servicios profesionales y de apoyo a la gestión, o para la ejecución de trabajos artísticos que sólo puedan encomendarse a determinadas personas naturales;","PRESTAR SERVICIOS PARA APOYAR LAS LABORES DE ENTREGA Y RECIBO DE LAS COMUNICACIONES EMITIDAS O RECIBIDAS POR LAS INSPECCIONES DE POLICÍA DE LA LOCALIDAD DE FONTIBÓN.","Inversión","Un nuevo Contrato Social y ambiental para la Bogotá del Siglo XXI",57,{"$f":"IF(ISERROR(VLOOKUP(K160,[2]Proposito_programa!$C$2:$E$59,2,FALSE)),\" \",VLOOKUP(K160,[2]Proposito_programa!$C$2:$E$59,2,FALSE))","v":"Gestión pública local"},{"$f":"IF(ISERROR(VLOOKUP(K160,[2]Proposito_programa!$C$2:$E$59,3,FALSE)),\" \",VLOOKUP(K160,[2]Proposito_programa!$C$2:$E$59,3,FALSE))","v":"Propósito 5: Construir Bogotá - Región con gobierno abierto, transparente y ciudadanía consciente"},1784,1,1016034743,"JUAN ANTONIO ESPITIA ACERO","Persona Natural","-","-",null,18200000,null,0,0,18200000,15600000,"2021-05-31","2021-05-31","2021-12-30","210 DÍAS",0,0,null,null,null,null,null,null,"X",null,0.28999999999999998]
[150,2021,"FDLF-CD-150-2021","https://community.secop.gov.co/Public/Tendering/OpportunityDetail/Index?noticeUID=CO1.NTC.2016638&isFromPublicArea=True&isModal=true&asPopupView=true","Contratos de prestación de servicios profesionales y de apoyo a la gestión","Contratación directa","Prestación de servicios profesionales y de apoyo a la gestión, o para la ejecución de trabajos artísticos que sólo puedan encomendarse a determinadas personas naturales;","PRESTAR SERVICIOS PROFESIONALES PARA EL DESARROLLO Y MONITOREO DE ACCIONES DE SALUD PÚBLICA EN LA LOCALIDAD DE FONTIBÓN CON ÉNFASIS EN SUSTANCIAS PSICOACTIVAS, ENTORNO COMUNITARIO.","Inversión","Un nuevo Contrato Social y ambiental para la Bogotá del Siglo XXI",6,{"$f":"IF(ISERROR(VLOOKUP(K161,[2]Proposito_programa!$C$2:$E$59,2,FALSE)),\" \",VLOOKUP(K161,[2]Proposito_programa!$C$2:$E$59,2,FALSE))","v":"Sistema Distrital de Cuidado"},{"$f":"IF(ISERROR(VLOOKUP(K161,[2]Proposito_programa!$C$2:$E$59,3,FALSE)),\" \",VLOOKUP(K161,[2]Proposito_programa!$C$2:$E$59,3,FALSE))","v":"Propósito 1: Hacer un nuevo contrato social para incrementar la inclusión social, productiva y política"},1764,1,1016024724,"GINA PAOLA RODRIGUEZ RIAÑO","Persona Natural","-","-",null,29509433,null,0,0,29509433,25148433,"2021-06-08","2021-06-08","2021-12-30","203 DÍAS",0,0,null,null,null,null,null,null,"X",null,0.85]
[151,2021,"FDLF-CD-151-2021","https://community.secop.gov.co/Public/Tendering/OpportunityDetail/Index?noticeUID=CO1.NTC.2012533&isFromPublicArea=True&isModal=true&asPopupView=true","Contratos de prestación de servicios profesionales y de apoyo a la gestión","Contratación directa","Prestación de servicios profesionales y de apoyo a la gestión, o para la ejecución de trabajos artísticos que sólo puedan encomendarse a determinadas personas naturales;","PRESTAR SERVICIOS DE APOYO TÉCNICO AL ÁREA DE GESTIÓN DE DESARROLLO LOCAL DE FONTIBÓN COMO MONITOR DEPORTIVO PARA LA FORMACIÓN DE LAS ESCUELAS DEPORTIVAS DE FONTIBÓN","Inversión","Un nuevo Contrato Social y ambiental para la Bogotá del Siglo XXI",20,{"$f":"IF(ISERROR(VLOOKUP(K162,[2]Proposito_programa!$C$2:$E$59,2,FALSE)),\" \",VLOOKUP(K162,[2]Proposito_programa!$C$2:$E$59,2,FALSE))","v":"Bogotá, referente en cultura, deporte, recreación y actividad física, con parques para el desarrollo y la salud"},{"$f":"IF(ISERROR(VLOOKUP(K162,[2]Proposito_programa!$C$2:$E$59,3,FALSE)),\" \",VLOOKUP(K162,[2]Proposito_programa!$C$2:$E$59,3,FALSE))","v":"Propósito 1: Hacer un nuevo contrato social para incrementar la inclusión social, productiva y política"},1757,1,1016109467,"DORIS ADRIANA RODRIGUEZ FONSECA","Persona Natural","-","-",null,17801923,null,0,0,17801923,15598715,"2021-06-04","2021-06-04","2021-12-25","202 DÍAS",0,0,null,null,null,null,null,null,"X",null,0.88]
[152,2021,"FDLF-CD-152-2021","https://community.secop.gov.co/Public/Tendering/OpportunityDetail/Index?noticeUID=CO1.NTC.2016741&isFromPublicArea=True&isModal=true&asPopupView=true","Contratos de prestación de servicios profesionales y de apoyo a la gestión","Contratación directa","Prestación de servicios profesionales y de apoyo a la gestión, o para la ejecución de trabajos artísticos que sólo puedan encomendarse a determinadas personas naturales;","SERVICIOS DE APOYO TÉCNICO PARA TRÁMITE Y DESARROLLO DE LOS DESPACHOS COMISORIOS QUE POR COMPETENCIA CORRESPONDEN A LA ALCALDÍA LOCAL DE FONTIBÓN.","Inversión","Un nuevo Contrato Social y ambiental para la Bogotá del Siglo XXI",57,{"$f":"IF(ISERROR(VLOOKUP(K163,[2]Proposito_programa!$C$2:$E$59,2,FALSE)),\" \",VLOOKUP(K163,[2]Proposito_programa!$C$2:$E$59,2,FALSE))","v":"Gestión pública local"},{"$f":"IF(ISERROR(VLOOKUP(K163,[2]Proposito_programa!$C$2:$E$59,3,FALSE)),\" \",VLOOKUP(K163,[2]Proposito_programa!$C$2:$E$59,3,FALSE))","v":"Propósito 5: Construir Bogotá - Región con gobierno abierto, transparente y ciudadanía consciente"},1783,1,35221867,"MARIA JOHANA LOPEZ ULCUE","Persona Natural","-","-",null,26484733,null,0,0,26484733,22570733,"2021-06-08","2021-06-08","2021-12-30","203 DÍAS",0,0,null,null,null,null,null,null,"X",null,0.18]
[153,2021,"FDLF-CD-153-2021","https://community.secop.gov.co/Public/Tendering/OpportunityDetail/Index?noticeUID=CO1.NTC.2016665&isFromPublicArea=True&isModal=true&asPopupView=true","Contratos de prestación de servicios profesionales y de apoyo a la gestión","Contratación directa","Prestación de servicios profesionales y de apoyo a la gestión, o para la ejecución de trabajos artísticos que sólo puedan encomendarse a determinadas personas naturales;","PRESTAR SERVICIOS PROFESIONALES PARA APOYAR LOS PROCESOS RELACIONADOS CON LOS CONTRATOS DE INVERSIÓN, VERIFICACIÓN DEL PROCEDIMIENTO DE PAGOS Y REVISIÓN DE CARPETAS ALLEGADAS AL DESPACHO PARA SU RESPECTIVA FIRMA DEL ALCALDE LOCAL.","Inversión","Un nuevo Contrato Social y ambiental para la Bogotá del Siglo XXI",57,{"$f":"IF(ISERROR(VLOOKUP(K164,[2]Proposito_programa!$C$2:$E$59,2,FALSE)),\" \",VLOOKUP(K164,[2]Proposito_programa!$C$2:$E$59,2,FALSE))","v":"Gestión pública local"},{"$f":"IF(ISERROR(VLOOKUP(K164,[2]Proposito_programa!$C$2:$E$59,3,FALSE)),\" \",VLOOKUP(K164,[2]Proposito_programa!$C$2:$E$59,3,FALSE))","v":"Propósito 5: Construir Bogotá - Región con gobierno abierto, transparente y ciudadanía consciente"},1783,1,79531044,"NELSON RODOLFO OSORIO PINILLA","Persona Natural","-","-",null,33833333,null,1,2666667,36500000,26333333,"2021-06-08","2021-06-08","2022-01-16","203 DÍAS",1,16,null,null,null,null,null,null,"X",null,0.72]
[154,2021,"FDLF-CD-154-2021","https://www.contratos.gov.co/consultas/detalleProceso.do?numConstancia=21-22-26521&g","Convenios de cooperacion","Contratación directa","Contratos interadministrativos","AUNAR ESFUERZOS TÉCNICOS Y ADMINISTRATIVOS CON EL FIN DE DESARROLLAR ACCIONES ARTICULADAS ENTRE LAS PARTES ORIENTADAS A FOMENTAR LA GENERACIÓN Y CIRCULACIÓN DE BIENES Y SERVICIOS CULTURALES, ASÍ COMO AL FORTALECIMIENTO DE LOS AGENTES DE ESTOS SECTORES EN LAS LOCALIDADES DEL DISTRITO CAPITAL QUE HACEN PARTE DE ESTE INSTRUMENTO.","Inversión","Un nuevo Contrato Social y ambiental para la Bogotá del Siglo XXI",21,{"$f":"IF(ISERROR(VLOOKUP(K165,[2]Proposito_programa!$C$2:$E$59,2,FALSE)),\" \",VLOOKUP(K165,[2]Proposito_programa!$C$2:$E$59,2,FALSE))","v":"Creación y vida cotidiana: Apropiación ciudadana del arte, la cultura y el patrimonio, para la democracia cultural"},{"$f":"IF(ISERROR(VLOOKUP(K165,[2]Proposito_programa!$C$2:$E$59,3,FALSE)),\" \",VLOOKUP(K165,[2]Proposito_programa!$C$2:$E$59,3,FALSE))","v":"Propósito 1: Hacer un nuevo contrato social para incrementar la inclusión social, productiva y política"},1758,1,899999061,"SECRETARIA DISTRITAL DE CULTURA RECREACIÓN Y DEPORTE","Persona Jurídica","-","-",null,0,null,0,0,0," $                          -  ","2021-06-04","2021-06-28","2022-06-30","368 DÍAS",0,0,null,null,null,null,null,"X",null,null,0.18]
[155,2021,"FDLF-CD-155-2021","https://community.secop.gov.co/Public/Tendering/OpportunityDetail/Index?noticeUID=CO1.NTC.2027068&isFromPublicArea=True&isModal=true&asPopupView=true","Contratos de prestación de servicios profesionales y de apoyo a la gestión","Contratación directa","Prestación de servicios profesionales y de apoyo a la gestión, o para la ejecución de trabajos artísticos que sólo puedan encomendarse a determinadas personas naturales;","PRESTAR SERVICIOS DE APOYO AL ÁREA DE GESTIÓN DEL DESARROLLO LOCAL DE FONTIBÓN EN ACTIVIDADES INHERENTES A LA PLANEACIÓN.","Inversión","Un nuevo Contrato Social y ambiental para la Bogotá del Siglo XXI",57,{"$f":"IF(ISERROR(VLOOKUP(K166,[2]Proposito_programa!$C$2:$E$59,2,FALSE)),\" \",VLOOKUP(K166,[2]Proposito_programa!$C$2:$E$59,2,FALSE))","v":"Gestión pública local"},{"$f":"IF(ISERROR(VLOOKUP(K166,[2]Proposito_programa!$C$2:$E$59,3,FALSE)),\" \",VLOOKUP(K166,[2]Proposito_programa!$C$2:$E$59,3,FALSE))","v":"Propósito 5: Construir Bogotá - Región con gobierno abierto, transparente y ciudadanía consciente"},1783,1,52806783,"JENNY PAOLA PINZON SANCHEZ","Persona Natural","-","-",null,16225933,null,1,1298075,{"$f":"Y166+V166+W166","v":17524008},13792043,"2021-06-11","2021-06-11","2022-01-16","200 DÍAS",1,16,null,null,null,null,null,null,"X",null,0.79]
[156,2021,"FDLF-CD-156-2021","https://community.secop.gov.co/Public/Tendering/OpportunityDetail/Index?noticeUID=CO1.NTC.2034619&isFromPublicArea=True&isModal=true&asPopupView=true","Contratos de prestación de servicios profesionales y de apoyo a la gestión","Contratación directa","Prestación de servicios profesionales y de apoyo a la gestión, o para la ejecución de trabajos artísticos que sólo puedan encomendarse a determinadas personas naturales;","PRESTAR SERVICIOS DE APOYO EN LAS ACTIVIDADES DE SEGURIDAD Y CONVIVENCIA CIUDADANA, DE ACUERDO CON LAS NECESIDADES Y ESTRATEGIAS EMANADAS POR EL ÁREA DE GESTIÓN DEL DESARROLLO LOCAL, DE LA ALCALDÍA LOCAL DE FONTIBÓN.","Inversión","Un nuevo Contrato Social y ambiental para la Bogotá del Siglo XXI",43,{"$f":"IF(ISERROR(VLOOKUP(K167,[2]Proposito_programa!$C$2:$E$59,2,FALSE)),\" \",VLOOKUP(K167,[2]Proposito_programa!$C$2:$E$59,2,FALSE))","v":"Cultura ciudadana para la confianza, la convivencia y la participación desde la vida cotidiana"},{"$f":"IF(ISERROR(VLOOKUP(K167,[2]Proposito_programa!$C$2:$E$59,3,FALSE)),\" \",VLOOKUP(K167,[2]Proposito_programa!$C$2:$E$59,3,FALSE))","v":"Propósito 3: Inspirar confianza y legitimidad para vivir sin miedo y ser epicentro de cultura ciudadana, paz y reconciliación"},1775,1,1016040374,"PAOLA ANDREA QUIROGA ARIAS","Persona Natural","-","-",null,15739155,null,1,2028242,17767397,13305265,"2021-06-17","2021-06-17","2022-01-25","194 DÍAS",1,25,null,null,null,null,null,null,"X",null,0.75]
[157,2021,"FDLF-CD-157-2021","https://community.secop.gov.co/Public/Tendering/OpportunityDetail/Index?noticeUID=CO1.NTC.2034342&isFromPublicArea=True&isModal=true&asPopupView=true","Contratos de prestación de servicios profesionales y de apoyo a la gestión","Contratación directa","Prestación de servicios profesionales y de apoyo a la gestión, o para la ejecución de trabajos artísticos que sólo puedan encomendarse a determinadas personas naturales;","PRESTAR SERVICIOS DE APOYO EN LAS ACTIVIDADES DE SEGURIDAD Y CONVIVENCIA CIUDADANA, DE ACUERDO CON LAS NECESIDADES Y ESTRATEGIAS EMANADAS POR EL ÁREA DE GESTIÓN DEL DESARROLLO LOCAL, DE LA ALCALDÍA LOCAL DE FONTIBÓN.","Inversión","Un nuevo Contrato Social y ambiental para la Bogotá del Siglo XXI",43,{"$f":"IF(ISERROR(VLOOKUP(K168,[2]Proposito_programa!$C$2:$E$59,2,FALSE)),\" \",VLOOKUP(K168,[2]Proposito_programa!$C$2:$E$59,2,FALSE))","v":"Cultura ciudadana para la confianza, la convivencia y la participación desde la vida cotidiana"},{"$f":"IF(ISERROR(VLOOKUP(K168,[2]Proposito_programa!$C$2:$E$59,3,FALSE)),\" \",VLOOKUP(K168,[2]Proposito_programa!$C$2:$E$59,3,FALSE))","v":"Propósito 3: Inspirar confianza y legitimidad para vivir sin miedo y ser epicentro de cultura ciudadana, paz y reconciliación"},1775,1,1016052722,"JESSICA MILENA MARTINEZ RIVERA","Persona Natural","-","-",null,15739155,null,1,2028242,17767397,13305265,"2021-06-17","2021-06-17","2022-01-25","196 DÍAS",1,25,null,null,null,null,null,null,"X",null,0.75]
[158,2021,"FDLF-CD-158-2021","https://community.secop.gov.co/Public/Tendering/OpportunityDetail/Index?noticeUID=CO1.NTC.2040031&isFromPublicArea=True&isModal=true&asPopupView=true","Contratos de prestación de servicios profesionales y de apoyo a la gestión","Contratación directa","Prestación de servicios profesionales y de apoyo a la gestión, o para la ejecución de trabajos artísticos que sólo puedan encomendarse a determinadas personas naturales;","PRESTAR SERVICIOS DE APOYO EN LAS ACTIVIDADES DE SEGURIDAD Y CONVIVENCIA CIUDADANA, DE ACUERDO CON LAS NECESIDADES Y ESTRATEGIAS EMANADAS POR EL ÁREA DE GESTIÓN DEL DESARROLLO LOCAL, DE LA ALCALDÍA LOCAL DE FONTIBÓN.","Inversión","Un nuevo Contrato Social y ambiental para la Bogotá del Siglo XXI",43,{"$f":"IF(ISERROR(VLOOKUP(K169,[2]Proposito_programa!$C$2:$E$59,2,FALSE)),\" \",VLOOKUP(K169,[2]Proposito_programa!$C$2:$E$59,2,FALSE))","v":"Cultura ciudadana para la confianza, la convivencia y la participación desde la vida cotidiana"},{"$f":"IF(ISERROR(VLOOKUP(K169,[2]Proposito_programa!$C$2:$E$59,3,FALSE)),\" \",VLOOKUP(K169,[2]Proposito_programa!$C$2:$E$59,3,FALSE))","v":"Propósito 3: Inspirar confianza y legitimidad para vivir sin miedo y ser epicentro de cultura ciudadana, paz y reconciliación"},1775,1,80418976,"JULIO CESAR MUÑOZ OLMOS","Persona Natural","-","-",null,15414637,null,1,1947112,17361749,12899617,"2021-06-22","2021-06-22","2022-01-24","190 DÍAS",1,24,null,null,null,null,null,null,"X",null,0.74]
[159,2021,"FDLF-CD-159-2021","https://community.secop.gov.co/Public/Tendering/OpportunityDetail/Index?noticeUID=CO1.NTC.2046118&isFromPublicArea=True&isModal=true&asPopupView=true","Contratos de prestación de servicios profesionales y de apoyo a la gestión","Contratación directa","Prestación de servicios profesionales y de apoyo a la gestión, o para la ejecución de trabajos artísticos que sólo puedan encomendarse a determinadas personas naturales;","PRESTAR SERVICIOS DE APOYO EN LAS ACTIVIDADES DE SEGURIDAD Y CONVIVENCIA CIUDADANA, DE ACUERDO CON LAS NECESIDADES Y ESTRATEGIAS EMANADAS POR EL ÁREA DE GESTIÓN DEL DESARROLLO LOCAL, DE LA ALCALDÍA LOCAL DE FONTIBÓN.","Inversión","Un nuevo Contrato Social y ambiental para la Bogotá del Siglo XXI",43,{"$f":"IF(ISERROR(VLOOKUP(K170,[2]Proposito_programa!$C$2:$E$59,2,FALSE)),\" \",VLOOKUP(K170,[2]Proposito_programa!$C$2:$E$59,2,FALSE))","v":"Cultura ciudadana para la confianza, la convivencia y la participación desde la vida cotidiana"},{"$f":"IF(ISERROR(VLOOKUP(K170,[2]Proposito_programa!$C$2:$E$59,3,FALSE)),\" \",VLOOKUP(K170,[2]Proposito_programa!$C$2:$E$59,3,FALSE))","v":"Propósito 3: Inspirar confianza y legitimidad para vivir sin miedo y ser epicentro de cultura ciudadana, paz y reconciliación"},1775,1,79133267,"ANGEL HIPOLITO BEJARANO LOMBANA","Persona Natural","-","-",null,15252377,null,0,0,15252377,12818487,"2021-06-23","2021-06-23","2021-12-30","190 DÍAS",0,0,null,null,null,null,null,null,"X",null,0.84]
[160,2021,"FDLF-CD-160-2021","https://community.secop.gov.co/Public/Tendering/OpportunityDetail/Index?noticeUID=CO1.NTC.2041940&isFromPublicArea=True&isModal=true&asPopupView=true","Contratos de prestación de servicios profesionales y de apoyo a la gestión","Contratación directa","Prestación de servicios profesionales y de apoyo a la gestión, o para la ejecución de trabajos artísticos que sólo puedan encomendarse a determinadas personas naturales;","PRESTAR SERVICIOS DE APOYO PROFESIONAL AL ÁREA DE GESTIÓN DE DESARROLLO LOCAL DE FONTIBÓN ORIENTADO AL DESARROLLO DE LAS ESCUELAS DE FORMACIÓN DEPORTIVA DE FONTIBÓN","Inversión","Un nuevo Contrato Social y ambiental para la Bogotá del Siglo XXI",20,{"$f":"IF(ISERROR(VLOOKUP(K171,[2]Proposito_programa!$C$2:$E$59,2,FALSE)),\" \",VLOOKUP(K171,[2]Proposito_programa!$C$2:$E$59,2,FALSE))","v":"Bogotá, referente en cultura, deporte, recreación y actividad física, con parques para el desarrollo y la salud"},{"$f":"IF(ISERROR(VLOOKUP(K171,[2]Proposito_programa!$C$2:$E$59,3,FALSE)),\" \",VLOOKUP(K171,[2]Proposito_programa!$C$2:$E$59,3,FALSE))","v":"Propósito 1: Hacer un nuevo contrato social para incrementar la inclusión social, productiva y política"},1757,1,79901384,"LEONARDO LUQUE GOMEZ","Persona Natural","-","-",null,27474300,null,0,0,27474300,23113300,"2021-06-22","2021-06-22","2021-12-30","189 DÍAS",0,0,null,null,null,null,null,null,"X",null,0.84]
[161,2021,"FDLF-CD-161-2021","https://community.secop.gov.co/Public/Tendering/OpportunityDetail/Index?noticeUID=CO1.NTC.2046793&isFromPublicArea=True&isModal=true&asPopupView=true","Contratos de prestación de servicios profesionales y de apoyo a la gestión","Contratación directa","Prestación de servicios profesionales y de apoyo a la gestión, o para la ejecución de trabajos artísticos que sólo puedan encomendarse a determinadas personas naturales;","PRESTAR SERVICIOS DE APOYO EN LAS ACTIVIDADES DE SEGURIDAD Y CONVIVENCIA CIUDADANA, DE ACUERDO CON LAS NECESIDADES Y ESTRATEGIAS EMANADAS POR EL ÁREA DE GESTIÓN DEL DESARROLLO LOCAL, DE LA ALCALDÍA LOCAL DE FONTIBÓN.","Inversión","Un nuevo Contrato Social y ambiental para la Bogotá del Siglo XXI",43,{"$f":"IF(ISERROR(VLOOKUP(K172,[2]Proposito_programa!$C$2:$E$59,2,FALSE)),\" \",VLOOKUP(K172,[2]Proposito_programa!$C$2:$E$59,2,FALSE))","v":"Cultura ciudadana para la confianza, la convivencia y la participación desde la vida cotidiana"},{"$f":"IF(ISERROR(VLOOKUP(K172,[2]Proposito_programa!$C$2:$E$59,3,FALSE)),\" \",VLOOKUP(K172,[2]Proposito_programa!$C$2:$E$59,3,FALSE))","v":"Propósito 3: Inspirar confianza y legitimidad para vivir sin miedo y ser epicentro de cultura ciudadana, paz y reconciliación"},1775,1,11637319,"JAVIER BONILLA CAICEDO","Persona Natural","-","-",null,15171248,null,1,1784853,16956101,12737357,"2021-06-24","2021-06-24","2022-01-22","187 DÍAS",1,22,null,null,null,null,null,null,"X",null,0.75]
[162,2021,"FDLF-CD-162-2021","https://community.secop.gov.co/Public/Tendering/OpportunityDetail/Index?noticeUID=CO1.NTC.2050130&isFromPublicArea=True&isModal=true&asPopupView=true","Contratos de prestación de servicios profesionales y de apoyo a la gestión","Contratación directa","Prestación de servicios profesionales y de apoyo a la gestión, o para la ejecución de trabajos artísticos que sólo puedan encomendarse a determinadas personas naturales;","PRESTAR SERVICIOS DE APOYO EN LAS ACTIVIDADES DE SEGURIDAD Y CONVIVENCIA CIUDADANA, DE ACUERDO CON LAS NECESIDADES Y ESTRATEGIAS EMANADAS POR EL ÁREA DE GESTIÓN DEL DESARROLLO LOCAL, DE LA ALCALDÍA LOCAL DE FONTIBÓN.","Inversión","Un nuevo Contrato Social y ambiental para la Bogotá del Siglo XXI",43,{"$f":"IF(ISERROR(VLOOKUP(K173,[2]Proposito_programa!$C$2:$E$59,2,FALSE)),\" \",VLOOKUP(K173,[2]Proposito_programa!$C$2:$E$59,2,FALSE))","v":"Cultura ciudadana para la confianza, la convivencia y la participación desde la vida cotidiana"},{"$f":"IF(ISERROR(VLOOKUP(K173,[2]Proposito_programa!$C$2:$E$59,3,FALSE)),\" \",VLOOKUP(K173,[2]Proposito_programa!$C$2:$E$59,3,FALSE))","v":"Propósito 3: Inspirar confianza y legitimidad para vivir sin miedo y ser epicentro de cultura ciudadana, paz y reconciliación"},1775,1,11430819,"ESAU ARNULFO AMORTEGUI PINEDA","Persona Natural","-","-",null,15090118,null,0,0,15090118,10222338,"2021-06-25","2021-06-25","2021-12-30","186 DÍAS",0,0,null,null,null,null,null,null,"X",null,0.68]
[163,2021,"FDLF-CD-163-2021","https://community.secop.gov.co/Public/Tendering/OpportunityDetail/Index?noticeUID=CO1.NTC.2049680&isFromPublicArea=True&isModal=true&asPopupView=true","Contratos de prestación de servicios profesionales y de apoyo a la gestión","Contratación directa","Prestación de servicios profesionales y de apoyo a la gestión, o para la ejecución de trabajos artísticos que sólo puedan encomendarse a determinadas personas naturales;","PRESTAR SERVICIOS DE APOYO TÉCNICO AL ÁREA DE GESTIÓN DE DESARROLLO LOCAL DE FONTIBÓN COMO MONITOR DEPORTIVO PARA LA FORMACIÓN DE LAS ESCUELAS DEPORTIVAS DE FONTIBÓN","Inversión","Un nuevo Contrato Social y ambiental para la Bogotá del Siglo XXI",20,{"$f":"IF(ISERROR(VLOOKUP(K174,[2]Proposito_programa!$C$2:$E$59,2,FALSE)),\" \",VLOOKUP(K174,[2]Proposito_programa!$C$2:$E$59,2,FALSE))","v":"Bogotá, referente en cultura, deporte, recreación y actividad física, con parques para el desarrollo y la salud"},{"$f":"IF(ISERROR(VLOOKUP(K174,[2]Proposito_programa!$C$2:$E$59,3,FALSE)),\" \",VLOOKUP(K174,[2]Proposito_programa!$C$2:$E$59,3,FALSE))","v":"Propósito 1: Hacer un nuevo contrato social para incrementar la inclusión social, productiva y política"},1757,1,1013644299,"WILLIAM JAVIER REYES RUGELES","Persona Natural","-","-",null,15863100,null,0,0,0,null,"2021-06-23","2021-06-23","2021-06-23","180 DÍAS",0,0,null,null,null,null,null,null,"X",null,0.57999999999999996]
[164,2021,"FDLF-CD-164-2021","https://community.secop.gov.co/Public/Tendering/OpportunityDetail/Index?noticeUID=CO1.NTC.2053626&isFromPublicArea=True&isModal=true&asPopupView=true","Contratos de prestación de servicios profesionales y de apoyo a la gestión","Contratación directa","Prestación de servicios profesionales y de apoyo a la gestión, o para la ejecución de trabajos artísticos que sólo puedan encomendarse a determinadas personas naturales;","PRESTAR SERVICIOS PROFESIONALES PARA APOYAR A LA ALCALDÍA LOCAL DE FONTIBÓN EN TEMAS ORIENTADOS A LA PREVENCIÓN DEL EMBARAZO ADOLESCENTE EN LA LOCALIDAD.","Inversión","Un nuevo Contrato Social y ambiental para la Bogotá del Siglo XXI",8,{"$f":"IF(ISERROR(VLOOKUP(K175,[2]Proposito_programa!$C$2:$E$59,2,FALSE)),\" \",VLOOKUP(K175,[2]Proposito_programa!$C$2:$E$59,2,FALSE))","v":"Prevención y atención de maternidad temprana"},{"$f":"IF(ISERROR(VLOOKUP(K175,[2]Proposito_programa!$C$2:$E$59,3,FALSE)),\" \",VLOOKUP(K175,[2]Proposito_programa!$C$2:$E$59,3,FALSE))","v":"Propósito 1: Hacer un nuevo contrato social para incrementar la inclusión social, productiva y política"},1765,1,1022333300,"VIVIANA PAOLA MORALES SAGANOME","Persona Natural","-","-",null,24985000,null,0,0,{"$f":"Y175+V175+W175","v":24985000},20487700,"2021-06-28","2021-06-28","2021-11-27","150 DÍAS",0,0,null,null,null,null,null,null,"X",null,0.82]
[165,2021,"FDLF-CD-165-2021","https://community.secop.gov.co/Public/Tendering/OpportunityDetail/Index?noticeUID=CO1.NTC.2054068&isFromPublicArea=True&isModal=true&asPopupView=true","Contratos de prestación de servicios profesionales y de apoyo a la gestión","Contratación directa","Prestación de servicios profesionales y de apoyo a la gestión, o para la ejecución de trabajos artísticos que sólo puedan encomendarse a determinadas personas naturales;","PRESTAR LOS SERVICIOS COMO TÉCNICO ELECTRICISTA PARA ACTIVIDADES RELACIONADAS CON LA ADMINISTRACIÓN, MANTENIMIENTO Y ADECUACIONES MENORES DE LAS SEDES DE LA ALCALDÍA LOCAL DE FONTIBÓN.","Inversión","Un nuevo Contrato Social y ambiental para la Bogotá del Siglo XXI",57,{"$f":"IF(ISERROR(VLOOKUP(K176,[2]Proposito_programa!$C$2:$E$59,2,FALSE)),\" \",VLOOKUP(K176,[2]Proposito_programa!$C$2:$E$59,2,FALSE))","v":"Gestión pública local"},{"$f":"IF(ISERROR(VLOOKUP(K176,[2]Proposito_programa!$C$2:$E$59,3,FALSE)),\" \",VLOOKUP(K176,[2]Proposito_programa!$C$2:$E$59,3,FALSE))","v":"Propósito 5: Construir Bogotá - Región con gobierno abierto, transparente y ciudadanía consciente"},1783,1,9178045,"JOSE VICENTE DIAZ HERNANDEZ","Persona Natural","-","-",null,19570000,null,1,4305400,23875400,19961400,"2021-06-28","2021-06-28","2021-12-31","150 DÍAS",1,31,null,null,null,null,null,null,"X",null,0.82]
[166,2021,"FDLF-CD-166-2021","https://community.secop.gov.co/Public/Tendering/OpportunityDetail/Index?noticeUID=CO1.NTC.2062403&isFromPublicArea=True&isModal=true&asPopupView=true","Contratos de prestación de servicios profesionales y de apoyo a la gestión","Contratación directa","Prestación de servicios profesionales y de apoyo a la gestión, o para la ejecución de trabajos artísticos que sólo puedan encomendarse a determinadas personas naturales;","PRESTAR SERVICIOS PROFESIONALES PARA APOYAR EL ÁREA DE GESTIÓN DE DESARROLLO LOCAL Y EL EQUIPO DE PARTICIPACIÓN EN EL FORTALECIMIENTO E INCLUSIÓN DE LOS GRUPOS ÉTNICOS DE LA LOCALIDAD DE FONTIBÓN EN LOS PROYECTOS DE INVERSIÓN.","Inversión","Un nuevo Contrato Social y ambiental para la Bogotá del Siglo XXI",55,{"$f":"IF(ISERROR(VLOOKUP(K177,[2]Proposito_programa!$C$2:$E$59,2,FALSE)),\" \",VLOOKUP(K177,[2]Proposito_programa!$C$2:$E$59,2,FALSE))","v":"Fortalecimiento de cultura ciudadana y su institucionalidad"},{"$f":"IF(ISERROR(VLOOKUP(K177,[2]Proposito_programa!$C$2:$E$59,3,FALSE)),\" \",VLOOKUP(K177,[2]Proposito_programa!$C$2:$E$59,3,FALSE))","v":"Propósito 5: Construir Bogotá - Región con gobierno abierto, transparente y ciudadanía consciente"},1782,1,1016072576,"MARIA ALEJANDRA PIÑEROS MONDRAGON","Persona Natural","-","-",null,26166000,null,0,0,26166000,21805000,"2021-07-01","2021-07-01","2021-12-30","180 DÍAS",0,0,null,null,null,null,null,null,"X",null,0.83]
[167,2021,"FDLF-CD-167-2021","https://www.contratos.gov.co/consultas/detalleProceso.do?numConstancia=21-22-27326&g","Convenios de cooperacion","Contratación directa","Contratos interadministrativos","AUNAR ESFUERZOS TÉCNICOS Y ADMINISTRATIVOS CON EL FIN DE DESARROLLAR ACCIONES ARTICULADAS ENTRE LAS PARTES ORIENTADAS A FOMENTAR LA GENERACIÓN Y CIRCULACIÓN DE BIENES Y SERVICIOS CULTURALES, ASÍ COMO AL FORTALECIMIENTO DE LOS AGENTES DE ESTOS SECTORES EN LAS LOCALIDADES DEL DISTRITO CAPITAL QUE HACEN PARTE DE ESTE INSTRUMENTO.","Inversión","Un nuevo Contrato Social y ambiental para la Bogotá del Siglo XXI",17,{"$f":"IF(ISERROR(VLOOKUP(K178,[2]Proposito_programa!$C$2:$E$59,2,FALSE)),\" \",VLOOKUP(K178,[2]Proposito_programa!$C$2:$E$59,2,FALSE))","v":"Jóvenes con capacidades: Proyecto de vida para la ciudadanía, la innovación y el trabajo del siglo XXI"},{"$f":"IF(ISERROR(VLOOKUP(K178,[2]Proposito_programa!$C$2:$E$59,3,FALSE)),\" \",VLOOKUP(K178,[2]Proposito_programa!$C$2:$E$59,3,FALSE))","v":"Propósito 1: Hacer un nuevo contrato social para incrementar la inclusión social, productiva y política"},1755,1,899999061,"SECRETARIA DE EDUCACIÓN DEL DISTRITO","Persona Jurídica","-","-",null,1765266018,null,0,0,1765266018,{"$f":"Z178+W178+X178","v":1765266018},"2021-06-28","2021-06-30","2027-06-06","2160 DÍAS",0,0,null,null,null,null,null,"X",null,null,1]
[168,2021,"FDLF-CD-168-2021","https://community.secop.gov.co/Public/Tendering/OpportunityDetail/Index?noticeUID=CO1.NTC.2063882&isFromPublicArea=True&isModal=true&asPopupView=true","Contratos de prestación de servicios profesionales y de apoyo a la gestión","Contratación directa","Prestación de servicios profesionales y de apoyo a la gestión, o para la ejecución de trabajos artísticos que sólo puedan encomendarse a determinadas personas naturales;","PRESTAR SERVICIOS TÉCNICOS PARA APOYAR EL EQUIPO DE LIQUIDACIONES DE LA ALCALDÍA LOCAL DE FONTIBÓN.","Inversión","Un nuevo Contrato Social y ambiental para la Bogotá del Siglo XXI",57,{"$f":"IF(ISERROR(VLOOKUP(K179,[2]Proposito_programa!$C$2:$E$59,2,FALSE)),\" \",VLOOKUP(K179,[2]Proposito_programa!$C$2:$E$59,2,FALSE))","v":"Gestión pública local"},{"$f":"IF(ISERROR(VLOOKUP(K179,[2]Proposito_programa!$C$2:$E$59,3,FALSE)),\" \",VLOOKUP(K179,[2]Proposito_programa!$C$2:$E$59,3,FALSE))","v":"Propósito 5: Construir Bogotá - Región con gobierno abierto, transparente y ciudadanía consciente"},1783,1,1032476271,"CHRISTHIAN MOISES GUARIN CUBILLOS","Persona Natural","-","-",null,23484000,null,0,0,23484000,19570000,"2021-06-30","2021-07-01","2021-12-30","183 DÍAS",0,0,null,null,null,null,null,null,"X",null,0.83]
[169,2021,"FDLF-CD-169-2021","https://community.secop.gov.co/Public/Tendering/OpportunityDetail/Index?noticeUID=CO1.NTC.2069189&isFromPublicArea=True&isModal=true&asPopupView=true","Contratos de prestación de servicios profesionales y de apoyo a la gestión","Contratación directa","Prestación de servicios profesionales y de apoyo a la gestión, o para la ejecución de trabajos artísticos que sólo puedan encomendarse a determinadas personas naturales;","PRESTAR SERVICIOS DE APOYO EN LAS ACTIVIDADES DE SEGURIDAD Y CONVIVENCIA CIUDADANA, DE ACUERDO CON LAS NECESIDADES Y ESTRATEGIAS EMANADAS POR EL ÁREA DE GESTIÓN DE DESARROLLO LOCAL DE LA ALCALDÍA LOCAL DE FONTIBÓN.","Inversión","Un nuevo Contrato Social y ambiental para la Bogotá del Siglo XXI",43,{"$f":"IF(ISERROR(VLOOKUP(K180,[2]Proposito_programa!$C$2:$E$59,2,FALSE)),\" \",VLOOKUP(K180,[2]Proposito_programa!$C$2:$E$59,2,FALSE))","v":"Cultura ciudadana para la confianza, la convivencia y la participación desde la vida cotidiana"},{"$f":"IF(ISERROR(VLOOKUP(K180,[2]Proposito_programa!$C$2:$E$59,3,FALSE)),\" \",VLOOKUP(K180,[2]Proposito_programa!$C$2:$E$59,3,FALSE))","v":"Propósito 3: Inspirar confianza y legitimidad para vivir sin miedo y ser epicentro de cultura ciudadana, paz y reconciliación"},1775,1,76041176,"JUAN DE LA CRUZ CASTRO PAZ","Persona Natural","-","-",null,14197691,null,0,0,14197691,11763802,"2021-07-02","2021-07-06","2021-12-30","175 DÍAS",0,0,null,null,null,null,null,null,"X",null,0.83]
[170,2021,"FDLF-CD-170-2021","https://www.contratos.gov.co/consultas/detalleProceso.do?numConstancia=21-22-27218&g","Convenios de cooperacion","Contratación directa","Contratos interadministrativos","AUNAR ESFUERZOS TÉCNICOS, ADMINISTRATIVOS Y FINANCIEROS CON EL FIN DE DESARROLLAR ACCIONES ARTICULADAS ENTRE LAS PARTES ORIENTADAS A FOMENTAR LA GENERACIÓN Y CIRCULACIÓN DE BIENES Y SERVICIOS CULTURALES, ARTÍSTICOS Y PATRIMONIALES, ASÍ COMO AL FORTALECIMIENTO DE LOS AGENTES DE ESTOS SECTORES EN LAS LOCALIDADES DEL DISTRITO CAPITAL DE ACUERDO CON LOS PROYECTOS PRESENTADOS A LOS FONDOS DE DESARROLLO LOCAL QUE FORMAN PARTE DEL CONVENIO EN EL MARCO DEL PROGRAMA “ES CULTURA LOCAL 2021” ","Inversión","Un nuevo Contrato Social y ambiental para la Bogotá del Siglo XXI",6,{"$f":"IF(ISERROR(VLOOKUP(K181,[2]Proposito_programa!$C$2:$E$59,2,FALSE)),\" \",VLOOKUP(K181,[2]Proposito_programa!$C$2:$E$59,2,FALSE))","v":"Sistema Distrital de Cuidado"},{"$f":"IF(ISERROR(VLOOKUP(K181,[2]Proposito_programa!$C$2:$E$59,3,FALSE)),\" \",VLOOKUP(K181,[2]Proposito_programa!$C$2:$E$59,3,FALSE))","v":"Propósito 1: Hacer un nuevo contrato social para incrementar la inclusión social, productiva y política"},1761,1,900413030,"IDARTES","Persona Jurídica","-","-",null,373971318,null,0,null,{"$f":"V181+W181","v":373971318},373971318,"2021-06-30","2021-07-07","2021-12-31","174 DÍAS",0,0,null,null,null,null,null,null,"X",null,0.35]
[170,2021,"FDLF-CD-170-2021","https://www.contratos.gov.co/consultas/detalleProceso.do?numConstancia=21-22-27218&g","Convenios de cooperacion","Contratación directa","Contratos interadministrativos","AUNAR ESFUERZOS TÉCNICOS, ADMINISTRATIVOS Y FINANCIEROS CON EL FIN DE DESARROLLAR ACCIONES ARTICULADAS ENTRE LAS PARTES ORIENTADAS A FOMENTAR LA GENERACIÓN Y CIRCULACIÓN DE BIENES Y SERVICIOS CULTURALES, ARTÍSTICOS Y PATRIMONIALES, ASÍ COMO AL FORTALECIMIENTO DE LOS AGENTES DE ESTOS SECTORES EN LAS LOCALIDADES DEL DISTRITO CAPITAL DE ACUERDO CON LOS PROYECTOS PRESENTADOS A LOS FONDOS DE DESARROLLO LOCAL QUE FORMAN PARTE DEL CONVENIO EN EL MARCO DEL PROGRAMA “ES CULTURA LOCAL 2021” ","Inversión","Un nuevo Contrato Social y ambiental para la Bogotá del Siglo XXI",6,{"$f":"IF(ISERROR(VLOOKUP(K182,[2]Proposito_programa!$C$2:$E$59,2,FALSE)),\" \",VLOOKUP(K182,[2]Proposito_programa!$C$2:$E$59,2,FALSE))","v":"Sistema Distrital de Cuidado"},{"$f":"IF(ISERROR(VLOOKUP(K182,[2]Proposito_programa!$C$2:$E$59,3,FALSE)),\" \",VLOOKUP(K182,[2]Proposito_programa!$C$2:$E$59,3,FALSE))","v":"Propósito 1: Hacer un nuevo contrato social para incrementar la inclusión social, productiva y política"},1761,1,899999061,"SECRETARIA DISTRITAL DE CULTURA RECREACION Y DEPORTE","Persona Jurídica",null,null,null,45334682,null,0,null,45334682,45334682,"2021-06-30","2021-07-07","2021-12-31","174 DÍAS",0,0,null,null,null,null,null,null,"X",null,0.35]
[170,2021,"FDLF-CD-170-2021","https://www.contratos.gov.co/consultas/detalleProceso.do?numConstancia=21-22-27218&g","Convenios de cooperacion","Contratación directa","Contratos interadministrativos","AUNAR ESFUERZOS TÉCNICOS, ADMINISTRATIVOS Y FINANCIEROS CON EL FIN DE DESARROLLAR ACCIONES ARTICULADAS ENTRE LAS PARTES ORIENTADAS A FOMENTAR LA GENERACIÓN Y CIRCULACIÓN DE BIENES Y SERVICIOS CULTURALES, ARTÍSTICOS Y PATRIMONIALES, ASÍ COMO AL FORTALECIMIENTO DE LOS AGENTES DE ESTOS SECTORES EN LAS LOCALIDADES DEL DISTRITO CAPITAL DE ACUERDO CON LOS PROYECTOS PRESENTADOS A LOS FONDOS DE DESARROLLO LOCAL QUE FORMAN PARTE DEL CONVENIO EN EL MARCO DEL PROGRAMA “ES CULTURA LOCAL 2021” ","Inversión","Un nuevo Contrato Social y ambiental para la Bogotá del Siglo XXI",21,{"$f":"IF(ISERROR(VLOOKUP(K183,[2]Proposito_programa!$C$2:$E$59,2,FALSE)),\" \",VLOOKUP(K183,[2]Proposito_programa!$C$2:$E$59,2,FALSE))","v":"Creación y vida cotidiana: Apropiación ciudadana del arte, la cultura y el patrimonio, para la democracia cultural"},{"$f":"IF(ISERROR(VLOOKUP(K183,[2]Proposito_programa!$C$2:$E$59,3,FALSE)),\" \",VLOOKUP(K183,[2]Proposito_programa!$C$2:$E$59,3,FALSE))","v":"Propósito 1: Hacer un nuevo contrato social para incrementar la inclusión social, productiva y política"},1758,1,900413030,"IDARTES","Persona Jurídica",null,null,null,520398873,null,0,null,520398873,520398873,"2021-06-30","2021-07-07","2021-12-31","174 DÍAS",0,0,null,null,null,null,null,null,"X",null,0.35]
[170,2021,"FDLF-CD-170-2021","https://www.contratos.gov.co/consultas/detalleProceso.do?numConstancia=21-22-27218&g","Convenios de cooperacion","Contratación directa","Contratos interadministrativos","AUNAR ESFUERZOS TÉCNICOS, ADMINISTRATIVOS Y FINANCIEROS CON EL FIN DE DESARROLLAR ACCIONES ARTICULADAS ENTRE LAS PARTES ORIENTADAS A FOMENTAR LA GENERACIÓN Y CIRCULACIÓN DE BIENES Y SERVICIOS CULTURALES, ARTÍSTICOS Y PATRIMONIALES, ASÍ COMO AL FORTALECIMIENTO DE LOS AGENTES DE ESTOS SECTORES EN LAS LOCALIDADES DEL DISTRITO CAPITAL DE ACUERDO CON LOS PROYECTOS PRESENTADOS A LOS FONDOS DE DESARROLLO LOCAL QUE FORMAN PARTE DEL CONVENIO EN EL MARCO DEL PROGRAMA “ES CULTURA LOCAL 2021” ","Inversión","Un nuevo Contrato Social y ambiental para la Bogotá del Siglo XXI",21,{"$f":"IF(ISERROR(VLOOKUP(K184,[2]Proposito_programa!$C$2:$E$59,2,FALSE)),\" \",VLOOKUP(K184,[2]Proposito_programa!$C$2:$E$59,2,FALSE))","v":"Creación y vida cotidiana: Apropiación ciudadana del arte, la cultura y el patrimonio, para la democracia cultural"},{"$f":"IF(ISERROR(VLOOKUP(K184,[2]Proposito_programa!$C$2:$E$59,3,FALSE)),\" \",VLOOKUP(K184,[2]Proposito_programa!$C$2:$E$59,3,FALSE))","v":"Propósito 1: Hacer un nuevo contrato social para incrementar la inclusión social, productiva y política"},1758,1,899999061,"SECRETARIA DISTRITAL DE CULTURA RECREACION Y DEPORTE","Persona Jurídica",null,null,null,26784127,null,1,296468627,{"$f":"V184+W184+Y184","v":323252754},26784127,"2021-06-30","2021-07-07","2021-12-31","174 DÍAS",0,0,null,null,null,null,null,null,"X",null,0.35]
[170,2021,"FDLF-CD-170-2021","https://www.contratos.gov.co/consultas/detalleProceso.do?numConstancia=21-22-27218&g","Convenios de cooperacion","Contratación directa","Contratos interadministrativos","AUNAR ESFUERZOS TÉCNICOS, ADMINISTRATIVOS Y FINANCIEROS CON EL FIN DE DESARROLLAR ACCIONES ARTICULADAS ENTRE LAS PARTES ORIENTADAS A FOMENTAR LA GENERACIÓN Y CIRCULACIÓN DE BIENES Y SERVICIOS CULTURALES, ARTÍSTICOS Y PATRIMONIALES, ASÍ COMO AL FORTALECIMIENTO DE LOS AGENTES DE ESTOS SECTORES EN LAS LOCALIDADES DEL DISTRITO CAPITAL DE ACUERDO CON LOS PROYECTOS PRESENTADOS A LOS FONDOS DE DESARROLLO LOCAL QUE FORMAN PARTE DEL CONVENIO EN EL MARCO DEL PROGRAMA “ES CULTURA LOCAL 2021” ","Inversión","Un nuevo Contrato Social y ambiental para la Bogotá del Siglo XXI",24,{"$f":"IF(ISERROR(VLOOKUP(K185,[2]Proposito_programa!$C$2:$E$59,2,FALSE)),\" \",VLOOKUP(K185,[2]Proposito_programa!$C$2:$E$59,2,FALSE))","v":"Bogotá región emprendedora e innovadora"},{"$f":"IF(ISERROR(VLOOKUP(K185,[2]Proposito_programa!$C$2:$E$59,3,FALSE)),\" \",VLOOKUP(K185,[2]Proposito_programa!$C$2:$E$59,3,FALSE))","v":"Propósito 1: Hacer un nuevo contrato social para incrementar la inclusión social, productiva y política"},1760,1,899999061,"SECRETARIA DISTRITAL DE CULTURA RECREACION Y DEPORTE","Persona Jurídica",null,null,null,41002163,null,0,null,41002163,41002163,"2021-06-30","2021-07-07","2021-12-31","174 DÍAS",0,0,null,null,null,null,null,null,"X",null,0.35]
[170,2021,"FDLF-CD-170-2021","https://www.contratos.gov.co/consultas/detalleProceso.do?numConstancia=21-22-27218&g","Convenios de cooperacion","Contratación directa","Contratos interadministrativos","AUNAR ESFUERZOS TÉCNICOS, ADMINISTRATIVOS Y FINANCIEROS CON EL FIN DE DESARROLLAR ACCIONES ARTICULADAS ENTRE LAS PARTES ORIENTADAS A FOMENTAR LA GENERACIÓN Y CIRCULACIÓN DE BIENES Y SERVICIOS CULTURALES, ARTÍSTICOS Y PATRIMONIALES, ASÍ COMO AL FORTALECIMIENTO DE LOS AGENTES DE ESTOS SECTORES EN LAS LOCALIDADES DEL DISTRITO CAPITAL DE ACUERDO CON LOS PROYECTOS PRESENTADOS A LOS FONDOS DE DESARROLLO LOCAL QUE FORMAN PARTE DEL CONVENIO EN EL MARCO DEL PROGRAMA “ES CULTURA LOCAL 2021” ","Inversión","Un nuevo Contrato Social y ambiental para la Bogotá del Siglo XXI",24,{"$f":"IF(ISERROR(VLOOKUP(K186,[2]Proposito_programa!$C$2:$E$59,2,FALSE)),\" \",VLOOKUP(K186,[2]Proposito_programa!$C$2:$E$59,2,FALSE))","v":"Bogotá región emprendedora e innovadora"},{"$f":"IF(ISERROR(VLOOKUP(K186,[2]Proposito_programa!$C$2:$E$59,3,FALSE)),\" \",VLOOKUP(K186,[2]Proposito_programa!$C$2:$E$59,3,FALSE))","v":"Propósito 1: Hacer un nuevo contrato social para incrementar la inclusión social, productiva y política"},1760,1,900413030,"IDARTES","Persona Jurídica",null,null,null,163079837,null,1,0,163079837,163079837,"2021-06-30","2021-07-07","2021-12-31","176 DÍAS",0,0,null,null,null,null,null,null,"X",null,0.35]
[172,2021,"FDLF-CD-172-2021","https://community.secop.gov.co/Public/Tendering/OpportunityDetail/Index?noticeUID=CO1.NTC.2077425&isFromPublicArea=True&isModal=true&asPopupView=true","Contratos de prestación de servicios profesionales y de apoyo a la gestión","Contratación directa","Prestación de servicios profesionales y de apoyo a la gestión, o para la ejecución de trabajos artísticos que sólo puedan encomendarse a determinadas personas naturales;","PRESTAR SERVICIOS PROFESIONALES PARA APOYAR EL DESARROLLO DE LAS ACTIVIDADES DE LA GESTIÓN CONTRACTUAL AL FONDO DE DESARROLLO LOCAL DE FONTIBÓN","Inversión","Un nuevo Contrato Social y ambiental para la Bogotá del Siglo XXI",57,{"$f":"IF(ISERROR(VLOOKUP(K187,[2]Proposito_programa!$C$2:$E$59,2,FALSE)),\" \",VLOOKUP(K187,[2]Proposito_programa!$C$2:$E$59,2,FALSE))","v":"Gestión pública local"},{"$f":"IF(ISERROR(VLOOKUP(K187,[2]Proposito_programa!$C$2:$E$59,3,FALSE)),\" \",VLOOKUP(K187,[2]Proposito_programa!$C$2:$E$59,3,FALSE))","v":"Propósito 5: Construir Bogotá - Región con gobierno abierto, transparente y ciudadanía consciente"},1783,1,1136886511,"ALEJANDRA GONZALEZ MAHECHA","Persona Natural","-","-",null,25293800,null,1,2325867,{"$f":"V187+Y187","v":27619667},20932800,"2021-07-06","2021-07-07","2022-01-15","174 DÍAS",1,16,null,null,null,null,null,null,"X",null,0.76]
[173,2021,"FDLF-CD-173-2021","https://community.secop.gov.co/Public/Tendering/OpportunityDetail/Index?noticeUID=CO1.NTC.2086176&isFromPublicArea=True&isModal=true&asPopupView=true","Contratos de prestación de servicios profesionales y de apoyo a la gestión","Contratación directa","Prestación de servicios profesionales y de apoyo a la gestión, o para la ejecución de trabajos artísticos que sólo puedan encomendarse a determinadas personas naturales;","PRESTAR SERVICIOS DE APOYO EN LAS ACTIVIDADES DE SEGURIDAD Y CONVIVENCIA CIUDADANA, DE ACUERDO CON LAS NECESIDADES Y ESTRATEGIAS EMANADAS POR EL ÁREA DE GESTIÓN DEL DESARROLLO LOCAL, DE LA ALCALDÍA LOCAL DE FONTIBÓN.","Inversión","Un nuevo Contrato Social y ambiental para la Bogotá del Siglo XXI",43,{"$f":"IF(ISERROR(VLOOKUP(K188,[2]Proposito_programa!$C$2:$E$59,2,FALSE)),\" \",VLOOKUP(K188,[2]Proposito_programa!$C$2:$E$59,2,FALSE))","v":"Cultura ciudadana para la confianza, la convivencia y la participación desde la vida cotidiana"},{"$f":"IF(ISERROR(VLOOKUP(K188,[2]Proposito_programa!$C$2:$E$59,3,FALSE)),\" \",VLOOKUP(K188,[2]Proposito_programa!$C$2:$E$59,3,FALSE))","v":"Propósito 3: Inspirar confianza y legitimidad para vivir sin miedo y ser epicentro de cultura ciudadana, paz y reconciliación"},1775,1,1016063794,"CHRISTIAN VESGA GONZALEZ","Persona Natural","-","-",null,13710914,null,0,0,{"$f":"V188+Y188","v":13710914},11195894,"2021-07-09","2021-07-13","2021-12-30","169 DÍAS",0,0,null,null,null,null,null,null,"X",null,0.82]
[174,2021,"FDLF-CD-174-2021","https://community.secop.gov.co/Public/Tendering/OpportunityDetail/Index?noticeUID=CO1.NTC.2085881&isFromPublicArea=True&isModal=true&asPopupView=true","Contratos de prestación de servicios profesionales y de apoyo a la gestión","Contratación directa","Prestación de servicios profesionales y de apoyo a la gestión, o para la ejecución de trabajos artísticos que sólo puedan encomendarse a determinadas personas naturales;","PRESTAR SERVICIOS DE APOYO AL ÁREA DE GESTIÓN DEL DESARROLLO LOCAL DE LA ALCALDÍA LOCAL DE FONTIBÓN.","Inversión","Un nuevo Contrato Social y ambiental para la Bogotá del Siglo XXI",57,{"$f":"IF(ISERROR(VLOOKUP(K189,[2]Proposito_programa!$C$2:$E$59,2,FALSE)),\" \",VLOOKUP(K189,[2]Proposito_programa!$C$2:$E$59,2,FALSE))","v":"Gestión pública local"},{"$f":"IF(ISERROR(VLOOKUP(K189,[2]Proposito_programa!$C$2:$E$59,3,FALSE)),\" \",VLOOKUP(K189,[2]Proposito_programa!$C$2:$E$59,3,FALSE))","v":"Propósito 5: Construir Bogotá - Región con gobierno abierto, transparente y ciudadanía consciente"},1783,1,19339968,"NORBERTO HERREÑO VELASQUEZ","Persona Natural","-","-",null,4867780,null,0,0,{"$f":"V189+Y189","v":4867780}," $                          -  ","2021-07-09","2021-07-12","2021-09-11","60 DÍAS",0,0,null,null,null,null,null,null,"X",null,0]
[175,2021,"FDLF-CD-175-2021","https://community.secop.gov.co/Public/Tendering/OpportunityDetail/Index?noticeUID=CO1.NTC.2086296&isFromPublicArea=True&isModal=true&asPopupView=true","Contratos de prestación de servicios profesionales y de apoyo a la gestión","Contratación directa","Prestación de servicios profesionales y de apoyo a la gestión, o para la ejecución de trabajos artísticos que sólo puedan encomendarse a determinadas personas naturales;","PRESTAR SERVICIOS DE APOYO AL ÁREA DE GESTIÓN DEL DESARROLLO LOCAL DE LA ALCALDÍA LOCAL DE FONTIBÓN.","Inversión","Un nuevo Contrato Social y ambiental para la Bogotá del Siglo XXI",57,{"$f":"IF(ISERROR(VLOOKUP(K190,[2]Proposito_programa!$C$2:$E$59,2,FALSE)),\" \",VLOOKUP(K190,[2]Proposito_programa!$C$2:$E$59,2,FALSE))","v":"Gestión pública local"},{"$f":"IF(ISERROR(VLOOKUP(K190,[2]Proposito_programa!$C$2:$E$59,3,FALSE)),\" \",VLOOKUP(K190,[2]Proposito_programa!$C$2:$E$59,3,FALSE))","v":"Propósito 5: Construir Bogotá - Región con gobierno abierto, transparente y ciudadanía consciente"},1783,1,79120980,"JOHN FREDY ABELINO QUIROGA","Persona Natural","-","-",null,4867780,null,0,0,{"$f":"V190+Y190","v":4867780}," $                          -  ","2021-07-09","2021-07-13","2021-09-12","60 DÍAS",0,0,null,null,null,null,null,null,"X",null,0]
[176,2021,"FDLF-CD-176-2021","https://community.secop.gov.co/Public/Tendering/OpportunityDetail/Index?noticeUID=CO1.NTC.2090506&isFromPublicArea=True&isModal=true&asPopupView=true","Contratos de prestación de servicios profesionales y de apoyo a la gestión","Contratación directa","Prestación de servicios profesionales y de apoyo a la gestión, o para la ejecución de trabajos artísticos que sólo puedan encomendarse a determinadas personas naturales;","PRESTAR SERVICIOS DE APOYO EN LAS ACTIVIDADES DE SEGURIDAD Y CONVIVENCIA CIUDADANA, DE ACUERDO CON LAS NECESIDADES Y ESTRATEGIAS EMANADAS POR EL ÁREA DE GESTIÓN DEL DESARROLLO LOCAL, DE LA ALCALDÍA LOCAL DE FONTIBÓN.","Inversión","Un nuevo Contrato Social y ambiental para la Bogotá del Siglo XXI",43,{"$f":"IF(ISERROR(VLOOKUP(K191,[2]Proposito_programa!$C$2:$E$59,2,FALSE)),\" \",VLOOKUP(K191,[2]Proposito_programa!$C$2:$E$59,2,FALSE))","v":"Cultura ciudadana para la confianza, la convivencia y la participación desde la vida cotidiana"},{"$f":"IF(ISERROR(VLOOKUP(K191,[2]Proposito_programa!$C$2:$E$59,3,FALSE)),\" \",VLOOKUP(K191,[2]Proposito_programa!$C$2:$E$59,3,FALSE))","v":"Propósito 3: Inspirar confianza y legitimidad para vivir sin miedo y ser epicentro de cultura ciudadana, paz y reconciliación"},1775,1,80015021,"LUIS CARLOS ABADIA ALVARADO","Persona Natural","-","-",null,13710914,null,0,0,{"$f":"V191+Y191","v":13710914},11033635,"2021-07-12","2021-07-15","2022-01-02","169 DÍAS",0,0,null,null,null,null,null,null,"X",null,0.8]
[177,2021,"FDLF-CD-177-2021","https://community.secop.gov.co/Public/Tendering/OpportunityDetail/Index?noticeUID=CO1.NTC.2091714&isFromPublicArea=True&isModal=true&asPopupView=true","Contratos de prestación de servicios profesionales y de apoyo a la gestión","Contratación directa","Prestación de servicios profesionales y de apoyo a la gestión, o para la ejecución de trabajos artísticos que sólo puedan encomendarse a determinadas personas naturales;","PRESTAR SERVICIOS DE APOYO EN LAS ACTIVIDADES DE SEGURIDAD Y CONVIVENCIA CIUDADANA, DE ACUERDO CON LAS NECESIDADES Y ESTRATEGIAS EMANADAS POR EL ÁREA DE GESTIÓN DE DESARROLLO LOCAL DE LA ALCALDÍA LOCAL DE FONTIBÓN.","Inversión","Un nuevo Contrato Social y ambiental para la Bogotá del Siglo XXI",43,{"$f":"IF(ISERROR(VLOOKUP(K192,[2]Proposito_programa!$C$2:$E$59,2,FALSE)),\" \",VLOOKUP(K192,[2]Proposito_programa!$C$2:$E$59,2,FALSE))","v":"Cultura ciudadana para la confianza, la convivencia y la participación desde la vida cotidiana"},{"$f":"IF(ISERROR(VLOOKUP(K192,[2]Proposito_programa!$C$2:$E$59,3,FALSE)),\" \",VLOOKUP(K192,[2]Proposito_programa!$C$2:$E$59,3,FALSE))","v":"Propósito 3: Inspirar confianza y legitimidad para vivir sin miedo y ser epicentro de cultura ciudadana, paz y reconciliación"},1775,1,52813244,"DIANA JULIETH SANCHEZ SUAREZ","Persona Natural","-","-",null,13548654,null,0,0,13548654,11114764,"2021-07-12","2021-07-14","2021-12-30","167 DÍAS",0,0,null,null,null,null,null,null,"X",null,0.82]
[178,2021,"FDLF-CD-178-2021","https://community.secop.gov.co/Public/Tendering/OpportunityDetail/Index?noticeUID=CO1.NTC.2102467&isFromPublicArea=True&isModal=true&asPopupView=true","Contratos de prestación de servicios profesionales y de apoyo a la gestión","Contratación directa","Prestación de servicios profesionales y de apoyo a la gestión, o para la ejecución de trabajos artísticos que sólo puedan encomendarse a determinadas personas naturales;","PRESTAR SERVICIOS PARA APOYAR JURÍDICAMENTE LA EJECUCIÓN DE LAS ACCIONES REQUERIDAS PARA LA DEPURACIÓN DE LAS ACTUACIONES ADMINISTRATIVAS QUE CURSAN EN LA ALCALDÍA LOCAL DE FONTIBÓN.","Inversión","Un nuevo Contrato Social y ambiental para la Bogotá del Siglo XXI",57,{"$f":"IF(ISERROR(VLOOKUP(K193,[2]Proposito_programa!$C$2:$E$59,2,FALSE)),\" \",VLOOKUP(K193,[2]Proposito_programa!$C$2:$E$59,2,FALSE))","v":"Gestión pública local"},{"$f":"IF(ISERROR(VLOOKUP(K193,[2]Proposito_programa!$C$2:$E$59,3,FALSE)),\" \",VLOOKUP(K193,[2]Proposito_programa!$C$2:$E$59,3,FALSE))","v":"Propósito 5: Construir Bogotá - Región con gobierno abierto, transparente y ciudadanía consciente"},1784,1,1016053840,"EVELYN LORENA GOMEZ ORTIZ","Persona Natural","-","-",null,27483500,null,0,0,{"$f":"Y193+V193+W193","v":27483500},7495500,"2021-07-15","2021-07-16","2021-12-30","165 DÍAS",0,0,null,null,null,null,null,null,"X",null,0.66]
[179,2021,"FDLF-CD-0179-2021","https://community.secop.gov.co/Public/Tendering/OpportunityDetail/Index?noticeUID=CO1.NTC.2104696&isFromPublicArea=True&isModal=true&asPopupView=true","Convenios de cooperacion","Contratación directa","Contratos interadministrativos","AUNAR ESFUERZOS TÉCNICOS, ADMINISTRATIVOS, LOGÍSTICOS Y FINANCIEROS ENTRE EL FONDO DE DESARROLLO LOCAL DE FONTIBÓN Y LA ORQUESTA FILARMÓNICA DE BOGOTÁ, QUE PERMITAN LA CONTINUIDAD Y DESARROLLO DEL CENTRO FILARMÓNICO LOCAL, COMO UN ESPACIO PARA EL PROCESO DE FORMACIÓN MUSICAL IMPLEMENTADO POR LA ORQUESTA Y DIRIGIDO A LA LOCALIDAD","Inversión","Un nuevo Contrato Social y ambiental para la Bogotá del Siglo XXI",21,{"$f":"IF(ISERROR(VLOOKUP(K194,[2]Proposito_programa!$C$2:$E$59,2,FALSE)),\" \",VLOOKUP(K194,[2]Proposito_programa!$C$2:$E$59,2,FALSE))","v":"Creación y vida cotidiana: Apropiación ciudadana del arte, la cultura y el patrimonio, para la democracia cultural"},{"$f":"IF(ISERROR(VLOOKUP(K194,[2]Proposito_programa!$C$2:$E$59,3,FALSE)),\" \",VLOOKUP(K194,[2]Proposito_programa!$C$2:$E$59,3,FALSE))","v":"Propósito 1: Hacer un nuevo contrato social para incrementar la inclusión social, productiva y política"},1758,1,899999282,"ORQUESTA FILARMÓNICA DE BOGOTÁ","Persona Jurídica","-","-",null,0,null,0,0,0," $                          -  ","2021-07-16","2021-07-19","2022-10-31","305 DÍAS",0,0,null,null,null,null,null,"X",null,null,0]
[180,2021,"FDLF-CD-180-2021","https://community.secop.gov.co/Public/Tendering/OpportunityDetail/Index?noticeUID=CO1.NTC.2097775&isFromPublicArea=True&isModal=true&asPopupView=true","Contratos de prestación de servicios profesionales y de apoyo a la gestión","Contratación directa","Prestación de servicios profesionales y de apoyo a la gestión, o para la ejecución de trabajos artísticos que sólo puedan encomendarse a determinadas personas naturales;","PRESTAR SERVICIOS DE APOYO TÉCNICO AL ÁREA DE GESTIÓN DE DESARROLLO LOCAL DE FONTIBÓN COMO MONITOR DEPORTIVO PARA LA FORMACIÓN DE LAS ESCUELAS DEPORTIVAS DE FONTIBÓN","Inversión","Un nuevo Contrato Social y ambiental para la Bogotá del Siglo XXI",20,{"$f":"IF(ISERROR(VLOOKUP(K195,[2]Proposito_programa!$C$2:$E$59,2,FALSE)),\" \",VLOOKUP(K195,[2]Proposito_programa!$C$2:$E$59,2,FALSE))","v":"Bogotá, referente en cultura, deporte, recreación y actividad física, con parques para el desarrollo y la salud"},{"$f":"IF(ISERROR(VLOOKUP(K195,[2]Proposito_programa!$C$2:$E$59,3,FALSE)),\" \",VLOOKUP(K195,[2]Proposito_programa!$C$2:$E$59,3,FALSE))","v":"Propósito 1: Hacer un nuevo contrato social para incrementar la inclusión social, productiva y política"},1757,1,1013644299,"WILLIAM JAVIER REYES RUGELES","Persona Natural","-","-",null,13219250,null,1,2996363,16215613,9253475,"2021-07-14","2021-07-16","2022-01-19","152 DÍAS",1,34,null,null,null,null,null,null,"X",null,0.56999999999999995]
[181,2021,"FDLF-CCI-181-2021","https://community.secop.gov.co/Public/Tendering/OpportunityDetail/Index?noticeUID=CO1.NTC.2102708&isFromPublicArea=True&isModal=False","Convenios de cooperacion","Régimen especial","Contratos interadministrativos","AUNAR ESFUERZOS PARA LA COOPERACIÓN ADMINISTRATIVA, TÉCNICA Y ECONÓMICA, ENTRE EL PROGRAMA PARA LAS NACIONES UNIDAS PARA EL DESARROLLO (PNUD) Y EL FONDO DE DESARROLLO LOCAL DE FONTIBÓN, CON EL FIN DE IMPLEMENTAR ESTRATEGIAS QUE PROMUEVAN EL FORTALECIMIENTO A LOS EMPRENDIMIENTOS DE LA ECONOMÍA POPULAR DE LA LOCALIDAD DE FONTIBÓN Y LAS UNIDADES PRODUCTIVAS FAMILIARES Y/O POBLACIONES DEDICADAS A ACTIVIDADES TRADICIONALES QUE PERMITEN GENERAR INGRESOS (AUTOEMPLEO), Y EL FORTALECIMIENTO DE MIPYMES LOCALES, A TRAVÉS DE UN PROCESO DE ACOMPAÑAMIENTO ESPECIALIZADO QUE PERMITA EL MEJORAMIENTO DE LAS COMPETENCIAS DE LOS EMPRESARIOS Y LAS CONDICIONES DE SUS NEGOCIOS Y DE ESTA FORMA APORTAR DE FORMA SIGNIFICATIVA AL CUMPLIMIENTO DE LA AGENDA DE REACTIVACIÓN ECONÓMICA EN LA LOCALIDAD, PARA EL DESARROLLO DE RUTA 1 – EMPRENDIMIENTO LOCAL Y LA RUTA 2  - FORTALECIMIENTO EMPRESARIAL POR EL FDLF.","Inversión","Un nuevo Contrato Social y ambiental para la Bogotá del Siglo XXI",6,{"$f":"IF(ISERROR(VLOOKUP(K196,[2]Proposito_programa!$C$2:$E$59,2,FALSE)),\" \",VLOOKUP(K196,[2]Proposito_programa!$C$2:$E$59,2,FALSE))","v":"Sistema Distrital de Cuidado"},{"$f":"IF(ISERROR(VLOOKUP(K196,[2]Proposito_programa!$C$2:$E$59,3,FALSE)),\" \",VLOOKUP(K196,[2]Proposito_programa!$C$2:$E$59,3,FALSE))","v":"Propósito 1: Hacer un nuevo contrato social para incrementar la inclusión social, productiva y política"},1761,1,800091076,"PROGRAMA DE LAS NACIONES UNIDAS PARA EL DESARROLLO","Persona Jurídica","-","-",null,911990800,null,0,0,911990800,729592640,"2021-07-15","2021-07-16","2022-05-30","319 DÍAS",0,0,null,null,null,null,null,"X",null,null,0]
[182,2021,"FDLF-CD-182-2021","https://community.secop.gov.co/Public/Tendering/OpportunityDetail/Index?noticeUID=CO1.NTC.2110564&isFromPublicArea=True&isModal=true&asPopupView=true","Contratos de prestación de servicios profesionales y de apoyo a la gestión","Contratación directa","Prestación de servicios profesionales y de apoyo a la gestión, o para la ejecución de trabajos artísticos que sólo puedan encomendarse a determinadas personas naturales;","PRESTAR SERVICIOS PARA APOYAR JURÍDICAMENTE LA EJECUCIÓN DE LAS ACCIONES REQUERIDAS PARA LA DEPURACIÓN DE LAS ACTUACIONES ADMINISTRATIVAS QUE CURSAN EN LA ALCALDÍA LOCAL DE FONTIBÓN","Inversión","Un nuevo Contrato Social y ambiental para la Bogotá del Siglo XXI",57,{"$f":"IF(ISERROR(VLOOKUP(K197,[2]Proposito_programa!$C$2:$E$59,2,FALSE)),\" \",VLOOKUP(K197,[2]Proposito_programa!$C$2:$E$59,2,FALSE))","v":"Gestión pública local"},{"$f":"IF(ISERROR(VLOOKUP(K197,[2]Proposito_programa!$C$2:$E$59,3,FALSE)),\" \",VLOOKUP(K197,[2]Proposito_programa!$C$2:$E$59,3,FALSE))","v":"Propósito 5: Construir Bogotá - Región con gobierno abierto, transparente y ciudadanía consciente"},1784,1,79572785,"JORGE ARMANDO SUAREZ MEDINA","Persona Natural","-","-",null,26650666,null,0,0,26650666,21487100,"2021-07-19","2021-07-22","2021-12-30","160 DÍAS",0,0,null,null,null,null,null,null,"X",null,0.37]
[183,2021,"FDLF-CD-183-2021","https://community.secop.gov.co/Public/Tendering/OpportunityDetail/Index?noticeUID=CO1.NTC.2110704&isFromPublicArea=True&isModal=true&asPopupView=true","Contratos de prestación de servicios profesionales y de apoyo a la gestión","Contratación directa","Prestación de servicios profesionales y de apoyo a la gestión, o para la ejecución de trabajos artísticos que sólo puedan encomendarse a determinadas personas naturales;","PRESTAR SERVICIOS PARA APOYAR JURÍDICAMENTE LA EJECUCIÓN DE LAS ACCIONES REQUERIDAS PARA LA DEPURACIÓN DE LAS ACTUACIONES ADMINISTRATIVAS QUE CURSAN EN LA ALCALDÍA LOCAL DE FONTIBÓN","Inversión","Un nuevo Contrato Social y ambiental para la Bogotá del Siglo XXI",57,{"$f":"IF(ISERROR(VLOOKUP(K198,[2]Proposito_programa!$C$2:$E$59,2,FALSE)),\" \",VLOOKUP(K198,[2]Proposito_programa!$C$2:$E$59,2,FALSE))","v":"Gestión pública local"},{"$f":"IF(ISERROR(VLOOKUP(K198,[2]Proposito_programa!$C$2:$E$59,3,FALSE)),\" \",VLOOKUP(K198,[2]Proposito_programa!$C$2:$E$59,3,FALSE))","v":"Propósito 5: Construir Bogotá - Región con gobierno abierto, transparente y ciudadanía consciente"},1784,1,1077436601,"MANUEL FERLEY MATURANA MENA","Persona Natural","-","-",null,26650666,null,0,0,26650666,21487100,"2021-07-19","2021-07-22","2021-12-30","160 DÍAS",0,0,null,null,null,null,null,null,"X",null,0.81]
[184,2021,"FDLF-CD-184-2021","https://community.secop.gov.co/Public/Tendering/OpportunityDetail/Index?noticeUID=CO1.NTC.2115447&isFromPublicArea=True&isModal=true&asPopupView=true","Contratos de prestación de servicios profesionales y de apoyo a la gestión","Contratación directa","Prestación de servicios profesionales y de apoyo a la gestión, o para la ejecución de trabajos artísticos que sólo puedan encomendarse a determinadas personas naturales;","PRESTAR SERVICIOS PROFESIONALES PARA APOYAR EL ÁREA DE GESTIÓN DE DESARROLLO LOCAL EN TEMAS PRECONTRACTUALES DE LOS PROYECTOS DE INVERSIÓN DEL FONDO DE DESARROLLO LOCAL DE FONTIBÓN.","Inversión","Un nuevo Contrato Social y ambiental para la Bogotá del Siglo XXI",57,{"$f":"IF(ISERROR(VLOOKUP(K199,[2]Proposito_programa!$C$2:$E$59,2,FALSE)),\" \",VLOOKUP(K199,[2]Proposito_programa!$C$2:$E$59,2,FALSE))","v":"Gestión pública local"},{"$f":"IF(ISERROR(VLOOKUP(K199,[2]Proposito_programa!$C$2:$E$59,3,FALSE)),\" \",VLOOKUP(K199,[2]Proposito_programa!$C$2:$E$59,3,FALSE))","v":"Propósito 5: Construir Bogotá - Región con gobierno abierto, transparente y ciudadanía consciente"},1783,1,41795474,"FLOR MERY CONEJO RODRIGUEZ","Persona Natural","-","-",null,22588800,null,0,0,22588800,18170833,"2021-07-26","2021-07-26","2021-12-30","155 DÍAS",0,0,null,null,null,null,null,null,"X",null,0.8]
[185,2021,"FDLF-CD-185-2021","https://community.secop.gov.co/Public/Tendering/OpportunityDetail/Index?noticeUID=CO1.NTC.2125198&isFromPublicArea=True&isModal=true&asPopupView=true","Contratos de prestación de servicios profesionales y de apoyo a la gestión","Contratación directa","Prestación de servicios profesionales y de apoyo a la gestión, o para la ejecución de trabajos artísticos que sólo puedan encomendarse a determinadas personas naturales;","PRESTAR SERVICIOS PARA APOYAR JURÍDICAMENTE LA EJECUCIÓN DE LAS ACCIONES REQUERIDAS PARA LA DEPURACIÓN DE LAS ACTUACIONES ADMINISTRATIVAS QUE CURSAN EN LA ALCALDÍA LOCAL DE FONTIBÓN.","Inversión","Un nuevo Contrato Social y ambiental para la Bogotá del Siglo XXI",57,{"$f":"IF(ISERROR(VLOOKUP(K200,[2]Proposito_programa!$C$2:$E$59,2,FALSE)),\" \",VLOOKUP(K200,[2]Proposito_programa!$C$2:$E$59,2,FALSE))","v":"Gestión pública local"},{"$f":"IF(ISERROR(VLOOKUP(K200,[2]Proposito_programa!$C$2:$E$59,3,FALSE)),\" \",VLOOKUP(K200,[2]Proposito_programa!$C$2:$E$59,3,FALSE))","v":"Propósito 5: Construir Bogotá - Región con gobierno abierto, transparente y ciudadanía consciente"},1784,1,1032454002,"DANIEL RICARDO GONZALEZ RODRIGUEZ","Persona Natural","-","-",null,25651266,null,0,0,25651266,20487700,"2021-07-26","2021-07-28","2021-12-27","150 DÍAS",0,0,null,null,null,null,null,null,"X",null,0.38]
[186,2021,"FDLF-CD-186-2021","https://community.secop.gov.co/Public/Tendering/OpportunityDetail/Index?noticeUID=CO1.NTC.2131377&isFromPublicArea=True&isModal=true&asPopupView=true","Contratos de prestación de servicios profesionales y de apoyo a la gestión","Contratación directa","Prestación de servicios profesionales y de apoyo a la gestión, o para la ejecución de trabajos artísticos que sólo puedan encomendarse a determinadas personas naturales;","PRESTAR SERVICIOS PROFESIONALES DE APOYO AL ÁREA DE GESTIÓN DE DESARROLLO LOCAL EN LO REFERENTE A CONSTRUIR PAZ Y RECONCILIACIÓN EN LA LOCALIDAD DE FONTIBÓN.","Inversión","Un nuevo Contrato Social y ambiental para la Bogotá del Siglo XXI",39,{"$f":"IF(ISERROR(VLOOKUP(K201,[2]Proposito_programa!$C$2:$E$59,2,FALSE)),\" \",VLOOKUP(K201,[2]Proposito_programa!$C$2:$E$59,2,FALSE))","v":"Bogotá territorio de paz y atención integral a las víctimas del conflicto armado"},{"$f":"IF(ISERROR(VLOOKUP(K201,[2]Proposito_programa!$C$2:$E$59,3,FALSE)),\" \",VLOOKUP(K201,[2]Proposito_programa!$C$2:$E$59,3,FALSE))","v":"Propósito 3: Inspirar confianza y legitimidad para vivir sin miedo y ser epicentro de cultura ciudadana, paz y reconciliación"},1773,1,1010238403,"JUANITA GIRALDO SALGADO","Persona Natural","-","-",null,21659633,null,0,0,21659633,8576633,"2021-07-29","2021-08-02","2021-12-30","149 DÍAS",0,0,null,null,null,null,null,null,"X",null,0.4]
[187,2021,"FDLF-CD-187-2021","https://community.secop.gov.co/Public/Tendering/OpportunityDetail/Index?noticeUID=CO1.NTC.2148769&isFromPublicArea=True&isModal=true&asPopupView=true","Contratos de prestación de servicios profesionales y de apoyo a la gestión","Contratación directa","Prestación de servicios profesionales y de apoyo a la gestión, o para la ejecución de trabajos artísticos que sólo puedan encomendarse a determinadas personas naturales;","PRESTAR SERVICIOS COMO PROFESIONAL ESPECIALIZADO PARA APOYAR EL ÁREA DE GESTIÓN DE DESARROLLO LOCAL DE FONTIBÓN PARA EL DESARROLLO DEL PROYECTO DE BUEN TRATO EN LOS COMPONENTES DE ORIENTACIÓN, ASESORÍA FAMILIAR, POSICIONAMIENTO Y PROMOCIÓN DEL BUEN TRATO.","Inversión","Un nuevo Contrato Social y ambiental para la Bogotá del Siglo XXI",6,{"$f":"IF(ISERROR(VLOOKUP(K202,[2]Proposito_programa!$C$2:$E$59,2,FALSE)),\" \",VLOOKUP(K202,[2]Proposito_programa!$C$2:$E$59,2,FALSE))","v":"Sistema Distrital de Cuidado"},{"$f":"IF(ISERROR(VLOOKUP(K202,[2]Proposito_programa!$C$2:$E$59,3,FALSE)),\" \",VLOOKUP(K202,[2]Proposito_programa!$C$2:$E$59,3,FALSE))","v":"Propósito 1: Hacer un nuevo contrato social para incrementar la inclusión social, productiva y política"},1762,1,1024536022,"MARIA ALEJANDRA GARZON AUDOR","Persona Natural","-","-",null,33161466,null,1,5905467,39066933,26347467,"2021-08-04","2021-08-05","2021-12-30","146 DÍAS",1,26,null,null,null,null,null,null,"X",null,0.67]
[188,2021,"FDLF-CD-188-2021","https://community.secop.gov.co/Public/Tendering/OpportunityDetail/Index?noticeUID=CO1.NTC.2152204&isFromPublicArea=True&isModal=true&asPopupView=true","Contratos de prestación de servicios profesionales y de apoyo a la gestión","Contratación directa","Prestación de servicios profesionales y de apoyo a la gestión, o para la ejecución de trabajos artísticos que sólo puedan encomendarse a determinadas personas naturales;","PRESTAR SERVICIOS PROFESIONALES PARA GARANTIZAR LA PARTICIPACIÓN CIUDADANA ANTES, DURANTE Y DESPUÉS DE LA PLANTACIÓN EN EL MARCO DEL PROYECTO DE ARBORIZACIÓN DE LA LOCALIDAD DE FONTIBÓN.","Inversión","Un nuevo Contrato Social y ambiental para la Bogotá del Siglo XXI",33,{"$f":"IF(ISERROR(VLOOKUP(K203,[2]Proposito_programa!$C$2:$E$59,2,FALSE)),\" \",VLOOKUP(K203,[2]Proposito_programa!$C$2:$E$59,2,FALSE))","v":"Más árboles y más y mejor espacio público"},{"$f":"IF(ISERROR(VLOOKUP(K203,[2]Proposito_programa!$C$2:$E$59,3,FALSE)),\" \",VLOOKUP(K203,[2]Proposito_programa!$C$2:$E$59,3,FALSE))","v":"Propósito 2 : Cambiar Nuestros Hábitos de Vida para Reverdecer a Bogotá y Adaptarnos y Mitigar la Crisis Climática"},1769,1,1016087435,"DANIELA SANCHEZ PEREZ","Persona Natural","-","-",null,20642066,null,0,0,20642066,16281067,"2021-08-05","2021-08-09","2021-12-30","142 DÍAS",0,0,null,null,null,null,null,null,"X",null,0.79]
[189,2021,"FDLF-CD-189-2021","https://community.secop.gov.co/Public/Tendering/OpportunityDetail/Index?noticeUID=CO1.NTC.2155210&isFromPublicArea=True&isModal=true&asPopupView=true","Contratos de prestación de servicios profesionales y de apoyo a la gestión","Contratación directa","Prestación de servicios profesionales y de apoyo a la gestión, o para la ejecución de trabajos artísticos que sólo puedan encomendarse a determinadas personas naturales;","PRESTAR SERVICIOS PROFESIONALES PARA APOYAR LA EJECUCIÓN DE LAS FASES Y ACTIVIDADES DEL PROYECTO 1759 UN NUEVO CONTRATO PARA EL FOMENTO DE LA AGRICULTURA URBANA EN FONTIBÓN.","Inversión","Un nuevo Contrato Social y ambiental para la Bogotá del Siglo XXI",24,{"$f":"IF(ISERROR(VLOOKUP(K204,[2]Proposito_programa!$C$2:$E$59,2,FALSE)),\" \",VLOOKUP(K204,[2]Proposito_programa!$C$2:$E$59,2,FALSE))","v":"Bogotá región emprendedora e innovadora"},{"$f":"IF(ISERROR(VLOOKUP(K204,[2]Proposito_programa!$C$2:$E$59,3,FALSE)),\" \",VLOOKUP(K204,[2]Proposito_programa!$C$2:$E$59,3,FALSE))","v":"Propósito 1: Hacer un nuevo contrato social para incrementar la inclusión social, productiva y política"},1759,1,1016067438,"JEISSON STIVEN TELLEZ PEÑA","Persona Natural","-","-",null,20642067,null,0,0,20642067,16281067,"2021-08-06","2021-08-09","2021-12-30","142 DÍAS",0,0,null,null,null,null,null,null,"X",null,0.79]
[190,2021,"FDLF-CD-190-2021","https://community.secop.gov.co/Public/Tendering/OpportunityDetail/Index?noticeUID=CO1.NTC.2154100&isFromPublicArea=True&isModal=true&asPopupView=true","Contratos de prestación de servicios profesionales y de apoyo a la gestión","Contratación directa","Prestación de servicios profesionales y de apoyo a la gestión, o para la ejecución de trabajos artísticos que sólo puedan encomendarse a determinadas personas naturales;","PRESTAR SERVICIOS PROFESIONALES DE APOYO EN EL ÁREA DE GESTIÓN DE DESARROLLO LOCAL DE FONTIBÓN PARA LA FORMULACIÓN Y APLICACIÓN DE UNA METODOLOGÍA DE CAPACITACIÓN PARA LA ESCUELA DE PARTICIPACIÓN DIRIGIDA A LÍDERES COMUNITARIOS Y COMUNALES, CUMPLIENDO CON LA META 'CAPACITAR 177 PERSONAS A TRAVÉS DE PROCESOS DE FORMACIÓN PARA LA PARTICIPACIÓN DE MANERA VIRTUAL DURANTE LA VIGENCIA 2021'","Inversión","Un nuevo Contrato Social y ambiental para la Bogotá del Siglo XXI",55,{"$f":"IF(ISERROR(VLOOKUP(K205,[2]Proposito_programa!$C$2:$E$59,2,FALSE)),\" \",VLOOKUP(K205,[2]Proposito_programa!$C$2:$E$59,2,FALSE))","v":"Fortalecimiento de cultura ciudadana y su institucionalidad"},{"$f":"IF(ISERROR(VLOOKUP(K205,[2]Proposito_programa!$C$2:$E$59,3,FALSE)),\" \",VLOOKUP(K205,[2]Proposito_programa!$C$2:$E$59,3,FALSE))","v":"Propósito 5: Construir Bogotá - Región con gobierno abierto, transparente y ciudadanía consciente"},1782,1,1015414488,"HECTOR FREDDY PRIETO MORENO","Persona Natural","-","-",null,20642066,null,0,0,20642066," $                          -  ","2021-08-06","2021-08-10","2021-12-30","142 DÍAS",0,0,30741785,"FLOR DELY OCAMPO","2021-11-04",8576637,null,null,"X",null,0]
[191,2021,"FDLF-CD-191-2021","https://community.secop.gov.co/Public/Tendering/OpportunityDetail/Index?noticeUID=CO1.NTC.2155029&isFromPublicArea=True&isModal=true&asPopupView=true","Contratos de prestación de servicios profesionales y de apoyo a la gestión","Contratación directa","Prestación de servicios profesionales y de apoyo a la gestión, o para la ejecución de trabajos artísticos que sólo puedan encomendarse a determinadas personas naturales;","PRESTAR SERVICIOS PROFESIONALES PARA APOYAR EL ÁREA DE GESTIÓN DE DESARROLLO LOCAL DE FONTIBÓN EN ASUNTOS RELACIONADOS CON LA CONVIVENCIA CIUDADANA, EL ACCESO A LA JUSTICIA INTEGRAL Y LA PREVENCIÓN DE CONFLICTOS TERRITORIALES, EN EL MARCO DEL PROYECTO DE INVERSIÓN 2007.","Inversión","Un nuevo Contrato Social y ambiental para la Bogotá del Siglo XXI",48,{"$f":"IF(ISERROR(VLOOKUP(K206,[2]Proposito_programa!$C$2:$E$59,2,FALSE)),\" \",VLOOKUP(K206,[2]Proposito_programa!$C$2:$E$59,2,FALSE))","v":"Plataforma institucional para la seguridad y justicia"},{"$f":"IF(ISERROR(VLOOKUP(K206,[2]Proposito_programa!$C$2:$E$59,3,FALSE)),\" \",VLOOKUP(K206,[2]Proposito_programa!$C$2:$E$59,3,FALSE))","v":"Propósito 3: Inspirar confianza y legitimidad para vivir sin miedo y ser epicentro de cultura ciudadana, paz y reconciliación"},2007,1,52783302,"CLAUDIA PATRICIA VILLAMIZAR ALCALÁ","Persona Natural","-","-",null,31960000,null,0,0,31960000,11560000,"2021-08-09","2021-08-10","2021-12-30","141 DÍAS",0,0,null,null,null,null,null,null,"X",null,0.36]
[192,2021,"FDLF-CD-192-2021","https://community.secop.gov.co/Public/Tendering/OpportunityDetail/Index?noticeUID=CO1.NTC.2161278&isFromPublicArea=True&isModal=true&asPopupView=true","Contratos de prestación de servicios profesionales y de apoyo a la gestión","Contratación directa","Prestación de servicios profesionales y de apoyo a la gestión, o para la ejecución de trabajos artísticos que sólo puedan encomendarse a determinadas personas naturales;","PRESTAR SERVICIOS PROFESIONALES PARA APOYAR EL ÁREA DE GESTIÓN DE DESARROLLO LOCAL DE FONTIBÓN EN ASUNTOS RELACIONADOS CON LA CONVIVENCIA CIUDADANA, EL ACCESO A LA JUSTICIA INTEGRAL Y LA PREVENCIÓN DE CONFLICTOS TERRITORIALES, EN EL MARCO DEL PROYECTO DE INVERSIÓN 2007.","Inversión","Un nuevo Contrato Social y ambiental para la Bogotá del Siglo XXI",48,{"$f":"IF(ISERROR(VLOOKUP(K207,[2]Proposito_programa!$C$2:$E$59,2,FALSE)),\" \",VLOOKUP(K207,[2]Proposito_programa!$C$2:$E$59,2,FALSE))","v":"Plataforma institucional para la seguridad y justicia"},{"$f":"IF(ISERROR(VLOOKUP(K207,[2]Proposito_programa!$C$2:$E$59,3,FALSE)),\" \",VLOOKUP(K207,[2]Proposito_programa!$C$2:$E$59,3,FALSE))","v":"Propósito 3: Inspirar confianza y legitimidad para vivir sin miedo y ser epicentro de cultura ciudadana, paz y reconciliación"},2007,1,1022335117,"ERIKA CONSTANZA SOPO GARZON","Persona Natural","-","-",null,31733333,null,1,6120000,37853333,24933333,"2021-08-10","2021-08-11","2021-12-30","140 DÍAS",1,27,null,null,null,null,null,null,"X",null,0.66]
[193,2021,"FDLF-CD-193-2021","https://community.secop.gov.co/Public/Tendering/OpportunityDetail/Index?noticeUID=CO1.NTC.2164517&isFromPublicArea=True&isModal=true&asPopupView=true","Contratos de prestación de servicios profesionales y de apoyo a la gestión","Contratación directa","Prestación de servicios profesionales y de apoyo a la gestión, o para la ejecución de trabajos artísticos que sólo puedan encomendarse a determinadas personas naturales;","PRESTAR LOS SERVICIOS PROFESIONALES AL ÁREA DE GESTIÓN DE DESARROLLO LOCAL PARA LA FORMULACIÓN, EVALUACIÓN Y SEGUIMIENTO DE LA META DE INTERVENCIÓN DE SALONES COMUNALES EN EL PROYECTO 1782- UN NUEVO CONTRATO PARA LA PARTICIPACIÓN CIUDADANA EN FONTIBÓN.","Inversión","Un nuevo Contrato Social y ambiental para la Bogotá del Siglo XXI",55,{"$f":"IF(ISERROR(VLOOKUP(K208,[2]Proposito_programa!$C$2:$E$59,2,FALSE)),\" \",VLOOKUP(K208,[2]Proposito_programa!$C$2:$E$59,2,FALSE))","v":"Fortalecimiento de cultura ciudadana y su institucionalidad"},{"$f":"IF(ISERROR(VLOOKUP(K208,[2]Proposito_programa!$C$2:$E$59,3,FALSE)),\" \",VLOOKUP(K208,[2]Proposito_programa!$C$2:$E$59,3,FALSE))","v":"Propósito 5: Construir Bogotá - Región con gobierno abierto, transparente y ciudadanía consciente"},1782,1,51931777,"JUDITH PATRICIA PUENTES CASTILLO","Persona Natural","-","-",null,23166667,null,0,0,23166667,18166667,"2021-08-11","2021-08-12","2021-12-30","139 DÍAS",0,0,null,null,null,null,null,null,"X",null,0.78]
[194,2021,"FDLF-CD-194-2021","https://community.secop.gov.co/Public/Tendering/OpportunityDetail/Index?noticeUID=CO1.NTC.2166930&isFromPublicArea=True&isModal=true&asPopupView=true","Contratos de prestación de servicios profesionales y de apoyo a la gestión","Contratación directa","Prestación de servicios profesionales y de apoyo a la gestión, o para la ejecución de trabajos artísticos que sólo puedan encomendarse a determinadas personas naturales;","PRESTAR SERVICIOS PROFESIONALES PARA IMPLEMENTAR EL PROYECTO 1774 UN NUEVO CONTRATO POR LOS DERECHOS DE LAS MUJERES EN FONTIBÓN, ACORDE A LAS ACCIONES CONCERNIENTES AL DESPLIEGUE Y ACOMPAÑAMIENTO PEDAGÓGICO DE LOS MÓDULOS DE FORMACIÓN, PARA LA PREVENCIÓN DEL FEMINICIDIO Y CONSTRUCCIÓN DE CIUDADANÍA DE LAS MUJERES EN SU DIVERSIDAD.","Inversión","Un nuevo Contrato Social y ambiental para la Bogotá del Siglo XXI",40,{"$f":"IF(ISERROR(VLOOKUP(K209,[2]Proposito_programa!$C$2:$E$59,2,FALSE)),\" \",VLOOKUP(K209,[2]Proposito_programa!$C$2:$E$59,2,FALSE))","v":"Más mujeres viven una vida libre de violencias, se sienten seguras y acceden con confianza al sistema de justicia"},{"$f":"IF(ISERROR(VLOOKUP(K209,[2]Proposito_programa!$C$2:$E$59,3,FALSE)),\" \",VLOOKUP(K209,[2]Proposito_programa!$C$2:$E$59,3,FALSE))","v":"Propósito 3: Inspirar confianza y legitimidad para vivir sin miedo y ser epicentro de cultura ciudadana, paz y reconciliación"},1774,1,1016034970,"LINA MARIA TREJOS SILVA","Persona Natural","-","-",null,20060600,null,0,0,20060600,15699600,"2021-08-11","2021-08-13","2021-12-30","138 DÍAS",0,0,null,null,null,null,null,null,"X",null,0.78]
[195,2021,"FDLF-CD-195-2021","https://community.secop.gov.co/Public/Tendering/OpportunityDetail/Index?noticeUID=CO1.NTC.2167516&isFromPublicArea=True&isModal=true&asPopupView=true","Contratos de prestación de servicios profesionales y de apoyo a la gestión","Contratación directa","Prestación de servicios profesionales y de apoyo a la gestión, o para la ejecución de trabajos artísticos que sólo puedan encomendarse a determinadas personas naturales;","PRESTAR SERVICIOS DE APOYO TÉCNICO AL ÁREA DE GESTIÓN DE DESARROLLO LOCAL DE FONTIBÓN EN EL MARCO DEL PROYECTO DE ARBORIZACIÓN.","Inversión","Un nuevo Contrato Social y ambiental para la Bogotá del Siglo XXI",33,{"$f":"IF(ISERROR(VLOOKUP(K210,[2]Proposito_programa!$C$2:$E$59,2,FALSE)),\" \",VLOOKUP(K210,[2]Proposito_programa!$C$2:$E$59,2,FALSE))","v":"Más árboles y más y mejor espacio público"},{"$f":"IF(ISERROR(VLOOKUP(K210,[2]Proposito_programa!$C$2:$E$59,3,FALSE)),\" \",VLOOKUP(K210,[2]Proposito_programa!$C$2:$E$59,3,FALSE))","v":"Propósito 2 : Cambiar Nuestros Hábitos de Vida para Reverdecer a Bogotá y Adaptarnos y Mitigar la Crisis Climática"},1769,1,1016077372,"ANGIE NATALIA CASTELLANOS RODRIGUEZ","Persona Natural","-","-",null,15640000,null,0,0,15640000,12240000,"2021-08-12","2021-08-13","2021-12-30","138 DÍAS",0,0,null,null,null,null,null,null,"X",null,0.78]
[196,2021,"FDLF-CD-196-2021","https://community.secop.gov.co/Public/Tendering/OpportunityDetail/Index?noticeUID=CO1.NTC.2170421&isFromPublicArea=True&isModal=true&asPopupView=true","Contratos de prestación de servicios profesionales y de apoyo a la gestión","Contratación directa","Prestación de servicios profesionales y de apoyo a la gestión, o para la ejecución de trabajos artísticos que sólo puedan encomendarse a determinadas personas naturales;","PRESTAR SERVICIOS COMO PROFESIONAL ESPECIALIZADO PARA APOYAR EL ÁREA DE GESTIÓN DE DESARROLLO LOCAL DE FONTIBÓN EN LA COORDINACIÓN GENERAL DEL PROYECTO DE BUEN TRATO.","Inversión","Un nuevo Contrato Social y ambiental para la Bogotá del Siglo XXI",6,{"$f":"IF(ISERROR(VLOOKUP(K211,[2]Proposito_programa!$C$2:$E$59,2,FALSE)),\" \",VLOOKUP(K211,[2]Proposito_programa!$C$2:$E$59,2,FALSE))","v":"Sistema Distrital de Cuidado"},{"$f":"IF(ISERROR(VLOOKUP(K211,[2]Proposito_programa!$C$2:$E$59,3,FALSE)),\" \",VLOOKUP(K211,[2]Proposito_programa!$C$2:$E$59,3,FALSE))","v":"Propósito 1: Hacer un nuevo contrato social para incrementar la inclusión social, productiva y política"},1762,1,52890907,"YUDI LESNAIDA UMBARILA OLIVARES","Persona Natural","-","-",null,33432800,null,1,6298933,39731733,26164800,"2021-08-12","2021-08-13","2021-12-30","138 DÍAS",1,26,null,null,null,null,null,null,"X",null,0.66]
[197,2021,"FDLF-CD-197-2021","https://community.secop.gov.co/Public/Tendering/OpportunityDetail/Index?noticeUID=CO1.NTC.2170432&isFromPublicArea=True&isModal=true&asPopupView=true","Contratos de prestación de servicios profesionales y de apoyo a la gestión","Contratación directa","Prestación de servicios profesionales y de apoyo a la gestión, o para la ejecución de trabajos artísticos que sólo puedan encomendarse a determinadas personas naturales;","PRESTAR SERVICIOS PROFESIONALES PARA APOYAR LOS EJERCICIOS DE CONSTRUCCIÓN DE CONVIVENCIA TERRITORIAL DESDE EL ACOMPAÑAMIENTO A LAS ESCUELAS DE SEGURIDAD, CONVIVENCIA Y JUSTICIA DE LA LOCALIDAD DE FONTIBÓN","Inversión","Un nuevo Contrato Social y ambiental para la Bogotá del Siglo XXI",43,{"$f":"IF(ISERROR(VLOOKUP(K212,[2]Proposito_programa!$C$2:$E$59,2,FALSE)),\" \",VLOOKUP(K212,[2]Proposito_programa!$C$2:$E$59,2,FALSE))","v":"Cultura ciudadana para la confianza, la convivencia y la participación desde la vida cotidiana"},{"$f":"IF(ISERROR(VLOOKUP(K212,[2]Proposito_programa!$C$2:$E$59,3,FALSE)),\" \",VLOOKUP(K212,[2]Proposito_programa!$C$2:$E$59,3,FALSE))","v":"Propósito 3: Inspirar confianza y legitimidad para vivir sin miedo y ser epicentro de cultura ciudadana, paz y reconciliación"},1775,1,79396462,"ANGEL ZULEY PEDRAZA HURTADO","Persona Natural","-","-",null,23000000,null,0,0,23000000,13000000,"2021-08-12","2021-08-13","2021-12-15","123 DÍAS",0,0,null,null,null,null,null,null,"X",null,0.56999999999999995]
[198,2021,"FDLF-CD-198-2021","https://community.secop.gov.co/Public/Tendering/OpportunityDetail/Index?noticeUID=CO1.NTC.2170428&isFromPublicArea=True&isModal=true&asPopupView=true","Contratos de prestación de servicios profesionales y de apoyo a la gestión","Contratación directa","Prestación de servicios profesionales y de apoyo a la gestión, o para la ejecución de trabajos artísticos que sólo puedan encomendarse a determinadas personas naturales;","PRESTAR SERVICIOS TÉCNICOS PARA APOYAR EL ÁREA DE GESTIÓN DE DESARROLLO LOCAL DE FONTIBÓN EN EL PROYECTO 1758 DE LA ESCUELA DE FORMACIÓN DE LÍDERES Y EMPRENDEDORES COMUNITARIOS DESDE LAS ARTES.","Inversión","Un nuevo Contrato Social y ambiental para la Bogotá del Siglo XXI",21,{"$f":"IF(ISERROR(VLOOKUP(K213,[2]Proposito_programa!$C$2:$E$59,2,FALSE)),\" \",VLOOKUP(K213,[2]Proposito_programa!$C$2:$E$59,2,FALSE))","v":"Creación y vida cotidiana: Apropiación ciudadana del arte, la cultura y el patrimonio, para la democracia cultural"},{"$f":"IF(ISERROR(VLOOKUP(K213,[2]Proposito_programa!$C$2:$E$59,3,FALSE)),\" \",VLOOKUP(K213,[2]Proposito_programa!$C$2:$E$59,3,FALSE))","v":"Propósito 1: Hacer un nuevo contrato social para incrementar la inclusión social, productiva y política"},1758,1,52778178,"ANDREA VIVIANA LOPEZ RODRIGUEZ","Persona Natural","-","-",null,15656000,null,0,0,15656000," $                          -  ","2021-08-12","2021-08-17","2022-02-23","122 DÍAS",0,0,null,null,null,null,null,null,"X",null,0]
[199,2021,"FDLF-CD-199-2021","https://community.secop.gov.co/Public/Tendering/OpportunityDetail/Index?noticeUID=CO1.NTC.2170485&isFromPublicArea=True&isModal=true&asPopupView=true","Contratos de prestación de servicios profesionales y de apoyo a la gestión","Contratación directa","Prestación de servicios profesionales y de apoyo a la gestión, o para la ejecución de trabajos artísticos que sólo puedan encomendarse a determinadas personas naturales;","PRESTAR SERVICIOS PROFESIONALES PARA IMPULSAR LA PARTICIPACIÓN CIUDADANA EN EL PROYECTO 1759 UN NUEVO CONTRATO PARA EL FOMENTO DE LA AGRICULTURA URBANA EN FONTIBÓN CON EL FIN DE FORTALECER LA RED Y LA PROMOCIÓN DE PRÁCTICAS TRADICIONALES DE AGRICULTURA EN LA LOCALIDAD.","Inversión","Un nuevo Contrato Social y ambiental para la Bogotá del Siglo XXI",24,{"$f":"IF(ISERROR(VLOOKUP(K214,[2]Proposito_programa!$C$2:$E$59,2,FALSE)),\" \",VLOOKUP(K214,[2]Proposito_programa!$C$2:$E$59,2,FALSE))","v":"Bogotá región emprendedora e innovadora"},{"$f":"IF(ISERROR(VLOOKUP(K214,[2]Proposito_programa!$C$2:$E$59,3,FALSE)),\" \",VLOOKUP(K214,[2]Proposito_programa!$C$2:$E$59,3,FALSE))","v":"Propósito 1: Hacer un nuevo contrato social para incrementar la inclusión social, productiva y política"},1759,1,1016047509,"RALPH ALIRIO CASTILLO HERRERA","Persona Natural","-","-",null,20060600,null,0,0,20060600,15699600,"2021-08-12","2021-08-13","2021-12-30","138 DÍAS",0,0,null,null,null,null,null,null,"X",null,0.78]
[200,2021,"FDLF-CD-200-2021","https://community.secop.gov.co/Public/Tendering/OpportunityDetail/Index?noticeUID=CO1.NTC.2172379&isFromPublicArea=True&isModal=true&asPopupView=true","Contratos de prestación de servicios profesionales y de apoyo a la gestión","Contratación directa","Prestación de servicios profesionales y de apoyo a la gestión, o para la ejecución de trabajos artísticos que sólo puedan encomendarse a determinadas personas naturales;","PRESTAR SERVICIOS DE APOYO PARA REALIZAR LAS LABORES DE PLANTACIÓN, RIEGO, PODA, BLOQUEO, TRASPLANTE, LIMPIEZA Y DEMÁS ACTIVIDADES QUE LE SEAN ASIGNADAS EN EL MARCO DEL PROYECTO DE ARBORIZACIÓN EN LA LOCALIDAD DE FONTIBÓN.","Inversión","Un nuevo Contrato Social y ambiental para la Bogotá del Siglo XXI",33,{"$f":"IF(ISERROR(VLOOKUP(K215,[2]Proposito_programa!$C$2:$E$59,2,FALSE)),\" \",VLOOKUP(K215,[2]Proposito_programa!$C$2:$E$59,2,FALSE))","v":"Más árboles y más y mejor espacio público"},{"$f":"IF(ISERROR(VLOOKUP(K215,[2]Proposito_programa!$C$2:$E$59,3,FALSE)),\" \",VLOOKUP(K215,[2]Proposito_programa!$C$2:$E$59,3,FALSE))","v":"Propósito 2 : Cambiar Nuestros Hábitos de Vida para Reverdecer a Bogotá y Adaptarnos y Mitigar la Crisis Climática"},1769,1,25691304,"SILVIA MARIA INES TOMBE MONTAÑO","Persona Natural","-","-",null,5360000,null,0,0,5360000," $                          -  ","2021-08-19","2021-08-27","2021-12-30","134 DÍAS",0,0,null,null,null,null,null,null,"X",null,0]
[201,2021,"FDLF-CD-201-2021","https://community.secop.gov.co/Public/Tendering/OpportunityDetail/Index?noticeUID=CO1.NTC.2174803&isFromPublicArea=True&isModal=true&asPopupView=true","Contratos de prestación de servicios profesionales y de apoyo a la gestión","Contratación directa","Prestación de servicios profesionales y de apoyo a la gestión, o para la ejecución de trabajos artísticos que sólo puedan encomendarse a determinadas personas naturales;","PRESTAR SERVICIOS PROFESIONALES DE APOYO AL ÁREA DE GESTIÓN DEL DESARROLLO DE LA ALCALDÍA LOCAL, EN TEMAS ORIENTADOS A LA SEGURIDAD Y CONVIVENCIA EN FONTIBÓN- PROYECTO 1775.","Inversión","Un nuevo Contrato Social y ambiental para la Bogotá del Siglo XXI",43,{"$f":"IF(ISERROR(VLOOKUP(K216,[2]Proposito_programa!$C$2:$E$59,2,FALSE)),\" \",VLOOKUP(K216,[2]Proposito_programa!$C$2:$E$59,2,FALSE))","v":"Cultura ciudadana para la confianza, la convivencia y la participación desde la vida cotidiana"},{"$f":"IF(ISERROR(VLOOKUP(K216,[2]Proposito_programa!$C$2:$E$59,3,FALSE)),\" \",VLOOKUP(K216,[2]Proposito_programa!$C$2:$E$59,3,FALSE))","v":"Propósito 3: Inspirar confianza y legitimidad para vivir sin miedo y ser epicentro de cultura ciudadana, paz y reconciliación"},1775,1,73161809,"FARID PUELLO PEREZ","Persona Natural","-","-",null,22000000,null,1,6966666,28966666,19066667,"2021-08-13","2021-08-17","2022-01-24","122 DÍAS",1,38,null,null,null,null,null,null,"X",null,0.75]
[202,2021,"FDLF-IPMC-3-2021","https://community.secop.gov.co/Public/Tendering/OpportunityDetail/Index?noticeUID=CO1.NTC.2155936&isFromPublicArea=True&isModal=False","Compraventa de bienes muebles","Contratación mínima cuantia","No aplica","ADQUISICION DE TONERS, TINTAS E INSUMOS PARA IMPRESORAS EN LAS DIFERENTES DEPENDENCIAS DE LA ALCALDÍA LOCAL DE FONTIBÓN, INSPECCIÓN DE POLICÍA EN LAS CONDICIONES E ÍTEMS DE CONFORMIDAD CON LOS ESTUDIOS PREVIOS, ANEXO TÉCNICO, ANÁLISIS DE SECTOR Y ESTUDIO DE MERCADEO ","Funcionamiento","Un nuevo Contrato Social y ambiental para la Bogotá del Siglo XXI","No aplica",{"$f":"IF(ISERROR(VLOOKUP(K217,[2]Proposito_programa!$C$2:$E$59,2,FALSE)),\" \",VLOOKUP(K217,[2]Proposito_programa!$C$2:$E$59,2,FALSE))","v":" "},{"$f":"IF(ISERROR(VLOOKUP(K217,[2]Proposito_programa!$C$2:$E$59,3,FALSE)),\" \",VLOOKUP(K217,[2]Proposito_programa!$C$2:$E$59,3,FALSE))","v":" "},206,1,900589201,"KANDERI GROUP S.A.S.","Persona Jurídica","-","-",null,7699401,null,0,0,7699401," $                          -  ","2021-08-20","2021-08-27","2021-09-26","30 DÍAS",0,0,null,null,null,null,null,null,"X",null,0]
[204,2021,"FDLF-CD-204-2021","https://community.secop.gov.co/Public/Tendering/OpportunityDetail/Index?noticeUID=CO1.NTC.2187661&isFromPublicArea=True&isModal=true&asPopupView=true","Contratos de prestación de servicios profesionales y de apoyo a la gestión","Contratación directa","Prestación de servicios profesionales y de apoyo a la gestión, o para la ejecución de trabajos artísticos que sólo puedan encomendarse a determinadas personas naturales;","PRESTAR SERVICIOS PROFESIONALES PARA APOYAR EL ÁREA DE GESTIÓN DE DESARROLLO LOCAL EN TEMAS PRECONTRACTUALES DE LOS PROYECTOS DE INVERSIÓN DEL FONDO DE DESARROLLO LOCAL DE FONTIBÓN. ","Inversión","Un nuevo Contrato Social y ambiental para la Bogotá del Siglo XXI",57,{"$f":"IF(ISERROR(VLOOKUP(K218,[2]Proposito_programa!$C$2:$E$59,2,FALSE)),\" \",VLOOKUP(K218,[2]Proposito_programa!$C$2:$E$59,2,FALSE))","v":"Gestión pública local"},{"$f":"IF(ISERROR(VLOOKUP(K218,[2]Proposito_programa!$C$2:$E$59,3,FALSE)),\" \",VLOOKUP(K218,[2]Proposito_programa!$C$2:$E$59,3,FALSE))","v":"Propósito 5: Construir Bogotá - Región con gobierno abierto, transparente y ciudadanía consciente"},1783,1,51744634,"CLAUDIA PATRICIA LORENZO MEJIA ","Persona Natural","-","-",null,25600000,null,0,0,25600000,12200000,"2021-08-20","2021-08-30","2021-12-31","121 DÍAS",0,0,null,null,null,null,null,null,"X",null,0.48]
[205,2021,"FDLF-CD-205-2021","https://community.secop.gov.co/Public/Tendering/OpportunityDetail/Index?noticeUID=CO1.NTC.2188819&isFromPublicArea=True&isModal=true&asPopupView=true","Contratos de prestación de servicios profesionales y de apoyo a la gestión","Contratación directa","Prestación de servicios profesionales y de apoyo a la gestión, o para la ejecución de trabajos artísticos que sólo puedan encomendarse a determinadas personas naturales;","PRESTAR SERVICIOS TÉCNICOS PARA IMPLEMENTAR EL PROYECTO 1774 UN NUEVO CONTRATO POR LOS DERECHOS DE LAS MUJERES EN FONTIBÓN EN EL MARCO DE LAS ACCIONES ESTABLECIDAS PARA LA PREVENCIÓN DEL FEMINICIDIO Y CONSTRUCCIÓN DE CIUDADANÍA DE LAS MUJERES EN LA LOCALIDAD.","Inversión","Un nuevo Contrato Social y ambiental para la Bogotá del Siglo XXI",40,{"$f":"IF(ISERROR(VLOOKUP(K219,[2]Proposito_programa!$C$2:$E$59,2,FALSE)),\" \",VLOOKUP(K219,[2]Proposito_programa!$C$2:$E$59,2,FALSE))","v":"Más mujeres viven una vida libre de violencias, se sienten seguras y acceden con confianza al sistema de justicia"},{"$f":"IF(ISERROR(VLOOKUP(K219,[2]Proposito_programa!$C$2:$E$59,3,FALSE)),\" \",VLOOKUP(K219,[2]Proposito_programa!$C$2:$E$59,3,FALSE))","v":"Propósito 3: Inspirar confianza y legitimidad para vivir sin miedo y ser epicentro de cultura ciudadana, paz y reconciliación"},1774,1,1093142007,"DANIELA JOHANA GELVES PARADA ","Persona Natural","-","-",null,11538373,null,0,0,11538373,8540213,"2021-08-20","2021-08-27","2021-12-30","127 DÍAS",0,0,null,null,null,null,null,null,"X",null,0.74]
[206,2021,"FDLF-CD-206-2021","https://community.secop.gov.co/Public/Tendering/OpportunityDetail/Index?noticeUID=CO1.NTC.2189152&isFromPublicArea=True&isModal=true&asPopupView=true","Contratos de prestación de servicios profesionales y de apoyo a la gestión","Contratación directa","Prestación de servicios profesionales y de apoyo a la gestión, o para la ejecución de trabajos artísticos que sólo puedan encomendarse a determinadas personas naturales;","PRESTAR SERVICIOS COMO PROFESIONAL ESPECIALIZADO PARA APOYAR EL ÁREA DE GESTIÓN DE DESARROLLO LOCAL DE FONTIBÓN PARA EL DESARROLLO DEL PROYECTO DE BUEN TRATO EN LOS COMPONENTES DE ORIENTACIÓN, ASESORÍA FAMILIAR, POSICIONAMIENTO Y PROMOCIÓN DEL BUEN TRATO.","Inversión","Un nuevo Contrato Social y ambiental para la Bogotá del Siglo XXI",6,{"$f":"IF(ISERROR(VLOOKUP(K220,[2]Proposito_programa!$C$2:$E$59,2,FALSE)),\" \",VLOOKUP(K220,[2]Proposito_programa!$C$2:$E$59,2,FALSE))","v":"Sistema Distrital de Cuidado"},{"$f":"IF(ISERROR(VLOOKUP(K220,[2]Proposito_programa!$C$2:$E$59,3,FALSE)),\" \",VLOOKUP(K220,[2]Proposito_programa!$C$2:$E$59,3,FALSE))","v":"Propósito 1: Hacer un nuevo contrato social para incrementar la inclusión social, productiva y política"},1762,1,52818880,"DIANA MARCELA RAMIREZ PEÑA ","Persona Natural","-","-",null,29073066,null,0,0,29073066,21350533,"2021-08-20","2021-08-27","2021-12-30","128 DÍAS",0,0,null,null,null,null,null,null,"X",null,0.73]
[207,2021,"FDLF-CD-207-2021","https://community.secop.gov.co/Public/Tendering/OpportunityDetail/Index?noticeUID=CO1.NTC.2199130&isFromPublicArea=True&isModal=true&asPopupView=true","Contratos de prestación de servicios profesionales y de apoyo a la gestión","Contratación directa","Prestación de servicios profesionales y de apoyo a la gestión, o para la ejecución de trabajos artísticos que sólo puedan encomendarse a determinadas personas naturales;","PRESTAR SERVICIOS PROFESIONALES PARA APOYAR EN EL DESARROLLO DE LAS ACTIVIDADES ORIENTADAS A LA IMPLEMENTACIÓN DE LA RESTAURACIÓN ECOLÓGICA, SIEMBRA Y MANTENIMIENTO DE ARBOLADO URBANO; PROYECTO 1769 -UN NUEVO CONTRATO PARA ARBORIZAR FONTIBÓN- EN EL ÁREA DE GESTIÓN DE DESARROLLO LOCAL DE LA ALCALDÍA.","Inversión","Un nuevo Contrato Social y ambiental para la Bogotá del Siglo XXI",33,{"$f":"IF(ISERROR(VLOOKUP(K221,[2]Proposito_programa!$C$2:$E$59,2,FALSE)),\" \",VLOOKUP(K221,[2]Proposito_programa!$C$2:$E$59,2,FALSE))","v":"Más árboles y más y mejor espacio público"},{"$f":"IF(ISERROR(VLOOKUP(K221,[2]Proposito_programa!$C$2:$E$59,3,FALSE)),\" \",VLOOKUP(K221,[2]Proposito_programa!$C$2:$E$59,3,FALSE))","v":"Propósito 2 : Cambiar Nuestros Hábitos de Vida para Reverdecer a Bogotá y Adaptarnos y Mitigar la Crisis Climática"},1769,1,79793957,"LUCAS DAVID CARDOZO CARRILLO","Persona Natural","-","-",null,20000000,null,1,4333333,24333333,15666667,"2021-08-25","2021-08-27","2022-01-24","122 DÍAS",1,26,null,null,null,null,null,null,"X",null,0.64]
[208,2021,"FDLF-CD-208-2021","https://community.secop.gov.co/Public/Tendering/OpportunityDetail/Index?noticeUID=CO1.NTC.2197635&isFromPublicArea=True&isModal=true&asPopupView=true","Contratos de prestación de servicios profesionales y de apoyo a la gestión","Contratación directa","Prestación de servicios profesionales y de apoyo a la gestión, o para la ejecución de trabajos artísticos que sólo puedan encomendarse a determinadas personas naturales;","PRESTAR SERVICIOS COMO AUXILIAR ADMINISTRATIVO Y OPERATIVO EN EL ÁREA DE GESTIÓN DE DESARROLLO LOCAL DE FONTIBÓN, PARA EL DESARROLLO DE LAS ESCUELAS CONCERNIENTES AL PROYECTO DE INVERSIÓN 1774.","Inversión","Un nuevo Contrato Social y ambiental para la Bogotá del Siglo XXI",40,{"$f":"IF(ISERROR(VLOOKUP(K222,[2]Proposito_programa!$C$2:$E$59,2,FALSE)),\" \",VLOOKUP(K222,[2]Proposito_programa!$C$2:$E$59,2,FALSE))","v":"Más mujeres viven una vida libre de violencias, se sienten seguras y acceden con confianza al sistema de justicia"},{"$f":"IF(ISERROR(VLOOKUP(K222,[2]Proposito_programa!$C$2:$E$59,3,FALSE)),\" \",VLOOKUP(K222,[2]Proposito_programa!$C$2:$E$59,3,FALSE))","v":"Propósito 3: Inspirar confianza y legitimidad para vivir sin miedo y ser epicentro de cultura ciudadana, paz y reconciliación"},1774,1,1016006847,"MARLLY JOHANNA DELGADO RINCÓN ","Persona Natural","-","-",null,11062800,null,0,0,11062800," $                          -  ","2021-08-24","2021-08-27","2021-12-30","126 DÍAS",0,0,null,null,null,null,null,null,"X",null,0]
[209,2021,"FDLF-CD-209-2021","https://community.secop.gov.co/Public/Tendering/OpportunityDetail/Index?noticeUID=CO1.NTC.2199142&isFromPublicArea=True&isModal=true&asPopupView=true","Contratos de prestación de servicios profesionales y de apoyo a la gestión","Contratación directa","Prestación de servicios profesionales y de apoyo a la gestión, o para la ejecución de trabajos artísticos que sólo puedan encomendarse a determinadas personas naturales;","PRESTAR SERVICIOS PROFESIONALES PARA APOYAR AL DESPACHO DE LA ALCALDÍA LOCAL EN LA PROMOCIÓN, ACOMPAÑAMIENTO, COORDINACIÓN Y ATENCIÓN DE LAS INSTANCIAS DE COORDINACIÓN INTERINSTITUCIONALES Y LAS INSTANCIAS DE PARTICIPACIÓN LOCALES, ASÍ COMO LOS PROCESOS COMUNITARIOS EN LA LOCALIDAD.","Inversión","Un nuevo Contrato Social y ambiental para la Bogotá del Siglo XXI",55,{"$f":"IF(ISERROR(VLOOKUP(K223,[2]Proposito_programa!$C$2:$E$59,2,FALSE)),\" \",VLOOKUP(K223,[2]Proposito_programa!$C$2:$E$59,2,FALSE))","v":"Fortalecimiento de cultura ciudadana y su institucionalidad"},{"$f":"IF(ISERROR(VLOOKUP(K223,[2]Proposito_programa!$C$2:$E$59,3,FALSE)),\" \",VLOOKUP(K223,[2]Proposito_programa!$C$2:$E$59,3,FALSE))","v":"Propósito 5: Construir Bogotá - Región con gobierno abierto, transparente y ciudadanía consciente"},1782,1,43558926,"LAYDA MARIA ZULUAGA RIVERA","Persona Natural","-","-",null,20000000,null,0,0,20000000,15666667,"2021-08-25","2021-08-27","2021-12-26","122 DÍAS",0,0,null,null,null,null,null,null,"X",null,0.75]
[210,2021,"FDLF-CD-210-2021","https://community.secop.gov.co/Public/Tendering/OpportunityDetail/Index?noticeUID=CO1.NTC.2203466&isFromPublicArea=True&isModal=true&asPopupView=true","Contratos de prestación de servicios profesionales y de apoyo a la gestión","Contratación directa","Prestación de servicios profesionales y de apoyo a la gestión, o para la ejecución de trabajos artísticos que sólo puedan encomendarse a determinadas personas naturales;","PRESTAR SERVICIOS PROFESIONALES PARA APOYAR AL ÁREA DE GESTIÓN DE DESARROLLO LOCAL EN TEMAS ASOCIADOS AL FORTALECIMIENTO A MIPYMES Y DEMÁS ASUNTOS RELACIONADOS CON EL CUMPLIMIENTO DE LAS ACTIVIDADES DE REACTIVACIÓN ECONÓMICA EN LA LOCALIDAD DE FONTIBON. -PROYECTO 1761","Inversión","Un nuevo Contrato Social y ambiental para la Bogotá del Siglo XXI",6,{"$f":"IF(ISERROR(VLOOKUP(K224,[2]Proposito_programa!$C$2:$E$59,2,FALSE)),\" \",VLOOKUP(K224,[2]Proposito_programa!$C$2:$E$59,2,FALSE))","v":"Sistema Distrital de Cuidado"},{"$f":"IF(ISERROR(VLOOKUP(K224,[2]Proposito_programa!$C$2:$E$59,3,FALSE)),\" \",VLOOKUP(K224,[2]Proposito_programa!$C$2:$E$59,3,FALSE))","v":"Propósito 1: Hacer un nuevo contrato social para incrementar la inclusión social, productiva y política"},1761,1,79628456,"ERNESTO CAMILO DIAZ NARVAEZ","Persona Natural","-","-",null,26000000,null,0,0,26000000,19500000,"2021-08-27","2021-08-31","2021-12-30","122 DÍAS",0,0,null,null,null,null,null,null,"X",null,0.75]
[211,2021,"FDLF-CD-211-2021","https://community.secop.gov.co/Public/Tendering/OpportunityDetail/Index?noticeUID=CO1.NTC.2204889&isFromPublicArea=True&isModal=true&asPopupView=true","Contratos de prestación de servicios profesionales y de apoyo a la gestión","Contratación directa","Prestación de servicios profesionales y de apoyo a la gestión, o para la ejecución de trabajos artísticos que sólo puedan encomendarse a determinadas personas naturales;","PRESTAR SERVICIOS PROFESIONALES DE APOYO EN EL ÁREA DE GESTIÓN DE DESARROLLO LOCAL DE FONTIBÓN PARA LA FORMULACIÓN Y APLICACIÓN DE UNA METODOLOGÍA DE CAPACITACIÓN PARA LA ESCUELA DE PARTICIPACIÓN DIRIGIDA A LÍDERES COMUNITARIOS Y COMUNALES, CUMPLIENDO CON LA META 'CAPACITAR 177 PERSONAS A TRAVÉS DE PROCESOS DE FORMACIÓN PARA LA PARTICIPACIÓN DE MANERA VIRTUAL DURANTE LA VIGENCIA 2021","Inversión","Un nuevo Contrato Social y ambiental para la Bogotá del Siglo XXI",55,{"$f":"IF(ISERROR(VLOOKUP(K225,[2]Proposito_programa!$C$2:$E$59,2,FALSE)),\" \",VLOOKUP(K225,[2]Proposito_programa!$C$2:$E$59,2,FALSE))","v":"Fortalecimiento de cultura ciudadana y su institucionalidad"},{"$f":"IF(ISERROR(VLOOKUP(K225,[2]Proposito_programa!$C$2:$E$59,3,FALSE)),\" \",VLOOKUP(K225,[2]Proposito_programa!$C$2:$E$59,3,FALSE))","v":"Propósito 5: Construir Bogotá - Región con gobierno abierto, transparente y ciudadanía consciente"},1782,1,53063499,"GINNA XIOMARA CAÑON CABALLERO","Persona Natural","-","-",null,17444000,null,1,8722000,{"$f":"Y225+V225+W225","v":26166000},13083000,"2021-08-27","2021-09-01","2021-12-30","122 DÍAS",1,60,null,null,null,null,null,null,"X",null,0.5]
[213,2021,"FDLF-CD-213-2021","https://www.contratos.gov.co/consultas/detalleProceso.do?numConstancia=21-22-28874&g","Convenios de cooperacion","Contratación directa","Prestación de servicios profesionales y de apoyo a la gestión, o para la ejecución de trabajos artísticos que sólo puedan encomendarse a determinadas personas naturales;","AUNAR ESFUERZOS TÉCNICOS, ADMINISTRATIVOS Y FINANCIEROS ENTRE EL IDRD Y LOS FONDOS DE DESARROLLO LOCAL PARA LA EJECUCIÓN DE LAS LÍNEAS DE INVERSIÓN, FORMACIÓN Y EVENTOS RECREODEPORTIVOS. ","Inversión","Un nuevo Contrato Social y ambiental para la Bogotá del Siglo XXI",20,{"$f":"IF(ISERROR(VLOOKUP(K226,[2]Proposito_programa!$C$2:$E$59,2,FALSE)),\" \",VLOOKUP(K226,[2]Proposito_programa!$C$2:$E$59,2,FALSE))","v":"Bogotá, referente en cultura, deporte, recreación y actividad física, con parques para el desarrollo y la salud"},{"$f":"IF(ISERROR(VLOOKUP(K226,[2]Proposito_programa!$C$2:$E$59,3,FALSE)),\" \",VLOOKUP(K226,[2]Proposito_programa!$C$2:$E$59,3,FALSE))","v":"Propósito 1: Hacer un nuevo contrato social para incrementar la inclusión social, productiva y política"},1757,1,860061099,"INSTITUTO DISTRITAL DE RECREACIÓN Y DEPORTE","Persona Jurídica","-","-",null,426350800,null,0,0,426350800,341080640,"2021-08-31","2021-09-21","2022-03-31","191 DÍAS",0,0,null,null,null,null,null,"X",null,null,0.8]
[214,2021,"FDLF-CD-214-2021","https://community.secop.gov.co/Public/Tendering/OpportunityDetail/Index?noticeUID=CO1.NTC.2212279&isFromPublicArea=True&isModal=true&asPopupView=true","Contratos de prestación de servicios profesionales y de apoyo a la gestión","Contratación directa","Prestación de servicios profesionales y de apoyo a la gestión, o para la ejecución de trabajos artísticos que sólo puedan encomendarse a determinadas personas naturales;","PRESTAR SERVICIOS PROFESIONALES PARA IMPLEMENTAR EL PROYECTO 1774: UN NUEVO CONTRATO POR LOS DERECHOS DE LAS MUJERES EN FONTIBÓN, ACORDE A LAS ACCIONES CONCERNIENTES AL DESPLIEGUE Y ACOMPAÑAMIENTO PEDAGÓGICO DE LOS MÓDULOS DE FORMACIÓN, PARA LA PREVENCIÓN DEL FEMINICIDIO Y CONSTRUCCIÓN DE CIUDADANÍA DE LAS MUJERES EN SU DIVERSIDAD. ","Inversión","Un nuevo Contrato Social y ambiental para la Bogotá del Siglo XXI",40,{"$f":"IF(ISERROR(VLOOKUP(K227,[2]Proposito_programa!$C$2:$E$59,2,FALSE)),\" \",VLOOKUP(K227,[2]Proposito_programa!$C$2:$E$59,2,FALSE))","v":"Más mujeres viven una vida libre de violencias, se sienten seguras y acceden con confianza al sistema de justicia"},{"$f":"IF(ISERROR(VLOOKUP(K227,[2]Proposito_programa!$C$2:$E$59,3,FALSE)),\" \",VLOOKUP(K227,[2]Proposito_programa!$C$2:$E$59,3,FALSE))","v":"Propósito 3: Inspirar confianza y legitimidad para vivir sin miedo y ser epicentro de cultura ciudadana, paz y reconciliación"},1774,1,1032414892,"OMAR GIOVANNY PULIDO NIÑO  ","Persona Natural","-","-",null,17444000,null,0,0,17444000,13083000,"2021-08-31","2021-09-01","2021-12-30","122 DÍAS",0,0,null,null,null,null,null,null,"X",null,0.75]
[215,2021,"FDLF-CD-215-2021","https://community.secop.gov.co/Public/Tendering/OpportunityDetail/Index?noticeUID=CO1.NTC.2212256&isFromPublicArea=True&isModal=true&asPopupView=true","Contratos de prestación de servicios profesionales y de apoyo a la gestión","Contratación directa","Prestación de servicios profesionales y de apoyo a la gestión, o para la ejecución de trabajos artísticos que sólo puedan encomendarse a determinadas personas naturales;","PRESTAR SERVICIOS PROFESIONALES PARA IMPLEMENTAR EL PROYECTO 1774: UN NUEVO CONTRATO POR LOS DERECHOS DE LAS MUJERES EN FONTIBÓN, ACORDE A LAS ACCIONES CONCERNIENTES AL DESPLIEGUE Y ACOMPAÑAMIENTO PEDAGÓGICO DE LOS MÓDULOS DE FORMACIÓN, PARA LA PREVENCIÓN DEL FEMINICIDIO Y CONSTRUCCIÓN DE CIUDADANÍA DE LAS MUJERES EN SU DIVERSIDAD. ","Inversión","Un nuevo Contrato Social y ambiental para la Bogotá del Siglo XXI",40,{"$f":"IF(ISERROR(VLOOKUP(K228,[2]Proposito_programa!$C$2:$E$59,2,FALSE)),\" \",VLOOKUP(K228,[2]Proposito_programa!$C$2:$E$59,2,FALSE))","v":"Más mujeres viven una vida libre de violencias, se sienten seguras y acceden con confianza al sistema de justicia"},{"$f":"IF(ISERROR(VLOOKUP(K228,[2]Proposito_programa!$C$2:$E$59,3,FALSE)),\" \",VLOOKUP(K228,[2]Proposito_programa!$C$2:$E$59,3,FALSE))","v":"Propósito 3: Inspirar confianza y legitimidad para vivir sin miedo y ser epicentro de cultura ciudadana, paz y reconciliación"},1774,1,1032416332,"LAURA CRISTINA LATORRE ROJAS ","Persona Natural","-","-",null,17444000,null,0,0,17444000,13083000,"2021-08-31","2021-09-01","2021-12-30","122 DÍAS",0,0,null,null,null,null,null,null,"X",null,0.75]
[216,2021,"FDLF-CD-216-2021","https://community.secop.gov.co/Public/Tendering/OpportunityDetail/Index?noticeUID=CO1.NTC.2212266&isFromPublicArea=True&isModal=true&asPopupView=true","Contratos de prestación de servicios profesionales y de apoyo a la gestión","Contratación directa","Prestación de servicios profesionales y de apoyo a la gestión, o para la ejecución de trabajos artísticos que sólo puedan encomendarse a determinadas personas naturales;","PRESTAR SERVICIOS PROFESIONALES PARA IMPLEMENTAR EL PROYECTO 1774: UN NUEVO CONTRATO POR LOS DERECHOS DE LAS MUJERES EN FONTIBÓN, ACORDE A LAS ACCIONES CONCERNIENTES AL DESPLIEGUE Y ACOMPAÑAMIENTO PEDAGÓGICO DE LOS MÓDULOS DE FORMACIÓN, PARA LA PREVENCIÓN DEL FEMINICIDIO Y CONSTRUCCIÓN DE CIUDADANÍA DE LAS MUJERES EN SU DIVERSIDAD. ","Inversión","Un nuevo Contrato Social y ambiental para la Bogotá del Siglo XXI",40,{"$f":"IF(ISERROR(VLOOKUP(K229,[2]Proposito_programa!$C$2:$E$59,2,FALSE)),\" \",VLOOKUP(K229,[2]Proposito_programa!$C$2:$E$59,2,FALSE))","v":"Más mujeres viven una vida libre de violencias, se sienten seguras y acceden con confianza al sistema de justicia"},{"$f":"IF(ISERROR(VLOOKUP(K229,[2]Proposito_programa!$C$2:$E$59,3,FALSE)),\" \",VLOOKUP(K229,[2]Proposito_programa!$C$2:$E$59,3,FALSE))","v":"Propósito 3: Inspirar confianza y legitimidad para vivir sin miedo y ser epicentro de cultura ciudadana, paz y reconciliación"},1774,1,1026263958,"ANGELICA ROCIO RAMOS ACEROS ","Persona Natural","-","-",null,17444000,null,0,0,17444000,13083000,"2021-08-31","2021-09-01","2021-12-30","122 DÍAS",0,0,null,null,null,null,null,null,"X",null,0.75]
[217,2021,"FLDF-CMA-1-2021","https://www.contratos.gov.co/consultas/detalleProceso.do?numConstancia=21-15-12142938&g","Seguros","Concurso de méritos","No aplica","SELECCIONAR A UN INTERMEDIARIO DE SEGUROS, LEGALMENTE ESTABLECIDO EN COLOMBIA, PARA QUE PRESTE LOS SERVICIOS DE INTERMEDIACIÓN DE SEGUROS Y ACOMPAÑAMIENTO PERMANENTE A LA ALCALDÍA LOCAL DE FONTIBON PARA LA ADECUADA PROTECCIÓN DE LAS PERSONAS, BIENES E INTERESES PATRIMONIALES DE SU PROPIEDAD Y POR AQUELLOS POR LOS CUALES SEA O LLEGARE A SER LEGALMENTE RESPONSABLE ","Funcionamiento","Un nuevo Contrato Social y ambiental para la Bogotá del Siglo XXI","No aplica",{"$f":"IF(ISERROR(VLOOKUP(K230,[2]Proposito_programa!$C$2:$E$59,2,FALSE)),\" \",VLOOKUP(K230,[2]Proposito_programa!$C$2:$E$59,2,FALSE))","v":" "},{"$f":"IF(ISERROR(VLOOKUP(K230,[2]Proposito_programa!$C$2:$E$59,3,FALSE)),\" \",VLOOKUP(K230,[2]Proposito_programa!$C$2:$E$59,3,FALSE))","v":" "},null,1,900159437,"ASE & ASE LTDA","Persona Jurídica","-","-",null,0,null,0,0,0,{"$f":"Z230+W230+X230","v":0},"2021-08-31","2021-09-09","2022-09-08","365 DÍAS",0,0,null,null,null,null,null,"X",null,null,0]
[218,2021,"FDLF-CD-218-2021","https://community.secop.gov.co/Public/Tendering/OpportunityDetail/Index?noticeUID=CO1.NTC.2214261&isFromPublicArea=True&isModal=true&asPopupView=true","Contratos de prestación de servicios profesionales y de apoyo a la gestión","Contratación directa","Prestación de servicios profesionales y de apoyo a la gestión, o para la ejecución de trabajos artísticos que sólo puedan encomendarse a determinadas personas naturales;","PRESTAR SERVICIOS TÉCNICOS PARA APOYAR EL ÁREA DE  GESTIÓN DE DESARROLLO LOCAL DE FONTIBÓN EN EL PROYECTO 1758 DE LA ESCUELA DE FORMACIÓN DE LÍDERES Y  EMPRENDEDORES COMUNITARIOS DESDE LAS ARTES ","Inversión","Un nuevo Contrato Social y ambiental para la Bogotá del Siglo XXI",21,{"$f":"IF(ISERROR(VLOOKUP(K231,[2]Proposito_programa!$C$2:$E$59,2,FALSE)),\" \",VLOOKUP(K231,[2]Proposito_programa!$C$2:$E$59,2,FALSE))","v":"Creación y vida cotidiana: Apropiación ciudadana del arte, la cultura y el patrimonio, para la democracia cultural"},{"$f":"IF(ISERROR(VLOOKUP(K231,[2]Proposito_programa!$C$2:$E$59,3,FALSE)),\" \",VLOOKUP(K231,[2]Proposito_programa!$C$2:$E$59,3,FALSE))","v":"Propósito 1: Hacer un nuevo contrato social para incrementar la inclusión social, productiva y política"},1758,1,1030552882,"IVONE LORENA PINZON VARGAS","Persona Natural","-","-",null,15525533,null,0,0,15525533," $                          -  ","2021-08-31","2021-09-02","2021-12-30","119 DÍAS",0,0,null,null,null,null,null,null,"X",null,0]
[219,2021,"FDLF-CD-219-2021","https://community.secop.gov.co/Public/Tendering/OpportunityDetail/Index?noticeUID=CO1.NTC.2217459&isFromPublicArea=True&isModal=true&asPopupView=true","Contratos de prestación de servicios profesionales y de apoyo a la gestión","Contratación directa","Prestación de servicios profesionales y de apoyo a la gestión, o para la ejecución de trabajos artísticos que sólo puedan encomendarse a determinadas personas naturales;","PRESTAR SERVICIOS PROFESIONALES PARA APOYAR EL ÁREA DE GESTIÓN DE DESARROLLO LOCAL DE FONTIBÓN EN TEMAS ORIENTADOS A SALUD EN LA LOCALIDAD -PROYECTO 1764 ","Inversión","Un nuevo Contrato Social y ambiental para la Bogotá del Siglo XXI",6,{"$f":"IF(ISERROR(VLOOKUP(K232,[2]Proposito_programa!$C$2:$E$59,2,FALSE)),\" \",VLOOKUP(K232,[2]Proposito_programa!$C$2:$E$59,2,FALSE))","v":"Sistema Distrital de Cuidado"},{"$f":"IF(ISERROR(VLOOKUP(K232,[2]Proposito_programa!$C$2:$E$59,3,FALSE)),\" \",VLOOKUP(K232,[2]Proposito_programa!$C$2:$E$59,3,FALSE))","v":"Propósito 1: Hacer un nuevo contrato social para incrementar la inclusión social, productiva y política"},1764,1,53080759,"VIVIANA ANDREA OJEDA VILLALBA","Persona Natural","-","-",null,17153266,null,0,0,17153266,10902500,"2021-09-02","2021-09-16","2021-01-13","118 DÍAS",0,0,null,null,null,null,null,null,"X",null,0.64]
[220,2021,"FDLF-CD-220-2021","https://community.secop.gov.co/Public/Tendering/OpportunityDetail/Index?noticeUID=CO1.NTC.2212842&isFromPublicArea=True&isModal=true&asPopupView=true","Contratos de prestación de servicios profesionales y de apoyo a la gestión","Contratación directa","Prestación de servicios profesionales y de apoyo a la gestión, o para la ejecución de trabajos artísticos que sólo puedan encomendarse a determinadas personas naturales;","PRESTAR SERVICIOS PROFESIONALES PARA APOYAR LA CREACIÓN E IMPLEMENTACIÓN DE MATERIAL DIDÁCTICO, VISUAL Y DE DIAGRAMACIÓN CONCERNIENTE A LOS PROCESOS DE FORTALECIMIENTO Y FORMACIÓN DE HABILIDADES, ACTITUDES Y DERECHOS DE LAS MUJERES EN LA LOCALIDAD DE FONTIBÓN. ","Inversión","Un nuevo Contrato Social y ambiental para la Bogotá del Siglo XXI",40,{"$f":"IF(ISERROR(VLOOKUP(K233,[2]Proposito_programa!$C$2:$E$59,2,FALSE)),\" \",VLOOKUP(K233,[2]Proposito_programa!$C$2:$E$59,2,FALSE))","v":"Más mujeres viven una vida libre de violencias, se sienten seguras y acceden con confianza al sistema de justicia"},{"$f":"IF(ISERROR(VLOOKUP(K233,[2]Proposito_programa!$C$2:$E$59,3,FALSE)),\" \",VLOOKUP(K233,[2]Proposito_programa!$C$2:$E$59,3,FALSE))","v":"Propósito 3: Inspirar confianza y legitimidad para vivir sin miedo y ser epicentro de cultura ciudadana, paz y reconciliación"},1774,1,53167503,"KARINA GUZMAN LEAL ","Persona Natural","-","-",null,17444000,null,1,3634167,21078167,13083000,"2021-09-01","2021-09-01","2022-01-25","122 DÍAS",1,25,null,null,null,null,null,null,"X",null,0.62]
[222,2021,"FDLF-CD-222-2021","https://community.secop.gov.co/Public/Tendering/OpportunityDetail/Index?noticeUID=CO1.NTC.2217474&isFromPublicArea=True&isModal=true&asPopupView=true","Contratos de prestación de servicios profesionales y de apoyo a la gestión","Contratación directa","Prestación de servicios profesionales y de apoyo a la gestión, o para la ejecución de trabajos artísticos que sólo puedan encomendarse a determinadas personas naturales;","PRESTAR SERVICIOS PROFESIONALES PARA APOYAR EL ÁREA DE GESTIÓN DEL DESARROLLO LOCAL DE FONTIBÓN COMO FORMADOR EN EL PROYECTO NO. 1758 EN LA ESCUELA DE FORMACIÓN DE LÍDERES Y EMPRENDEDORES COMUNITARIOS DESDE LAS ARTES.","Inversión","Un nuevo Contrato Social y ambiental para la Bogotá del Siglo XXI",21,{"$f":"IF(ISERROR(VLOOKUP(K234,[2]Proposito_programa!$C$2:$E$59,2,FALSE)),\" \",VLOOKUP(K234,[2]Proposito_programa!$C$2:$E$59,2,FALSE))","v":"Creación y vida cotidiana: Apropiación ciudadana del arte, la cultura y el patrimonio, para la democracia cultural"},{"$f":"IF(ISERROR(VLOOKUP(K234,[2]Proposito_programa!$C$2:$E$59,3,FALSE)),\" \",VLOOKUP(K234,[2]Proposito_programa!$C$2:$E$59,3,FALSE))","v":"Propósito 1: Hacer un nuevo contrato social para incrementar la inclusión social, productiva y política"},1758,1,19261812,"GERMAN HIPÓLITO BETANCOURT LOPEZ","Persona Natural","-","-",null,17153266,null,0,0,17153266," $                          -  ","2021-09-02","2021-09-29","2022-01-26","118 DÍAS",0,0,null,null,null,null,null,null,"X",null,0]
[223,2021,"FDLF-CD-223-2021","https://community.secop.gov.co/Public/Tendering/OpportunityDetail/Index?noticeUID=CO1.NTC.2217636&isFromPublicArea=True&isModal=true&asPopupView=true","Contratos de prestación de servicios profesionales y de apoyo a la gestión","Contratación directa","Prestación de servicios profesionales y de apoyo a la gestión, o para la ejecución de trabajos artísticos que sólo puedan encomendarse a determinadas personas naturales;","PRESTAR SERVICIOS PROFESIONALES PARA APOYAR EL ÁREA DE GESTIÓN DEL DESARROLLO LOCAL DE FONTIBÓN COMO FORMADOR EN EL PROYECTO NO. 1758 EN LA ESCUELA DE FORMACIÓN DE LÍDERES Y EMPRENDEDORES COMUNITARIOS DESDE LAS ARTES.","Inversión","Un nuevo Contrato Social y ambiental para la Bogotá del Siglo XXI",21,{"$f":"IF(ISERROR(VLOOKUP(K235,[2]Proposito_programa!$C$2:$E$59,2,FALSE)),\" \",VLOOKUP(K235,[2]Proposito_programa!$C$2:$E$59,2,FALSE))","v":"Creación y vida cotidiana: Apropiación ciudadana del arte, la cultura y el patrimonio, para la democracia cultural"},{"$f":"IF(ISERROR(VLOOKUP(K235,[2]Proposito_programa!$C$2:$E$59,3,FALSE)),\" \",VLOOKUP(K235,[2]Proposito_programa!$C$2:$E$59,3,FALSE))","v":"Propósito 1: Hacer un nuevo contrato social para incrementar la inclusión social, productiva y política"},1758,1,52231922,"ANGELICA YOLANDA GOMEZ BOLIVAR","Persona Natural","-","-",null,17153266,null,0,0,17153266," $                          -  ","2021-09-02","2021-09-29","2022-04-02","118 DÍAS",0,0,null,null,null,null,null,null,"X",null,0]
[225,2021,"FDLF-LP-2-2021","https://community.secop.gov.co/Public/Tendering/OpportunityDetail/Index?noticeUID=CO1.NTC.2161923&isFromPublicArea=True&isModal=False","Contratos de prestación de servicios","Licitación pública","No aplica","PRESTAR EL SERVICIO DE VIGILANCIA Y SEGURIDAD PRIVADA LAS 24 HORAS Y LOS 7 DÍAS DE LA SEMANA, CON APOYO TECNOLÓGICO PARA LOS PREDIOS DE PROPIEDAD Y/O TENENCIA QUE SE ENCUENTREN A NOMBRE DEL FONDO DE DESARROLLO LOCAL DE FONTIBÓN, ASÍ COMO VELAR POR LA SEGURIDAD DE LAS PERSONAS Y LA CUSTODIA DE LOS BIENES MUEBLES Y ENSERES QUE SE ENCUENTREN DENTRO DE DICHOS PREDIOS","Funcionamiento","Un nuevo Contrato Social y ambiental para la Bogotá del Siglo XXI","No aplica",{"$f":"IF(ISERROR(VLOOKUP(K236,[2]Proposito_programa!$C$2:$E$59,2,FALSE)),\" \",VLOOKUP(K236,[2]Proposito_programa!$C$2:$E$59,2,FALSE))","v":" "},{"$f":"IF(ISERROR(VLOOKUP(K236,[2]Proposito_programa!$C$2:$E$59,3,FALSE)),\" \",VLOOKUP(K236,[2]Proposito_programa!$C$2:$E$59,3,FALSE))","v":" "},501,30,"860526603-1","SEGURIDAD EL PENTÁGONO COLOMBIANO LIMITADA - SEPECOL LTDA","Persona Jurídica","-","-",null,523310241,null,0,0,523310241," $                          -  ","2021-09-10","2021-09-12","2022-03-01","170 DÍAS",0,0,null,null,null,null,null,"X",null,null,0]
[226,2021,"FDLF-CD-226-2021","https://community.secop.gov.co/Public/Tendering/OpportunityDetail/Index?noticeUID=CO1.NTC.2257283&isFromPublicArea=True&isModal=true&asPopupView=true","Contratos de prestación de servicios profesionales y de apoyo a la gestión","Contratación directa","Prestación de servicios profesionales y de apoyo a la gestión, o para la ejecución de trabajos artísticos que sólo puedan encomendarse a determinadas personas naturales;","APOYAR EL ALCALDE LOCAL EN LA GESTIÓN DE LOS ASUNTOS RELACIONADOS CON SEGURIDAD CIUDADANA, CONVIVENCIA Y PREVENCIÓN DE CONFLICTIVIDADES, VIOLENCIAS Y DELITOS EN LA LOCALIDAD, DE CONFORMIDAD CON EL MARCO NORMATIVO APLICABLE EN LA MATERIA","Inversión","Un nuevo Contrato Social y ambiental para la Bogotá del Siglo XXI",48,{"$f":"IF(ISERROR(VLOOKUP(K237,[2]Proposito_programa!$C$2:$E$59,2,FALSE)),\" \",VLOOKUP(K237,[2]Proposito_programa!$C$2:$E$59,2,FALSE))","v":"Plataforma institucional para la seguridad y justicia"},{"$f":"IF(ISERROR(VLOOKUP(K237,[2]Proposito_programa!$C$2:$E$59,3,FALSE)),\" \",VLOOKUP(K237,[2]Proposito_programa!$C$2:$E$59,3,FALSE))","v":"Propósito 3: Inspirar confianza y legitimidad para vivir sin miedo y ser epicentro de cultura ciudadana, paz y reconciliación"},2007,1,1019045244,"JULIETH JOHANA GARCIA LOPEZ","Persona Natural","-","-",null,22893333,null,1,4986667,27880000,null,"2021-09-17","2021-09-24","2022-01-04","131 DÍAS",1,22,null,null,null,null,null,null,"X",null,0.74]
[229,2021,"FDLF-CD-229-2021","https://community.secop.gov.co/Public/Tendering/OpportunityDetail/Index?noticeUID=CO1.NTC.2277345&isFromPublicArea=True&isModal=true&asPopupView=true","Contratos de prestación de servicios profesionales y de apoyo a la gestión","Contratación directa","Prestación de servicios profesionales y de apoyo a la gestión, o para la ejecución de trabajos artísticos que sólo puedan encomendarse a determinadas personas naturales;","PRESTAR SERVICIOS PROFESIONALES ESPECIALIZADOS PARA ACOMPAÑAR AL ALCALDE LOCAL EN EL SEGUIMIENTO Y REVISIÓN DE LAS ETAPAS PRECONTRACTUALES Y CONTRACTUALES DE ACUERDO CON EL PLAN DE ADQUISICIONES EN DESARROLLO DE LOS RECURSOS ASIGNADOS AL FONDO DE DESARROLLO LOCAL DE FONTIBÓN.","Inversión","Un nuevo Contrato Social y ambiental para la Bogotá del Siglo XXI",57,{"$f":"IF(ISERROR(VLOOKUP(K238,[2]Proposito_programa!$C$2:$E$59,2,FALSE)),\" \",VLOOKUP(K238,[2]Proposito_programa!$C$2:$E$59,2,FALSE))","v":"Gestión pública local"},{"$f":"IF(ISERROR(VLOOKUP(K238,[2]Proposito_programa!$C$2:$E$59,3,FALSE)),\" \",VLOOKUP(K238,[2]Proposito_programa!$C$2:$E$59,3,FALSE))","v":"Propósito 5: Construir Bogotá - Región con gobierno abierto, transparente y ciudadanía consciente"},1783,1,1014213880,"LINA MARCELA FLOREZ CARDENAS","Persona Natural","-","-",null,24840000,null,1,7176000,32016000,17112000,"2021-09-27","2021-09-29","2021-12-28","90 DÍAS",1,26,null,null,null,null,null,null,"X",null,0.53]
[230,2021,"FDLF-CD-230-2021","https://community.secop.gov.co/Public/Tendering/OpportunityDetail/Index?noticeUID=CO1.NTC.2279258&isFromPublicArea=True&isModal=true&asPopupView=true","Contratos de prestación de servicios profesionales y de apoyo a la gestión","Contratación directa","Prestación de servicios profesionales y de apoyo a la gestión, o para la ejecución de trabajos artísticos que sólo puedan encomendarse a determinadas personas naturales;","PRESTAR SERVICIOS PROFESIONALES ESPECIALIZADOS COMO APOYO AL DESPACHO DEL ALCALDE LOCAL EN LA REVISIÓN DE LOS ASPECTOS ADMINISTRATIVOS Y GERENCIALES, APOYANDO LA ARTICULACIÓN DE MANERA TRANSVERSAL DE TODAS LABORES DE LOS DIFERENTES GRUPOS PARA CUMPLIR CON LA MISIÓN DE LA ALCALDÍA LOCAL DE FONTIBÓN.","Inversión","Un nuevo Contrato Social y ambiental para la Bogotá del Siglo XXI",57,{"$f":"IF(ISERROR(VLOOKUP(K239,[2]Proposito_programa!$C$2:$E$59,2,FALSE)),\" \",VLOOKUP(K239,[2]Proposito_programa!$C$2:$E$59,2,FALSE))","v":"Gestión pública local"},{"$f":"IF(ISERROR(VLOOKUP(K239,[2]Proposito_programa!$C$2:$E$59,3,FALSE)),\" \",VLOOKUP(K239,[2]Proposito_programa!$C$2:$E$59,3,FALSE))","v":"Propósito 5: Construir Bogotá - Región con gobierno abierto, transparente y ciudadanía consciente"},1783,1,1057579523,"JAVIER PRIETO TRISTANCHO","Persona Natural","-","-",null,25500000,null,1,7366667,32866667,17566667,"2021-09-27","2021-09-29","2022-01-24","90 DÍAS",1,26,null,null,null,null,null,null,"X",null,0.53]
[231,2021,"FDLF-CD-231-2021","https://community.secop.gov.co/Public/Tendering/OpportunityDetail/Index?noticeUID=CO1.NTC.2280090&isFromPublicArea=True&isModal=true&asPopupView=true","Contratos de prestación de servicios profesionales y de apoyo a la gestión","Contratación directa","Prestación de servicios profesionales y de apoyo a la gestión, o para la ejecución de trabajos artísticos que sólo puedan encomendarse a determinadas personas naturales;","PRESTAR SERVICIOS PROFESIONALES ESPECIALIZADOS PARA APOYAR AL DESPACHO DEL ALCALDE LOCAL EN EL ACOMPAÑAMIENTO A ACTIVIDADES TANTO ADMINISTRATIVAS COMO EN CAMPO DE MANERA TRANSVERSAL CON EQUIPOS DE TRABAJO INTERNO Y COMUNIDAD DE LA LOCALIDAD DE FONTIBÓN.","Inversión","Un nuevo Contrato Social y ambiental para la Bogotá del Siglo XXI",57,{"$f":"IF(ISERROR(VLOOKUP(K240,[2]Proposito_programa!$C$2:$E$59,2,FALSE)),\" \",VLOOKUP(K240,[2]Proposito_programa!$C$2:$E$59,2,FALSE))","v":"Gestión pública local"},{"$f":"IF(ISERROR(VLOOKUP(K240,[2]Proposito_programa!$C$2:$E$59,3,FALSE)),\" \",VLOOKUP(K240,[2]Proposito_programa!$C$2:$E$59,3,FALSE))","v":"Propósito 5: Construir Bogotá - Región con gobierno abierto, transparente y ciudadanía consciente"},1783,1,1032449752,"BRANDON RENE BARRIENTOS MARTINEZ","Persona Natural","-","-",null,22500000,null,1,5750000,28250000,15500000,"2021-09-29","2021-09-29","2022-01-21","90 DÍAS",1,23,null,null,null,null,null,null,"X",null,0.55000000000000004]
[232,2021,"FDLF-CD-232-2021","https://community.secop.gov.co/Public/Tendering/OpportunityDetail/Index?noticeUID=CO1.NTC.2330214&isFromPublicArea=True&isModal=true&asPopupView=true","Contratos de prestación de servicios profesionales y de apoyo a la gestión","Contratación directa","Prestación de servicios profesionales y de apoyo a la gestión, o para la ejecución de trabajos artísticos que sólo puedan encomendarse a determinadas personas naturales;","PRESTAR LOS SERVICIOS PROFESIONALES PARA DESARROLLAR LA PRE PRODUCCIÓN, PRODUCCIÓN Y POST PRODUCCIÓN OPERATIVA DE LAS ACTIVIDADES Y ESPACIOS DE PARTICIPACIÓN QUE SE DESARROLLEN EN TERRITORIO DE ACUERDO CON LAS NECESIDADES DE LAS ÁREAS DE LA ALCALDÍA LOCAL DE FONTIBÓN.","Inversión","Un nuevo Contrato Social y ambiental para la Bogotá del Siglo XXI",55,{"$f":"IF(ISERROR(VLOOKUP(K241,[2]Proposito_programa!$C$2:$E$59,2,FALSE)),\" \",VLOOKUP(K241,[2]Proposito_programa!$C$2:$E$59,2,FALSE))","v":"Fortalecimiento de cultura ciudadana y su institucionalidad"},{"$f":"IF(ISERROR(VLOOKUP(K241,[2]Proposito_programa!$C$2:$E$59,3,FALSE)),\" \",VLOOKUP(K241,[2]Proposito_programa!$C$2:$E$59,3,FALSE))","v":"Propósito 5: Construir Bogotá - Región con gobierno abierto, transparente y ciudadanía consciente"},1782,1,11202142,"ORLANDO ANDRÉS CUEVAS VALENCIA","Persona Natural","-","-",null,18600000,null,0,0,18600000,7440000,"2021-10-20","2021-10-25","2022-01-24","90 DÍAS",0,0,null,null,null,null,null,null,"X",null,0.4]
[233,2021,"FDLF-CD-233-2021","https://community.secop.gov.co/Public/Tendering/OpportunityDetail/Index?noticeUID=CO1.NTC.2283334&isFromPublicArea=True&isModal=true&asPopupView=true","Contratos de prestación de servicios profesionales y de apoyo a la gestión","Contratación directa","Prestación de servicios profesionales y de apoyo a la gestión, o para la ejecución de trabajos artísticos que sólo puedan encomendarse a determinadas personas naturales;","PRESTAR SERVICIOS PROFESIONALES ESPECIALIZADOS EN EL ÁREA DE GESTIÓN DEL DESARROLLO, PARA LIDERAR LA FORMULACIÓN, SEGUIMIENTO Y EVALUACIÓN DE POLÍTICAS, PLANES, PROGRAMAS Y PROYECTOS DE DESARROLLO LOCAL, PARA EL CUMPLIMIENTO DE LAS METAS DEL PLAN DE DESARROLLO LOCAL DE FONTIBÓN.","Inversión","Un nuevo Contrato Social y ambiental para la Bogotá del Siglo XXI",57,{"$f":"IF(ISERROR(VLOOKUP(K242,[2]Proposito_programa!$C$2:$E$59,2,FALSE)),\" \",VLOOKUP(K242,[2]Proposito_programa!$C$2:$E$59,2,FALSE))","v":"Gestión pública local"},{"$f":"IF(ISERROR(VLOOKUP(K242,[2]Proposito_programa!$C$2:$E$59,3,FALSE)),\" \",VLOOKUP(K242,[2]Proposito_programa!$C$2:$E$59,3,FALSE))","v":"Propósito 5: Construir Bogotá - Región con gobierno abierto, transparente y ciudadanía consciente"},1783,1,53097642,"DIANA CAROLINA GIRALDO MAYORGA","Persona Natural","-","-",null,21000000,null,1,4200000,25200000,14000000,"2021-09-30","2021-10-01","2022-01-18","90 DÍAS",1,18,null,null,null,null,null,null,"X",null,0.56000000000000005]
[234,2021,"FDLF-CD-234-2021","https://community.secop.gov.co/Public/Tendering/OpportunityDetail/Index?noticeUID=CO1.NTC.2298723&isFromPublicArea=True&isModal=true&asPopupView=true","Contratos de prestación de servicios profesionales y de apoyo a la gestión","Contratación directa","Prestación de servicios profesionales y de apoyo a la gestión, o para la ejecución de trabajos artísticos que sólo puedan encomendarse a determinadas personas naturales;","PRESTAR SERVICIOS PROFESIONALES ESPECIALIZADOS PARA APOYAR AL ÁREA DE GESTIÓN DE DESARROLLO EN LOS ASUNTOS RELACIONADOS CON LOS PROCESOS DE ESPACIO PÚBLICO INTEGRAL DEL FDLF, DE CONFORMIDAD CON EL MARCO NORMATIVO APLICABLE EN LA MATERIA.","Inversión","Un nuevo Contrato Social y ambiental para la Bogotá del Siglo XXI",57,{"$f":"IF(ISERROR(VLOOKUP(K243,[2]Proposito_programa!$C$2:$E$59,2,FALSE)),\" \",VLOOKUP(K243,[2]Proposito_programa!$C$2:$E$59,2,FALSE))","v":"Gestión pública local"},{"$f":"IF(ISERROR(VLOOKUP(K243,[2]Proposito_programa!$C$2:$E$59,3,FALSE)),\" \",VLOOKUP(K243,[2]Proposito_programa!$C$2:$E$59,3,FALSE))","v":"Propósito 5: Construir Bogotá - Región con gobierno abierto, transparente y ciudadanía consciente"},1783,1,1015394640,"FRANK JAMIR CUADROS GUATAQUIRÁ","Persona Natural","-","-",null,22908000,null,1,3588000,26496000,13524000,"2021-10-07","2021-10-12","2022-01-04","83 DÍAS",1,13,null,null,null,null,null,null,"X",null,0.51]
[235,2021,"FDLF-CD-235-2021","https://community.secop.gov.co/Public/Tendering/OpportunityDetail/Index?noticeUID=CO1.NTC.2282582&isFromPublicArea=True&isModal=true&asPopupView=true","Contratos de prestación de servicios profesionales y de apoyo a la gestión","Contratación directa","Prestación de servicios profesionales y de apoyo a la gestión, o para la ejecución de trabajos artísticos que sólo puedan encomendarse a determinadas personas naturales;","PRESTAR SERVICIOS PROFESIONALES EN LA IMPLEMENTACIÓN DE ACCIONES PARA CAMBIAR HÁBITOS DE CONSUMO SEGÚN LO ESTABLECIDO EN EL PROYECTO DE INVERSIÓN LOCAL 1772.","Inversión","Un nuevo Contrato Social y ambiental para la Bogotá del Siglo XXI",38,{"$f":"IF(ISERROR(VLOOKUP(K244,[2]Proposito_programa!$C$2:$E$59,2,FALSE)),\" \",VLOOKUP(K244,[2]Proposito_programa!$C$2:$E$59,2,FALSE))","v":"Ecoeficiencia, reciclaje, manejo de residuos e inclusión de la población recicladora"},{"$f":"IF(ISERROR(VLOOKUP(K244,[2]Proposito_programa!$C$2:$E$59,3,FALSE)),\" \",VLOOKUP(K244,[2]Proposito_programa!$C$2:$E$59,3,FALSE))","v":"Propósito 2 : Cambiar Nuestros Hábitos de Vida para Reverdecer a Bogotá y Adaptarnos y Mitigar la Crisis Climática"},1772,1,1022378096,"ROLF GUNTHER STRAUSS LAVERDE","Persona Natural","-","-",null,14991000,null,1,4830433,19821433,9994000,"2021-09-30","2021-10-01","2022-01-24","90 DÍAS",1,29,null,null,null,null,null,null,"X",null,0.5]
[236,2021,"FDLF-CD-236-2021","https://community.secop.gov.co/Public/Tendering/OpportunityDetail/Index?noticeUID=CO1.NTC.2282685&isFromPublicArea=True&isModal=true&asPopupView=true","Contratos de prestación de servicios profesionales y de apoyo a la gestión","Contratación directa","Prestación de servicios profesionales y de apoyo a la gestión, o para la ejecución de trabajos artísticos que sólo puedan encomendarse a determinadas personas naturales;","PRESTAR LOS SERVICIOS PARA EL APOYO TÉCNICO EN LA CONDUCCIÓN DE VEHÍCULOS AL SERVICIO DE LA ALCALDÍA LOCAL DE FONTIBÓN","Inversión","Un nuevo Contrato Social y ambiental para la Bogotá del Siglo XXI",57,{"$f":"IF(ISERROR(VLOOKUP(K245,[2]Proposito_programa!$C$2:$E$59,2,FALSE)),\" \",VLOOKUP(K245,[2]Proposito_programa!$C$2:$E$59,2,FALSE))","v":"Gestión pública local"},{"$f":"IF(ISERROR(VLOOKUP(K245,[2]Proposito_programa!$C$2:$E$59,3,FALSE)),\" \",VLOOKUP(K245,[2]Proposito_programa!$C$2:$E$59,3,FALSE))","v":"Propósito 5: Construir Bogotá - Región con gobierno abierto, transparente y ciudadanía consciente"},1783,1,1023885412,"YIMI OSWALDO GOMEZ CRISTIANO","Persona Natural","-","-",null,10800000,null,1,2640000,13440000,7200000,"2021-09-29","2021-10-01","2022-01-22","90 DÍAS",1,22,null,null,null,null,null,null,"X",null,0.54]
[237,2021,"FDLF-CD-237-2021","https://community.secop.gov.co/Public/Tendering/OpportunityDetail/Index?noticeUID=CO1.NTC.2286632&isFromPublicArea=True&isModal=true&asPopupView=true","Contratos de prestación de servicios profesionales y de apoyo a la gestión","Contratación directa","Prestación de servicios profesionales y de apoyo a la gestión, o para la ejecución de trabajos artísticos que sólo puedan encomendarse a determinadas personas naturales;","PRESTAR SERVICIOS COMO PROFESIONAL ESPECIALIZADO PARA ARTICULAR Y DESARROLLAR LOS PROCESOS DE SEGURIDAD Y CONVIVENCIA; Y MEJORAR LOS INDICIES Y PERCEPCIÓN DE SEGURIDAD DE MANERA INTERINSTITUCIONAL EN LA LOCALIDAD.","Inversión","Un nuevo Contrato Social y ambiental para la Bogotá del Siglo XXI",43,{"$f":"IF(ISERROR(VLOOKUP(K246,[2]Proposito_programa!$C$2:$E$59,2,FALSE)),\" \",VLOOKUP(K246,[2]Proposito_programa!$C$2:$E$59,2,FALSE))","v":"Cultura ciudadana para la confianza, la convivencia y la participación desde la vida cotidiana"},{"$f":"IF(ISERROR(VLOOKUP(K246,[2]Proposito_programa!$C$2:$E$59,3,FALSE)),\" \",VLOOKUP(K246,[2]Proposito_programa!$C$2:$E$59,3,FALSE))","v":"Propósito 3: Inspirar confianza y legitimidad para vivir sin miedo y ser epicentro de cultura ciudadana, paz y reconciliación"},1775,1,1015999291,"CAMILO ANDRES RINCÓN GONZALEZ","Persona Natural","-","-",null,22500000,null,1,5500000,28000000,15000000,"2021-10-01","2021-10-01","2022-01-22","90 DÍAS",1,22,null,null,null,null,null,null,"X",null,0.54]
[238,2021,"FDLF-CD-238-2021","https://community.secop.gov.co/Public/Tendering/OpportunityDetail/Index?noticeUID=CO1.NTC.2297826&isFromPublicArea=True&isModal=true&asPopupView=true","Contratos de prestación de servicios profesionales y de apoyo a la gestión","Contratación directa","Prestación de servicios profesionales y de apoyo a la gestión, o para la ejecución de trabajos artísticos que sólo puedan encomendarse a determinadas personas naturales;","PRESTAR LOS SERVICIOS PROFESIONALES A LA ALCALDÍA LOCAL DE FONTIBÓN, PARA LA FORMULACIÓN, EVALUACIÓN, SEGUIMIENTO Y APOYO A LA SUPERVISIÓN DEL PROYECTO DE VÍCTIMAS ASÍ COMO EL ACOMPAÑAMIENTO A LOS PROCESOS QUE SE ADELANTEN PARA LA POBLACIÓN DE VÍCTIMAS QUE HABITA EN LA LOCALIDAD.","Inversión","Un nuevo Contrato Social y ambiental para la Bogotá del Siglo XXI",39,{"$f":"IF(ISERROR(VLOOKUP(K247,[2]Proposito_programa!$C$2:$E$59,2,FALSE)),\" \",VLOOKUP(K247,[2]Proposito_programa!$C$2:$E$59,2,FALSE))","v":"Bogotá territorio de paz y atención integral a las víctimas del conflicto armado"},{"$f":"IF(ISERROR(VLOOKUP(K247,[2]Proposito_programa!$C$2:$E$59,3,FALSE)),\" \",VLOOKUP(K247,[2]Proposito_programa!$C$2:$E$59,3,FALSE))","v":"Propósito 3: Inspirar confianza y legitimidad para vivir sin miedo y ser epicentro de cultura ciudadana, paz y reconciliación"},1773,1,1019019648,"DIANA MARCELA TIBATA AVELLANEDA","Persona Natural","-","-",null,16800000,null,1,4400000,21200000,9800000,"2021-10-07","2021-10-12","2022-01-27","84 DÍAS",1,22,null,null,null,null,null,null,"X",null,0.46]
[239,2021,"FDLF-CD-239-2021","https://community.secop.gov.co/Public/Tendering/OpportunityDetail/Index?noticeUID=CO1.NTC.2322227&isFromPublicArea=True&isModal=true&asPopupView=true","Contratos de prestación de servicios profesionales y de apoyo a la gestión","Contratación directa","Prestación de servicios profesionales y de apoyo a la gestión, o para la ejecución de trabajos artísticos que sólo puedan encomendarse a determinadas personas naturales;","PRESTAR SERVICIOS PROFESIONALES PARA APOYAR JURÍDICAMENTE LOS DIFERENTES PROCESOS QUE REQUIERA ADELANTAR LA ALCALDÍA LOCAL DE FONTIBÓN DESDE LAS ETAPAS PRECONTRACTUAL Y CONTRACTUAL, DE ACUERDO CON EL PLAN DE ADQUISICIONES Y AL PLAN DE CONTRATACIÓN ","Inversión","Un nuevo Contrato Social y ambiental para la Bogotá del Siglo XXI",57,{"$f":"IF(ISERROR(VLOOKUP(K248,[2]Proposito_programa!$C$2:$E$59,2,FALSE)),\" \",VLOOKUP(K248,[2]Proposito_programa!$C$2:$E$59,2,FALSE))","v":"Gestión pública local"},{"$f":"IF(ISERROR(VLOOKUP(K248,[2]Proposito_programa!$C$2:$E$59,3,FALSE)),\" \",VLOOKUP(K248,[2]Proposito_programa!$C$2:$E$59,3,FALSE))","v":"Propósito 5: Construir Bogotá - Región con gobierno abierto, transparente y ciudadanía consciente"},1783,1,13617614,"OTTO GABRIEL FORERO VANEGAS","Persona Natural","-","-",null,17000000,null,1,3400000,20400000,9520000,"2021-10-19","2021-10-19","2022-01-18","75 DÍAS",1,15,null,null,null,null,null,null,"X",null,0.47]
[240,2021,"FDLF-CD-240-2021","https://community.secop.gov.co/Public/Tendering/OpportunityDetail/Index?noticeUID=CO1.NTC.2315078&isFromPublicArea=True&isModal=true&asPopupView=true","Contratos de prestación de servicios profesionales y de apoyo a la gestión","Contratación directa","Prestación de servicios profesionales y de apoyo a la gestión, o para la ejecución de trabajos artísticos que sólo puedan encomendarse a determinadas personas naturales;","PRESTAR SERVICIOS PROFESIONALES PARA APOYAR EL SEGUIMIENTO TÉCNICO Y OPERATIVO DE LOS PROYECTOS DE INVERSIÓN RELACIONADOS CON TEMAS DE REACTIVACIÓN ECONÓMICA, EN EL MARCO DE LAS NECESIDADES DE LA ALCALDÍA DE FONTIBÓN. ","Inversión","Un nuevo Contrato Social y ambiental para la Bogotá del Siglo XXI",6,{"$f":"IF(ISERROR(VLOOKUP(K249,[2]Proposito_programa!$C$2:$E$59,2,FALSE)),\" \",VLOOKUP(K249,[2]Proposito_programa!$C$2:$E$59,2,FALSE))","v":"Sistema Distrital de Cuidado"},{"$f":"IF(ISERROR(VLOOKUP(K249,[2]Proposito_programa!$C$2:$E$59,3,FALSE)),\" \",VLOOKUP(K249,[2]Proposito_programa!$C$2:$E$59,3,FALSE))","v":"Propósito 1: Hacer un nuevo contrato social para incrementar la inclusión social, productiva y política"},1761,1,1010179168,"MONICA ALEJANDRA PERILLA FONTECHA","Persona Natural","-","-",null,15706666,null,1,5580000,21286666,9506667,"2021-10-14","2021-10-15","2022-01-27","76 DÍAS",1,27,null,null,null,null,null,null,"X",null,0.45]
[241,2021,"FDLF-CD-241-2021","https://community.secop.gov.co/Public/Tendering/OpportunityDetail/Index?noticeUID=CO1.NTC.2322490&isFromPublicArea=True&isModal=true&asPopupView=true","Contratos de prestación de servicios profesionales y de apoyo a la gestión","Contratación directa","Prestación de servicios profesionales y de apoyo a la gestión, o para la ejecución de trabajos artísticos que sólo puedan encomendarse a determinadas personas naturales;","PRESTAR SERVICIOS PROFESIONALES PARA APOYAR JURÍDICAMENTE LOS DIFERENTES PROCESOS QUE REQUIERA ADELANTAR LA ALCALDÍA LOCAL DE FONTIBÓN DESDE LAS ETAPAS PRECONTRACTUAL Y CONTRACTUAL, DE ACUERDO CON EL PLAN DE ADQUISICIONES Y AL PLAN DE CONTRATACIÓN ","Inversión","Un nuevo Contrato Social y ambiental para la Bogotá del Siglo XXI",57,{"$f":"IF(ISERROR(VLOOKUP(K250,[2]Proposito_programa!$C$2:$E$59,2,FALSE)),\" \",VLOOKUP(K250,[2]Proposito_programa!$C$2:$E$59,2,FALSE))","v":"Gestión pública local"},{"$f":"IF(ISERROR(VLOOKUP(K250,[2]Proposito_programa!$C$2:$E$59,3,FALSE)),\" \",VLOOKUP(K250,[2]Proposito_programa!$C$2:$E$59,3,FALSE))","v":"Propósito 5: Construir Bogotá - Región con gobierno abierto, transparente y ciudadanía consciente"},1783,1,1057547248,"WILMER FERNANDO PINZON BAEZ","Persona Natural","-","-",null,17000000,null,1,2946667,19946667,9066667,"2021-10-20","2021-10-21","2022-01-18","75 DÍAS",1,13,null,null,null,null,null,null,"X",null,0.45]
[242,2021,"FDLF-CD-242-2021","https://community.secop.gov.co/Public/Tendering/OpportunityDetail/Index?noticeUID=CO1.NTC.2330093&isFromPublicArea=True&isModal=true&asPopupView=true","Contratos de prestación de servicios profesionales y de apoyo a la gestión","Contratación directa","Prestación de servicios profesionales y de apoyo a la gestión, o para la ejecución de trabajos artísticos que sólo puedan encomendarse a determinadas personas naturales;","PRESTAR SERVICIOS TÉCNICOS DE APOYO Y ASISTENCIA ADMINISTRATIVA AL ÁREA DE GESTIÓN DEL DESARROLLO LOCAL, PARA FORTALECER LAS ETAPAS CONTRACTUALES DE ACUERDO CON EL PLAN ANUAL DE ADQUISICIONES DE LA ALCALDÍA LOCAL DE FONTIBÓN. ","Inversión","Un nuevo Contrato Social y ambiental para la Bogotá del Siglo XXI",57,{"$f":"IF(ISERROR(VLOOKUP(K251,[2]Proposito_programa!$C$2:$E$59,2,FALSE)),\" \",VLOOKUP(K251,[2]Proposito_programa!$C$2:$E$59,2,FALSE))","v":"Gestión pública local"},{"$f":"IF(ISERROR(VLOOKUP(K251,[2]Proposito_programa!$C$2:$E$59,3,FALSE)),\" \",VLOOKUP(K251,[2]Proposito_programa!$C$2:$E$59,3,FALSE))","v":"Propósito 5: Construir Bogotá - Región con gobierno abierto, transparente y ciudadanía consciente"},1783,1,1015463670,"LEIDY STEPHANIE ESTRADA VERA ","Persona Natural","-","-",null,9000000,null,1,1200000,10200000,4800000,"2021-10-20","2021-10-21","2022-01-15","75 DÍAS",1,10,null,null,null,null,null,null,"X",null,0.47]
[243,2021,"FDLF-CD-243-2021","https://community.secop.gov.co/Public/Tendering/OpportunityDetail/Index?noticeUID=CO1.NTC.2330423&isFromPublicArea=True&isModal=true&asPopupView=true","Contratos de prestación de servicios profesionales y de apoyo a la gestión","Contratación directa","Prestación de servicios profesionales y de apoyo a la gestión, o para la ejecución de trabajos artísticos que sólo puedan encomendarse a determinadas personas naturales;","PRESTAR SERVICIOS COMO PROFESIONAL ESPECIALIZADO PARA DESARROLLAR LOS PROCESOS DE PLANEACIÓN PARTICIPATIVA Y FOMENTAR LA PROMOCIÓN, ACOMPAÑAMIENTO, COORDINACIÓN DE LAS INSTANCIAS DE COORDINACIÓN INTERINSTITUCIONALES EN LA LOCALIDAD.","Inversión","Un nuevo Contrato Social y ambiental para la Bogotá del Siglo XXI",55,{"$f":"IF(ISERROR(VLOOKUP(K252,[2]Proposito_programa!$C$2:$E$59,2,FALSE)),\" \",VLOOKUP(K252,[2]Proposito_programa!$C$2:$E$59,2,FALSE))","v":"Fortalecimiento de cultura ciudadana y su institucionalidad"},{"$f":"IF(ISERROR(VLOOKUP(K252,[2]Proposito_programa!$C$2:$E$59,3,FALSE)),\" \",VLOOKUP(K252,[2]Proposito_programa!$C$2:$E$59,3,FALSE))","v":"Propósito 5: Construir Bogotá - Región con gobierno abierto, transparente y ciudadanía consciente"},1782,1,79733402,"ANDRES MAURICIO SARMIENTO MASMELA","Persona Natural","-","-",null,24840000,null,0,0,24840000," $                          -  ","2021-10-20","2021-10-22","2022-01-21","90 DÍAS",0,0,null,null,null,null,null,null,"X",null,0]
[244,2021,"FDLF-CD-244-2021","https://community.secop.gov.co/Public/Tendering/OpportunityDetail/Index?noticeUID=CO1.NTC.2330415&isFromPublicArea=True&isModal=true&asPopupView=true","Contratos de prestación de servicios profesionales y de apoyo a la gestión","Contratación directa","Prestación de servicios profesionales y de apoyo a la gestión, o para la ejecución de trabajos artísticos que sólo puedan encomendarse a determinadas personas naturales;","PRESTAR SERVICIOS PARA APOYAR JURÍDICAMENTE LA EJECUCIÓN DE LAS ACCIONES REQUERIDAS PARA EL TRAMITE E IMPULSO PROCESAL DE LAS ACTUACIONES CONTRAVENCIONALES Y/O QUERELLAS QUE CURSEN EN LAS INSPECCIONES DE POLICÍA DE LA LOCALIDAD.","Inversión","Un nuevo Contrato Social y ambiental para la Bogotá del Siglo XXI",57,{"$f":"IF(ISERROR(VLOOKUP(K253,[2]Proposito_programa!$C$2:$E$59,2,FALSE)),\" \",VLOOKUP(K253,[2]Proposito_programa!$C$2:$E$59,2,FALSE))","v":"Gestión pública local"},{"$f":"IF(ISERROR(VLOOKUP(K253,[2]Proposito_programa!$C$2:$E$59,3,FALSE)),\" \",VLOOKUP(K253,[2]Proposito_programa!$C$2:$E$59,3,FALSE))","v":"Propósito 5: Construir Bogotá - Región con gobierno abierto, transparente y ciudadanía consciente"},1784,1,1031152968,"NATALIA ALEJANDRA SEDANO GARZON","Persona Natural","-","-",null,11493099,null,0,0,11493099,6496100,"2021-10-22","2021-10-22","2021-12-30","69 DÍAS",0,0,null,null,null,null,null,null,"X",null,0.56999999999999995]
[245,2021,"FDLF-CD-245-2021","https://community.secop.gov.co/Public/Tendering/OpportunityDetail/Index?noticeUID=CO1.NTC.2340018&isFromPublicArea=True&isModal=true&asPopupView=true","Contratos de prestación de servicios profesionales y de apoyo a la gestión","Contratación directa","Prestación de servicios profesionales y de apoyo a la gestión, o para la ejecución de trabajos artísticos que sólo puedan encomendarse a determinadas personas naturales;","PRESTAR SERVICIOS PROFESIONALES ESPECIALIZADOS PARA APOYAR AL DESPACHO DEL ALCALDE LOCAL, EN LA REVISIÓN JURÍDICA DE LOS DOCUMENTOS DERIVADOS DE LA GESTIÓN EN LAS DIFERENTES ÁREAS DE LA ALCALDÍA LOCAL DE FONTIBÓN.","Inversión","Un nuevo Contrato Social y ambiental para la Bogotá del Siglo XXI",57,{"$f":"IF(ISERROR(VLOOKUP(K254,[2]Proposito_programa!$C$2:$E$59,2,FALSE)),\" \",VLOOKUP(K254,[2]Proposito_programa!$C$2:$E$59,2,FALSE))","v":"Gestión pública local"},{"$f":"IF(ISERROR(VLOOKUP(K254,[2]Proposito_programa!$C$2:$E$59,3,FALSE)),\" \",VLOOKUP(K254,[2]Proposito_programa!$C$2:$E$59,3,FALSE))","v":"Propósito 5: Construir Bogotá - Región con gobierno abierto, transparente y ciudadanía consciente"},1783,1,1010188621,"LINA MERCEDES GUZMÁN MOJICA","Persona Natural","-","-",null,17500000,null,0,0,17500000,7700000,"2021-10-27","2021-10-28","2022-01-12","75 DÍAS",0,0,null,null,null,null,null,null,"X",null,0.13]
[246,2021,"FDLF-CI-246-2021","https://community.secop.gov.co/Public/Tendering/OpportunityDetail/Index?noticeUID=CO1.NTC.2391520&isFromPublicArea=True&isModal=true&asPopupView=true","Convenios de cooperacion","Contratación directa","Contratos interadministrativos","AUNAR ESFUERZOS TÉCNICOS, ADMINISTRATIVOS Y FINANCIEROS ENTRE EL FONDO DE DESARROLLO LOCAL DE FONTIBON Y LA SUBRED INTEGRADA DE SERVICIOS DE SALUD SUR OCCIDENTE E.S.E PARA ENTREGA DE DISPOSITIVOS DE ASISTENCIAS PERSONAL- AYUDAS TECNICAS NO POS Y ACCIONES COMPLEMENTARIAS EN SALUD DIRIGIDO A PERSONAS CON DISCAPACIDAD Y SUS FAMILIAS Y/O CUIDADORES DE LA LOCALIDAD DE FONTIBON, DE ACUERDO CON LO ESTABLECIDO EN EL ANEXO TÉCNICO Y ESTUDIOS PREVIOS","Inversión","Un nuevo Contrato Social y ambiental para la Bogotá del Siglo XXI",6,{"$f":"IF(ISERROR(VLOOKUP(K255,[2]Proposito_programa!$C$2:$E$59,2,FALSE)),\" \",VLOOKUP(K255,[2]Proposito_programa!$C$2:$E$59,2,FALSE))","v":"Sistema Distrital de Cuidado"},{"$f":"IF(ISERROR(VLOOKUP(K255,[2]Proposito_programa!$C$2:$E$59,3,FALSE)),\" \",VLOOKUP(K255,[2]Proposito_programa!$C$2:$E$59,3,FALSE))","v":"Propósito 1: Hacer un nuevo contrato social para incrementar la inclusión social, productiva y política"},1764,1,900959048,"SUBRED INTEGRADA DE SERVICIOS DE SALUD SUR OCCIDENTE ESE.","Persona Jurídica","-","-",null,506139734,null,0,0,506139734," $                          -  ","2021-11-12","2021-12-27","2022-08-26","243 DÍAS",0,0,null,null,null,null,null,"X",null,null,0]
[247,2021,"FDLF-CD-247-2021","https://community.secop.gov.co/Public/Tendering/OpportunityDetail/Index?noticeUID=CO1.NTC.2332911&isFromPublicArea=True&isModal=true&asPopupView=true","Contratos de prestación de servicios profesionales y de apoyo a la gestión","Contratación directa","Prestación de servicios profesionales y de apoyo a la gestión, o para la ejecución de trabajos artísticos que sólo puedan encomendarse a determinadas personas naturales;","PRESTAR SERVICIOS PROFESIONALES PARA APOYAR AL ÁREA DE GESTIÓN DE DESARROLLO LOCAL EN LA FORMULACIÓN, PLANEACIÓN, PRESENTACIÓN Y SEGUIMIENTO DEL PROYECTO 1780 -UN NUEVO CONTRATO PARA MOVILIDAD EN FONTIBÓN-.","Inversión","Un nuevo Contrato Social y ambiental para la Bogotá del Siglo XXI",49,{"$f":"IF(ISERROR(VLOOKUP(K256,[2]Proposito_programa!$C$2:$E$59,2,FALSE)),\" \",VLOOKUP(K256,[2]Proposito_programa!$C$2:$E$59,2,FALSE))","v":"Movilidad segura, sostenible y accesible"},{"$f":"IF(ISERROR(VLOOKUP(K256,[2]Proposito_programa!$C$2:$E$59,3,FALSE)),\" \",VLOOKUP(K256,[2]Proposito_programa!$C$2:$E$59,3,FALSE))","v":"Propósito 4: Hacer de Bogotá Región un modelo de movilidad multimodal, incluyente y sostenible"},1780,1,1048849987,"MIGUEL ANDRES BEJARANO ALFONSO","Persona Natural","-","-",null,16250000,null,1,2600000,18850000,7800000,"2021-10-22","2021-10-25","2022-02-21","75 DÍAS",1,12,null,null,null,null,null,null,"X",null,0.12]
[248,2021,"FDLF-CD-248-2021","https://community.secop.gov.co/Public/Tendering/OpportunityDetail/Index?noticeUID=CO1.NTC.2334945&isFromPublicArea=True&isModal=true&asPopupView=true","Contratos de prestación de servicios profesionales y de apoyo a la gestión","Contratación directa","Prestación de servicios profesionales y de apoyo a la gestión, o para la ejecución de trabajos artísticos que sólo puedan encomendarse a determinadas personas naturales;","PRESTAR SERVICIOS PROFESIONALES PARA APOYAR JURÍDICAMENTE LOS DIFERENTES PROCESOS QUE REQUIERA ADELANTAR LA ALCALDÍA LOCAL DE FONTIBÓN DESDE LAS ETAPAS PRECONTRACTUAL Y CONTRACTUAL, DE ACUERDO CON EL PLAN DE ADQUISICIONES Y AL PLAN DE CONTRATACIÓN","Inversión","Un nuevo Contrato Social y ambiental para la Bogotá del Siglo XXI",57,{"$f":"IF(ISERROR(VLOOKUP(K257,[2]Proposito_programa!$C$2:$E$59,2,FALSE)),\" \",VLOOKUP(K257,[2]Proposito_programa!$C$2:$E$59,2,FALSE))","v":"Gestión pública local"},{"$f":"IF(ISERROR(VLOOKUP(K257,[2]Proposito_programa!$C$2:$E$59,3,FALSE)),\" \",VLOOKUP(K257,[2]Proposito_programa!$C$2:$E$59,3,FALSE))","v":"Propósito 5: Construir Bogotá - Región con gobierno abierto, transparente y ciudadanía consciente"},1783,1,1118814555,"YULIS PAOLA BRITO GUERRA","Persona Natural","-","-",null,17000000,null,0,0,{"$f":"Y257+V257+W257","v":17000000},6573333,"2021-10-26","2021-11-02","2022-01-17","75 DÍAS",0,0,null,null,null,null,null,null,"X",null,0.39]
[249,2021,"FDLF-CD-249-2021","https://community.secop.gov.co/Public/Tendering/OpportunityDetail/Index?noticeUID=CO1.NTC.2334946&isFromPublicArea=True&isModal=true&asPopupView=true","Contratos de prestación de servicios profesionales y de apoyo a la gestión","Contratación directa","Prestación de servicios profesionales y de apoyo a la gestión, o para la ejecución de trabajos artísticos que sólo puedan encomendarse a determinadas personas naturales;","PRESTAR SERVICIOS PROFESIONALES ESPECIALIZADOS PARA APOYAR AL DESPACHO DEL ALCALDE LOCAL DE FONTIBÓN EN LA REVISIÓN DE LOS ASPECTOS ADMINISTRATIVOS, FINANCIEROS Y OPERATIVOS PARA LAS ACCIONES DE FUNCIONAMIENTO CON LOS DIFERENTES GRUPOS QUE PERMITAN CUMPLIR CON LA MISIONALIDAD DE LA ALCALDÍA LOCAL.","Inversión","Un nuevo Contrato Social y ambiental para la Bogotá del Siglo XXI",57,{"$f":"IF(ISERROR(VLOOKUP(K258,[2]Proposito_programa!$C$2:$E$59,2,FALSE)),\" \",VLOOKUP(K258,[2]Proposito_programa!$C$2:$E$59,2,FALSE))","v":"Gestión pública local"},{"$f":"IF(ISERROR(VLOOKUP(K258,[2]Proposito_programa!$C$2:$E$59,3,FALSE)),\" \",VLOOKUP(K258,[2]Proposito_programa!$C$2:$E$59,3,FALSE))","v":"Propósito 5: Construir Bogotá - Región con gobierno abierto, transparente y ciudadanía consciente"},1783,1,81717512,"JUAN MANUEL BARRERA MONTERROSA","Persona Natural","-","-",null,20700000,null,0,0,20700000,9936000,"2021-10-22","2021-10-25","2022-02-10","75 DÍAS",0,0,null,null,null,null,null,null,"X",null,0.48]
[250,2021,"FDLF-CD-250-2021","https://community.secop.gov.co/Public/Tendering/OpportunityDetail/Index?noticeUID=CO1.NTC.2336160&isFromPublicArea=True&isModal=true&asPopupView=true","Contratos de prestación de servicios profesionales y de apoyo a la gestión","Contratación directa","Prestación de servicios profesionales y de apoyo a la gestión, o para la ejecución de trabajos artísticos que sólo puedan encomendarse a determinadas personas naturales;","PRESTAR SERVICIOS PROFESIONALES ESPECIALIZADOS EN EL ÁREA DE GESTIÓN DEL DESARROLLO LOCAL PARA EL FORTALECIMIENTO DE LA FUNCIÓN ADMINISTRATIVA Y DESARROLLO INSTITUCIONAL DEL COMPONENTE SOCIAL EN CUMPLIMIENTO A LAS METAS ESTABLECIDAS EN EL PLAN DE DESARROLLO LOCAL 2021-2024","Inversión","Un nuevo Contrato Social y ambiental para la Bogotá del Siglo XXI",57,{"$f":"IF(ISERROR(VLOOKUP(K259,[2]Proposito_programa!$C$2:$E$59,2,FALSE)),\" \",VLOOKUP(K259,[2]Proposito_programa!$C$2:$E$59,2,FALSE))","v":"Gestión pública local"},{"$f":"IF(ISERROR(VLOOKUP(K259,[2]Proposito_programa!$C$2:$E$59,3,FALSE)),\" \",VLOOKUP(K259,[2]Proposito_programa!$C$2:$E$59,3,FALSE))","v":"Propósito 5: Construir Bogotá - Región con gobierno abierto, transparente y ciudadanía consciente"},1783,1,52958432,"DIANA KATERINE RIVERA JIMENEZ","Persona Natural","-","-",null,17500000,null,1,1400000,18900000,7933333,"2021-10-25","2021-10-27","2022-01-17","75 DÍAS",1,6,null,null,null,null,null,null,"X",null,0.42]
[251,2021,"FDLF-CD-251-2021","https://community.secop.gov.co/Public/Tendering/OpportunityDetail/Index?noticeUID=CO1.NTC.2343551&isFromPublicArea=True&isModal=true&asPopupView=true","Contratos de prestación de servicios profesionales y de apoyo a la gestión","Contratación directa","Prestación de servicios profesionales y de apoyo a la gestión, o para la ejecución de trabajos artísticos que sólo puedan encomendarse a determinadas personas naturales;","Prestar servicios profesionales para apoyar la formulación y seguimiento de los proyectos de inversión relacionados con temas de salud, en el marco de las necesidades de la alcaldía local de Fontibón.","Inversión","Un nuevo Contrato Social y ambiental para la Bogotá del Siglo XXI",6,{"$f":"IF(ISERROR(VLOOKUP(K260,[2]Proposito_programa!$C$2:$E$59,2,FALSE)),\" \",VLOOKUP(K260,[2]Proposito_programa!$C$2:$E$59,2,FALSE))","v":"Sistema Distrital de Cuidado"},{"$f":"IF(ISERROR(VLOOKUP(K260,[2]Proposito_programa!$C$2:$E$59,3,FALSE)),\" \",VLOOKUP(K260,[2]Proposito_programa!$C$2:$E$59,3,FALSE))","v":"Propósito 1: Hacer un nuevo contrato social para incrementar la inclusión social, productiva y política"},1764,1,52515132,"JENNY ANDREA MONTOYA HERNANDEZ","Persona Natural","-","-",null,13866667,null,0,0,13866667,2600000,"2021-11-16","2021-11-19","2022-01-22","64 DÍAS",0,0,null,null,null,null,null,null,"X",null,0.19]
[252,2021,"FDLF-CD-252-2021","https://community.secop.gov.co/Public/Tendering/OpportunityDetail/Index?noticeUID=CO1.NTC.2343803&isFromPublicArea=True&isModal=true&asPopupView=true","Contratos de prestación de servicios profesionales y de apoyo a la gestión","Contratación directa","Prestación de servicios profesionales y de apoyo a la gestión, o para la ejecución de trabajos artísticos que sólo puedan encomendarse a determinadas personas naturales;","PRESTAR SERVICIOS PROFESIONALES PARA REALIZAR EL ACOMPAÑAMIENTO OPERATIVO Y COMUNITARIO A LOS DIFERENTES SECTORES POBLACIONALES Y SU INTERLOCUCIÓN CON LA JUNTA ADMINISTRADORA LOCAL DE FONTIBÓN","Inversión","Un nuevo Contrato Social y ambiental para la Bogotá del Siglo XXI",57,{"$f":"IF(ISERROR(VLOOKUP(K261,[2]Proposito_programa!$C$2:$E$59,2,FALSE)),\" \",VLOOKUP(K261,[2]Proposito_programa!$C$2:$E$59,2,FALSE))","v":"Gestión pública local"},{"$f":"IF(ISERROR(VLOOKUP(K261,[2]Proposito_programa!$C$2:$E$59,3,FALSE)),\" \",VLOOKUP(K261,[2]Proposito_programa!$C$2:$E$59,3,FALSE))","v":"Propósito 5: Construir Bogotá - Región con gobierno abierto, transparente y ciudadanía consciente"},1783,1,1122648996,"HENRY MAURICIO MENDOZA CRUZ","Persona Natural","-","-",null,8722000,null,1,1889767,10611767,3779533,"2021-03-11","2021-11-05","2022-01-04","60 DÍAS",0,0,null,null,null,null,null,null,"X",null,0.36]
[253,2021,"FDLF-CD-253-2021","https://community.secop.gov.co/Public/Tendering/OpportunityDetail/Index?noticeUID=CO1.NTC.2343804&isFromPublicArea=True&isModal=true&asPopupView=true","Contratos de prestación de servicios profesionales y de apoyo a la gestión","Contratación directa","Prestación de servicios profesionales y de apoyo a la gestión, o para la ejecución de trabajos artísticos que sólo puedan encomendarse a determinadas personas naturales;","PRESTAR SERVICIOS PROFESIONALES PARA APOYAR EL CUBRIMIENTO DE LAS ACTIVIDADES, CRONOGRAMAS Y AGENDA DE LA ALCALDÍA LOCAL A NIVEL INTERNO Y EXTERNO, ASÍ COMO LA GENERACIÓN DE CONTENIDOS PERIODÍSTICOS","Inversión","Un nuevo Contrato Social y ambiental para la Bogotá del Siglo XXI",57,{"$f":"IF(ISERROR(VLOOKUP(K262,[2]Proposito_programa!$C$2:$E$59,2,FALSE)),\" \",VLOOKUP(K262,[2]Proposito_programa!$C$2:$E$59,2,FALSE))","v":"Gestión pública local"},{"$f":"IF(ISERROR(VLOOKUP(K262,[2]Proposito_programa!$C$2:$E$59,3,FALSE)),\" \",VLOOKUP(K262,[2]Proposito_programa!$C$2:$E$59,3,FALSE))","v":"Propósito 5: Construir Bogotá - Región con gobierno abierto, transparente y ciudadanía consciente"},1783,1,1014262491,"ANA MARIA SALGADO","Persona Natural","-","-",null,9994000,null,1,4330733,14324733,5330133,"2021-10-27","2021-10-29","2021-12-28","60 DÍAS",1,26,null,null,null,null,null,null,"X",null,0.37]
[254,2021,"FDLF-CD-254-2021","https://community.secop.gov.co/Public/Tendering/OpportunityDetail/Index?noticeUID=CO1.NTC.2343615&isFromPublicArea=True&isModal=true&asPopupView=true","Contratos de prestación de servicios profesionales y de apoyo a la gestión","Contratación directa","Prestación de servicios profesionales y de apoyo a la gestión, o para la ejecución de trabajos artísticos que sólo puedan encomendarse a determinadas personas naturales;","PRESTAR SERVICIOS PROFESIONALES PARA EL APOYO ADMINISTRATIVO Y OPERATIVO DEL DESPACHO DE LA ALCALDÍA LOCAL DE FONTIBÓN.","Inversión","Un nuevo Contrato Social y ambiental para la Bogotá del Siglo XXI",57,{"$f":"IF(ISERROR(VLOOKUP(K263,[2]Proposito_programa!$C$2:$E$59,2,FALSE)),\" \",VLOOKUP(K263,[2]Proposito_programa!$C$2:$E$59,2,FALSE))","v":"Gestión pública local"},{"$f":"IF(ISERROR(VLOOKUP(K263,[2]Proposito_programa!$C$2:$E$59,3,FALSE)),\" \",VLOOKUP(K263,[2]Proposito_programa!$C$2:$E$59,3,FALSE))","v":"Propósito 5: Construir Bogotá - Región con gobierno abierto, transparente y ciudadanía consciente"},1783,1,52782734,"ADRIANA UMBARILA","Persona Natural","-","-",null,10176000,null,0,0,10176000,4215633,"2021-10-28","2021-11-02","2022-01-10","70 DÍAS",0,0,null,null,null,null,null,null,"X",null,0.41]
[255,2021,"FDLF-CD-255-2021","https://community.secop.gov.co/Public/Tendering/OpportunityDetail/Index?noticeUID=CO1.NTC.2351011&isFromPublicArea=True&isModal=true&asPopupView=true","Contratos de prestación de servicios profesionales y de apoyo a la gestión","Contratación directa","Prestación de servicios profesionales y de apoyo a la gestión, o para la ejecución de trabajos artísticos que sólo puedan encomendarse a determinadas personas naturales;","PRESTAR SERVICIOS PROFESIONALES EN EL ÁREA DE GESTIÓN DE DESARROLLO LOCAL, REALIZANDO ACTIVIDADES ESTADÍSTICAS DE LOS PROYECTOS DE INVERSIÓN, DATOS ABIERTOS, ASÍ COMO DE IDENTIFICACIÓN, GEORREFERENCIACIÓN Y ADQUISICIÓN DE INFORMACIÓN PREDIAL PARA LOS DIFERENTES PROYECTOS DE LA ALCALDÍA LOCAL DE FONTIBÓN","Inversión","Un nuevo Contrato Social y ambiental para la Bogotá del Siglo XXI",57,{"$f":"IF(ISERROR(VLOOKUP(K264,[2]Proposito_programa!$C$2:$E$59,2,FALSE)),\" \",VLOOKUP(K264,[2]Proposito_programa!$C$2:$E$59,2,FALSE))","v":"Gestión pública local"},{"$f":"IF(ISERROR(VLOOKUP(K264,[2]Proposito_programa!$C$2:$E$59,3,FALSE)),\" \",VLOOKUP(K264,[2]Proposito_programa!$C$2:$E$59,3,FALSE))","v":"Propósito 5: Construir Bogotá - Región con gobierno abierto, transparente y ciudadanía consciente"},1783,1,1026590821,"JESUS DAVID CAÑAS CORTES","Persona Natural","-","-",null,8722000,null,1,1744400,10466400,3924900,"2021-11-03","2021-11-04","2022-01-03","60 DÍAS",0,0,null,null,null,null,null,null,"X",null,0.38]
[256,2021,"FDLF-CD-256-2021","https://community.secop.gov.co/Public/Tendering/OpportunityDetail/Index?noticeUID=CO1.NTC.2351012&isFromPublicArea=True&isModal=true&asPopupView=true","Contratos de prestación de servicios profesionales y de apoyo a la gestión","Contratación directa","Prestación de servicios profesionales y de apoyo a la gestión, o para la ejecución de trabajos artísticos que sólo puedan encomendarse a determinadas personas naturales;","PRESTAR SERVICIOS PROFESIONALES ESPECIALIZADOS AL FONDO DE DESARROLLO LOCAL DE FONTIBÓN PARA APOYAR AL GRUPO ENCARGADO DE ADELANTAR LAS ACTUACIONES Y GESTIONES INHERENTES A LA DEPURACIÓN DE OBLIGACIONES POR PAGAR Y LA LIQUIDACIÓN Y PAGO DE LOS CONTRATOS SUSCRITOS CON RECURSOS DEL FDLF.","Inversión","Un nuevo Contrato Social y ambiental para la Bogotá del Siglo XXI",57,{"$f":"IF(ISERROR(VLOOKUP(K265,[2]Proposito_programa!$C$2:$E$59,2,FALSE)),\" \",VLOOKUP(K265,[2]Proposito_programa!$C$2:$E$59,2,FALSE))","v":"Gestión pública local"},{"$f":"IF(ISERROR(VLOOKUP(K265,[2]Proposito_programa!$C$2:$E$59,3,FALSE)),\" \",VLOOKUP(K265,[2]Proposito_programa!$C$2:$E$59,3,FALSE))","v":"Propósito 5: Construir Bogotá - Región con gobierno abierto, transparente y ciudadanía consciente"},1783,1,1022331077,"MARIA ANGELICA GARZON VERA","Persona Natural","-","-",null,16986667,null,1,1698667,18685334,7765333,"2021-10-29","2021-10-29","2022-01-07","70 DÍAS",1,7,null,null,null,null,null,null,"X",null,0.42]
[257,2021,"FDLF-CD-257-2021","https://community.secop.gov.co/Public/Tendering/OpportunityDetail/Index?noticeUID=CO1.NTC.2349144&isFromPublicArea=True&isModal=true&asPopupView=true","Contratos de prestación de servicios profesionales y de apoyo a la gestión","Contratación directa","Prestación de servicios profesionales y de apoyo a la gestión, o para la ejecución de trabajos artísticos que sólo puedan encomendarse a determinadas personas naturales;","PRESTAR SERVICIOS PARA APOYAR LA GESTIÓN DOCUMENTAL DE LA ALCALDÍA LOCAL EN LA IMPLEMENTACIÓN DE LOS PROCESOS DE CLASIFICACIÓN, ORDENACIÓN, SELECCIÓN NATURAL, FOLIACIÓN, IDENTIFICACIÓN, LEVANTAMIENTO DE INVENTARIOS, ALMACENAMIENTO Y APLICACIÓN DE PROTOCOLOS DE ELIMINACIÓN Y TRANSFERENCIAS DOCUMENTALES.","Inversión","Un nuevo Contrato Social y ambiental para la Bogotá del Siglo XXI",57,{"$f":"IF(ISERROR(VLOOKUP(K266,[2]Proposito_programa!$C$2:$E$59,2,FALSE)),\" \",VLOOKUP(K266,[2]Proposito_programa!$C$2:$E$59,2,FALSE))","v":"Gestión pública local"},{"$f":"IF(ISERROR(VLOOKUP(K266,[2]Proposito_programa!$C$2:$E$59,3,FALSE)),\" \",VLOOKUP(K266,[2]Proposito_programa!$C$2:$E$59,3,FALSE))","v":"Propósito 5: Construir Bogotá - Región con gobierno abierto, transparente y ciudadanía consciente"},1783,1,7187373,"JAIRO ANDRÉS BARAJAS TOCARRUNCHO","Persona Natural","-","-",null,5679077,null,0,0,5679077,2352760,"2021-10-29","2021-11-02","2022-01-10","70 DÍAS",0,0,null,null,null,null,null,null,"X",null,0.41]
[258,2021,"FDLF-CD-258-2021","https://community.secop.gov.co/Public/Tendering/OpportunityDetail/Index?noticeUID=CO1.NTC.2351214&isFromPublicArea=True&isModal=true&asPopupView=true","Contratos de prestación de servicios profesionales y de apoyo a la gestión","Contratación directa","Prestación de servicios profesionales y de apoyo a la gestión, o para la ejecución de trabajos artísticos que sólo puedan encomendarse a determinadas personas naturales;","PRESTAR SERVICIOS PROFESIONALES PARA APOYAR LA FORMULACIÓN, SEGUIMIENTO Y SUPERVISIÓN DE LOS PROCESOS CONTRACTUALES DERIVADOS DEL PROYECTO DE INVERSIÓN NO.1776, EN EL MARCO DE LAS NECESIDADES DE LA ALCALDÍA LOCAL DE FONTIBÓN","Inversión","Un nuevo Contrato Social y ambiental para la Bogotá del Siglo XXI",45,{"$f":"IF(ISERROR(VLOOKUP(K267,[2]Proposito_programa!$C$2:$E$59,2,FALSE)),\" \",VLOOKUP(K267,[2]Proposito_programa!$C$2:$E$59,2,FALSE))","v":"Espacio público más seguro y construido colectivamente"},{"$f":"IF(ISERROR(VLOOKUP(K267,[2]Proposito_programa!$C$2:$E$59,3,FALSE)),\" \",VLOOKUP(K267,[2]Proposito_programa!$C$2:$E$59,3,FALSE))","v":"Propósito 3: Inspirar confianza y legitimidad para vivir sin miedo y ser epicentro de cultura ciudadana, paz y reconciliación"},1776,1,1030551725,"JAIRO JULIAN RIVERA FONSECA","Persona Natural","-","-",null,14700000,null,1,2520000,17220000,5880000,"2021-10-29","2021-11-03","2022-01-11","70 DÍAS",1,12,null,null,null,null,null,null,"X",null,0.34]
[259,2021,"FDLF-CD-259-2021","https://community.secop.gov.co/Public/Tendering/OpportunityDetail/Index?noticeUID=CO1.NTC.2363383&isFromPublicArea=True&isModal=true&asPopupView=true","Contratos de prestación de servicios profesionales y de apoyo a la gestión","Contratación directa","Prestación de servicios profesionales y de apoyo a la gestión, o para la ejecución de trabajos artísticos que sólo puedan encomendarse a determinadas personas naturales;","PRESTAR SERVICIOS PARA APOYAR JURÍDICAMENTE LA EJECUCIÓN DE LAS ACCIONES REQUERIDAS PARA EL TRAMITE E IMPULSO PROCESAL DE LAS ACTUACIONES CONTRAVENCIONALES Y/O QUERELLAS QUE CURSEN EN LAS INSPECCIONES DE POLICÍA DE LA LOCALIDAD.","Inversión","Un nuevo Contrato Social y ambiental para la Bogotá del Siglo XXI",57,{"$f":"IF(ISERROR(VLOOKUP(K268,[2]Proposito_programa!$C$2:$E$59,2,FALSE)),\" \",VLOOKUP(K268,[2]Proposito_programa!$C$2:$E$59,2,FALSE))","v":"Gestión pública local"},{"$f":"IF(ISERROR(VLOOKUP(K268,[2]Proposito_programa!$C$2:$E$59,3,FALSE)),\" \",VLOOKUP(K268,[2]Proposito_programa!$C$2:$E$59,3,FALSE))","v":"Propósito 5: Construir Bogotá - Región con gobierno abierto, transparente y ciudadanía consciente"},1784,1,5831620,"RICAURTE TARQUINO BECERRA.","Persona Natural","-","-",null,8828033,null,0,0,8828033,3831033,"2021-11-05","2021-11-09","2022-01-01","53 DÍAS",0,0,null,null,null,null,null,null,"X",null,0.43]
[261,2021,"FDLF-CD-261-2021","https://community.secop.gov.co/Public/Tendering/OpportunityDetail/Index?noticeUID=CO1.NTC.2378856&isFromPublicArea=True&isModal=true&asPopupView=true","Contratos de prestación de servicios profesionales y de apoyo a la gestión","Contratación directa","Prestación de servicios profesionales y de apoyo a la gestión, o para la ejecución de trabajos artísticos que sólo puedan encomendarse a determinadas personas naturales;","PRESTAR SERVICIOS PARA APOYAR JURÍDICAMENTE LA EJECUCIÓN DE LAS ACCIONES REQUERIDAS PARA EL TRAMITE E IMPULSO PROCESAL DE LAS ACTUACIONES CONTRAVENCIONALES Y/O QUERELLAS QUE CURSEN EN LAS INSPECCIONES DE POLICÍA DE LA LOCALIDAD.","Inversión","Un nuevo Contrato Social y ambiental para la Bogotá del Siglo XXI",57,{"$f":"IF(ISERROR(VLOOKUP(K269,[2]Proposito_programa!$C$2:$E$59,2,FALSE)),\" \",VLOOKUP(K269,[2]Proposito_programa!$C$2:$E$59,2,FALSE))","v":"Gestión pública local"},{"$f":"IF(ISERROR(VLOOKUP(K269,[2]Proposito_programa!$C$2:$E$59,3,FALSE)),\" \",VLOOKUP(K269,[2]Proposito_programa!$C$2:$E$59,3,FALSE))","v":"Propósito 5: Construir Bogotá - Región con gobierno abierto, transparente y ciudadanía consciente"},1784,1,80596620,"LUZ MERY PATERNINA MEDINA.","Persona Natural","-","-",null,8328333,null,0,0,8328333,3164767,"2021-11-11","2021-11-12","2022-01-01","50 DÍAS",0,0,null,null,null,null,null,null,"X",null,0.38]
[262,2021,"FDLF-CD-262-2021","https://community.secop.gov.co/Public/Tendering/OpportunityDetail/Index?noticeUID=CO1.NTC.2379996&isFromPublicArea=True&isModal=False","Contratos de prestación de servicios profesionales y de apoyo a la gestión","Contratación directa","Prestación de servicios profesionales y de apoyo a la gestión, o para la ejecución de trabajos artísticos que sólo puedan encomendarse a determinadas personas naturales;","PRESTAR SERVICIOS DE APOYO OPERATIVO PARA LAS ACTIVIDADES RELACIONADAS CON EL MANTENIMIENTO Y REPARACIONES MENORES DE LAS SEDES DE LA ALCALDÍA LOCAL DE FONTIBÓN.","Inversión","Un nuevo Contrato Social y ambiental para la Bogotá del Siglo XXI",57,{"$f":"IF(ISERROR(VLOOKUP(K270,[2]Proposito_programa!$C$2:$E$59,2,FALSE)),\" \",VLOOKUP(K270,[2]Proposito_programa!$C$2:$E$59,2,FALSE))","v":"Gestión pública local"},{"$f":"IF(ISERROR(VLOOKUP(K270,[2]Proposito_programa!$C$2:$E$59,3,FALSE)),\" \",VLOOKUP(K270,[2]Proposito_programa!$C$2:$E$59,3,FALSE))","v":"Propósito 5: Construir Bogotá - Región con gobierno abierto, transparente y ciudadanía consciente"},1783,1,79122866,"ALVARO ACEVEDO CAJAMARCA","Persona Natural","-","-",null,3975353,null,0,0,3975353,486778,"2021-11-16","2021-11-25","2022-01-13","49 DÍAS",0,0,null,null,null,null,null,null,"X",null,0.12]
[263,2021,"FDLF-CD-263-2021","https://community.secop.gov.co/Public/Tendering/OpportunityDetail/Index?noticeUID=CO1.NTC.2395849&isFromPublicArea=True&isModal=true&asPopupView=true","Contratos de prestación de servicios profesionales y de apoyo a la gestión","Contratación directa","Prestación de servicios profesionales y de apoyo a la gestión, o para la ejecución de trabajos artísticos que sólo puedan encomendarse a determinadas personas naturales;","PRESTAR LOS SERVICIOS PROFESIONALES ESPECIALIZADOS PARA APOYAR JURÍDICAMENTE AL ÁREA DE GESTIÓN POLICIVA DE LA ALCALDÍA LOCAL DE FONTIBÓN.","Inversión","Un nuevo Contrato Social y ambiental para la Bogotá del Siglo XXI",57,{"$f":"IF(ISERROR(VLOOKUP(K271,[2]Proposito_programa!$C$2:$E$59,2,FALSE)),\" \",VLOOKUP(K271,[2]Proposito_programa!$C$2:$E$59,2,FALSE))","v":"Gestión pública local"},{"$f":"IF(ISERROR(VLOOKUP(K271,[2]Proposito_programa!$C$2:$E$59,3,FALSE)),\" \",VLOOKUP(K271,[2]Proposito_programa!$C$2:$E$59,3,FALSE))","v":"Propósito 5: Construir Bogotá - Región con gobierno abierto, transparente y ciudadanía consciente"},1784,1,1020720464,"JORGE ANDRES ANGARITA PARDO","Persona Natural","-","-",null,13700000,null,0,0,13700000,2055000,"2021-11-16","2021-11-22","2022-01-21","60 DÍAS",0,0,null,null,null,null,null,null,"X",null,0.15]
[264,2021,"FDLF-CD-264-2021","https://community.secop.gov.co/Public/Tendering/OpportunityDetail/Index?noticeUID=CO1.NTC.2363382&isFromPublicArea=True&isModal=true&asPopupView=true","Contratos de prestación de servicios profesionales y de apoyo a la gestión","Contratación directa","Prestación de servicios profesionales y de apoyo a la gestión, o para la ejecución de trabajos artísticos que sólo puedan encomendarse a determinadas personas naturales;","PRESTAR SERVICIOS PARA APOYAR JURÍDICAMENTE LA EJECUCIÓN DE LAS ACCIONES REQUERIDAS PARA EL TRAMITE E IMPULSO PROCESAL DE LAS ACTUACIONES CONTRAVENCIONALES Y/O QUERELLAS QUE CURSEN EN LAS INSPECCIONES DE POLICÍA DE LA LOCALIDAD.","Inversión","Un nuevo Contrato Social y ambiental para la Bogotá del Siglo XXI",57,{"$f":"IF(ISERROR(VLOOKUP(K272,[2]Proposito_programa!$C$2:$E$59,2,FALSE)),\" \",VLOOKUP(K272,[2]Proposito_programa!$C$2:$E$59,2,FALSE))","v":"Gestión pública local"},{"$f":"IF(ISERROR(VLOOKUP(K272,[2]Proposito_programa!$C$2:$E$59,3,FALSE)),\" \",VLOOKUP(K272,[2]Proposito_programa!$C$2:$E$59,3,FALSE))","v":"Propósito 5: Construir Bogotá - Región con gobierno abierto, transparente y ciudadanía consciente"},1784,1,79131970,"WILFORD LIBERMAN RODRIGUEZ FONSECA","Persona Natural","-","-",null,8828033,null,0,0,8828033,1998800,"2021-11-16","2021-11-22","2022-01-04","53 DÍAS",0,0,null,null,null,null,null,null,"X",null,0.23]
[265,2021,"FDLF-SAMC-1-2021","https://community.secop.gov.co/Public/Tendering/OpportunityDetail/Index?noticeUID=CO1.NTC.2367380&isFromPublicArea=True&isModal=False\n","Seguros","Selección abreviada","Subasta inversa ","CONTRATAR LOS SEGUROS QUE AMPAREN LOS INTERESES PATRIMONIALES, ASÍ COMO LOS BIENES QUE ESTÉN BAJO SU RESPONSABILIDAD, CUSTODIA, CUIDAD Y CONTROL, O POR LOS QUE PUEDA SER LEGALMENTE RESPONSABLE, ASÍ COMO COBERTURA DE VIDA GRUPO EDILES DEL F.D.L.F, ASÍ COMO LA EXPEDICIÓN DE CUALQUIER OTRA PÓLIZA DE SEGUROS QUE REQUIERA LA ENTIDAD EN EL DESARROLLO DE SU ACTIVIDAD","Funcionamiento","Un nuevo Contrato Social y ambiental para la Bogotá del Siglo XXI","No aplica",{"$f":"IF(ISERROR(VLOOKUP(K273,[2]Proposito_programa!$C$2:$E$59,2,FALSE)),\" \",VLOOKUP(K273,[2]Proposito_programa!$C$2:$E$59,2,FALSE))","v":" "},{"$f":"IF(ISERROR(VLOOKUP(K273,[2]Proposito_programa!$C$2:$E$59,3,FALSE)),\" \",VLOOKUP(K273,[2]Proposito_programa!$C$2:$E$59,3,FALSE))","v":" "},112,1,860002002,"LA PREVISORA S.A. COMPAÑÍA DE SEGUROS","Persona Jurídica","-","-",null,12571780,null,0,0,12571780,0,"2021-11-24","2021-12-23","2022-07-17","200 DÍAS",0,0,null,null,null,null,null,"X",null,null,0]
[265,2021,"FDLF-SAMC-1-2021","https://community.secop.gov.co/Public/Tendering/OpportunityDetail/Index?noticeUID=CO1.NTC.2367380&isFromPublicArea=True&isModal=False\n","Seguros","Selección abreviada","Subasta inversa ","CONTRATAR LOS SEGUROS QUE AMPAREN LOS INTERESES PATRIMONIALES, ASÍ COMO LOS BIENES QUE ESTÉN BAJO SU RESPONSABILIDAD, CUSTODIA, CUIDAD Y CONTROL, O POR LOS QUE PUEDA SER LEGALMENTE RESPONSABLE, ASÍ COMO COBERTURA DE VIDA GRUPO EDILES DEL F.D.L.F, ASÍ COMO LA EXPEDICIÓN DE CUALQUIER OTRA PÓLIZA DE SEGUROS QUE REQUIERA LA ENTIDAD EN EL DESARROLLO DE SU ACTIVIDAD","Funcionamiento","Un nuevo Contrato Social y ambiental para la Bogotá del Siglo XXI","No aplica",{"$f":"IF(ISERROR(VLOOKUP(K274,[2]Proposito_programa!$C$2:$E$59,2,FALSE)),\" \",VLOOKUP(K274,[2]Proposito_programa!$C$2:$E$59,2,FALSE))","v":" "},{"$f":"IF(ISERROR(VLOOKUP(K274,[2]Proposito_programa!$C$2:$E$59,3,FALSE)),\" \",VLOOKUP(K274,[2]Proposito_programa!$C$2:$E$59,3,FALSE))","v":" "},110,1,860002002,"LA PREVISORA S.A. COMPAÑÍA DE SEGUROS","Persona Jurídica",null,null,null,815350,null,0,0,815350,0,"2021-11-24","2021-12-23","2022-07-17","200 DÍAS",0,0,null,null,null,null,null,"X",null,null,0]
[265,2021,"FDLF-SAMC-1-2021","https://community.secop.gov.co/Public/Tendering/OpportunityDetail/Index?noticeUID=CO1.NTC.2367380&isFromPublicArea=True&isModal=False\n","Seguros","Selección abreviada","Subasta inversa ","CONTRATAR LOS SEGUROS QUE AMPAREN LOS INTERESES PATRIMONIALES, ASÍ COMO LOS BIENES QUE ESTÉN BAJO SU RESPONSABILIDAD, CUSTODIA, CUIDAD Y CONTROL, O POR LOS QUE PUEDA SER LEGALMENTE RESPONSABLE, ASÍ COMO COBERTURA DE VIDA GRUPO EDILES DEL F.D.L.F, ASÍ COMO LA EXPEDICIÓN DE CUALQUIER OTRA PÓLIZA DE SEGUROS QUE REQUIERA LA ENTIDAD EN EL DESARROLLO DE SU ACTIVIDAD","Funcionamiento","Un nuevo Contrato Social y ambiental para la Bogotá del Siglo XXI","No aplica",{"$f":"IF(ISERROR(VLOOKUP(K275,[2]Proposito_programa!$C$2:$E$59,2,FALSE)),\" \",VLOOKUP(K275,[2]Proposito_programa!$C$2:$E$59,2,FALSE))","v":" "},{"$f":"IF(ISERROR(VLOOKUP(K275,[2]Proposito_programa!$C$2:$E$59,3,FALSE)),\" \",VLOOKUP(K275,[2]Proposito_programa!$C$2:$E$59,3,FALSE))","v":" "},108,1,860002002,"LA PREVISORA S.A. COMPAÑÍA DE SEGUROS","Persona Jurídica",null,null,null,60187246,null,0,0,60187246,0,"2021-11-24","2021-12-23","2022-07-17","200 DÍAS",0,0,null,null,null,null,null,"X",null,null,0]
[265,2021,"FDLF-SAMC-1-2021","https://community.secop.gov.co/Public/Tendering/OpportunityDetail/Index?noticeUID=CO1.NTC.2367380&isFromPublicArea=True&isModal=False\n","Seguros","Selección abreviada","Subasta inversa ","CONTRATAR LOS SEGUROS QUE AMPAREN LOS INTERESES PATRIMONIALES, ASÍ COMO LOS BIENES QUE ESTÉN BAJO SU RESPONSABILIDAD, CUSTODIA, CUIDAD Y CONTROL, O POR LOS QUE PUEDA SER LEGALMENTE RESPONSABLE, ASÍ COMO COBERTURA DE VIDA GRUPO EDILES DEL F.D.L.F, ASÍ COMO LA EXPEDICIÓN DE CUALQUIER OTRA PÓLIZA DE SEGUROS QUE REQUIERA LA ENTIDAD EN EL DESARROLLO DE SU ACTIVIDAD","Funcionamiento","Un nuevo Contrato Social y ambiental para la Bogotá del Siglo XXI","No aplica",{"$f":"IF(ISERROR(VLOOKUP(K276,[2]Proposito_programa!$C$2:$E$59,2,FALSE)),\" \",VLOOKUP(K276,[2]Proposito_programa!$C$2:$E$59,2,FALSE))","v":" "},{"$f":"IF(ISERROR(VLOOKUP(K276,[2]Proposito_programa!$C$2:$E$59,3,FALSE)),\" \",VLOOKUP(K276,[2]Proposito_programa!$C$2:$E$59,3,FALSE))","v":" "},107,1,860002002,"LA PREVISORA S.A. COMPAÑÍA DE SEGUROS","Persona Jurídica",null,null,null,5534524,null,0,0,5534524,0,"2021-11-24","2021-12-23","2022-07-17","200 DÍAS",0,0,null,null,null,null,null,"X",null,null,0]
[265,2021,"FDLF-SAMC-1-2021","https://community.secop.gov.co/Public/Tendering/OpportunityDetail/Index?noticeUID=CO1.NTC.2367380&isFromPublicArea=True&isModal=False\n","Seguros","Selección abreviada","Subasta inversa ","CONTRATAR LOS SEGUROS QUE AMPAREN LOS INTERESES PATRIMONIALES, ASÍ COMO LOS BIENES QUE ESTÉN BAJO SU RESPONSABILIDAD, CUSTODIA, CUIDAD Y CONTROL, O POR LOS QUE PUEDA SER LEGALMENTE RESPONSABLE, ASÍ COMO COBERTURA DE VIDA GRUPO EDILES DEL F.D.L.F, ASÍ COMO LA EXPEDICIÓN DE CUALQUIER OTRA PÓLIZA DE SEGUROS QUE REQUIERA LA ENTIDAD EN EL DESARROLLO DE SU ACTIVIDAD","Funcionamiento","Un nuevo Contrato Social y ambiental para la Bogotá del Siglo XXI","No aplica",{"$f":"IF(ISERROR(VLOOKUP(K277,[2]Proposito_programa!$C$2:$E$59,2,FALSE)),\" \",VLOOKUP(K277,[2]Proposito_programa!$C$2:$E$59,2,FALSE))","v":" "},{"$f":"IF(ISERROR(VLOOKUP(K277,[2]Proposito_programa!$C$2:$E$59,3,FALSE)),\" \",VLOOKUP(K277,[2]Proposito_programa!$C$2:$E$59,3,FALSE))","v":" "},105,1,860002002,"LA PREVISORA S.A. COMPAÑÍA DE SEGUROS","Persona Jurídica",null,null,null,9758316,null,0,0,9758316,0,"2021-11-24","2021-12-23","2022-07-17","200 DÍAS",0,0,null,null,null,null,null,"X",null,null,0]
[265,2021,"FDLF-SAMC-1-2021","https://community.secop.gov.co/Public/Tendering/OpportunityDetail/Index?noticeUID=CO1.NTC.2367380&isFromPublicArea=True&isModal=False\n","Seguros","Selección abreviada","Subasta inversa ","CONTRATAR LOS SEGUROS QUE AMPAREN LOS INTERESES PATRIMONIALES, ASÍ COMO LOS BIENES QUE ESTÉN BAJO SU RESPONSABILIDAD, CUSTODIA, CUIDAD Y CONTROL, O POR LOS QUE PUEDA SER LEGALMENTE RESPONSABLE, ASÍ COMO COBERTURA DE VIDA GRUPO EDILES DEL F.D.L.F, ASÍ COMO LA EXPEDICIÓN DE CUALQUIER OTRA PÓLIZA DE SEGUROS QUE REQUIERA LA ENTIDAD EN EL DESARROLLO DE SU ACTIVIDAD","Funcionamiento","Un nuevo Contrato Social y ambiental para la Bogotá del Siglo XXI","No aplica",{"$f":"IF(ISERROR(VLOOKUP(K278,[2]Proposito_programa!$C$2:$E$59,2,FALSE)),\" \",VLOOKUP(K278,[2]Proposito_programa!$C$2:$E$59,2,FALSE))","v":" "},{"$f":"IF(ISERROR(VLOOKUP(K278,[2]Proposito_programa!$C$2:$E$59,3,FALSE)),\" \",VLOOKUP(K278,[2]Proposito_programa!$C$2:$E$59,3,FALSE))","v":" "},109,1,860002002,"LA PREVISORA S.A. COMPAÑÍA DE SEGUROS","Persona Jurídica",null,null,null,16731761,null,0,0,16731761,0,"2021-11-24","2021-12-23","2022-07-17","200 DÍAS",0,0,null,null,null,null,null,"X",null,null,0]
[266,2021,"FDLF-CD-266-2021","https://community.secop.gov.co/Public/Tendering/OpportunityDetail/Index?noticeUID=CO1.NTC.2404902&isFromPublicArea=True&isModal=true&asPopupView=true","Contratos de prestación de servicios profesionales y de apoyo a la gestión","Contratación directa","Prestación de servicios profesionales y de apoyo a la gestión, o para la ejecución de trabajos artísticos que sólo puedan encomendarse a determinadas personas naturales;","PRESTAR LOS SERVICIOS PROFESIONALES A LA ALCALDÍA LOCAL DE FONTIBÓN, PARA LA EJECUCIÓN DE LAS ACTIVIDADES Y PROCESOS ADMINISTRATIVOS Y DE CAMPO RELACIONADOS CON LA REACTIVACIÓN ECONÓMICA EN EL MARCO DE LAS NECESIDADES DEL FONDO DE DESARROLLO LOCAL Y DINAMIZACIÓN PARA LA EJECUCIÓN DE LOS PROYECTOS QUE HACEN PARTE DEL PLAN DE DESARROLLO","Inversión","Un nuevo Contrato Social y ambiental para la Bogotá del Siglo XXI",6,{"$f":"IF(ISERROR(VLOOKUP(K279,[2]Proposito_programa!$C$2:$E$59,2,FALSE)),\" \",VLOOKUP(K279,[2]Proposito_programa!$C$2:$E$59,2,FALSE))","v":"Sistema Distrital de Cuidado"},{"$f":"IF(ISERROR(VLOOKUP(K279,[2]Proposito_programa!$C$2:$E$59,3,FALSE)),\" \",VLOOKUP(K279,[2]Proposito_programa!$C$2:$E$59,3,FALSE))","v":"Propósito 1: Hacer un nuevo contrato social para incrementar la inclusión social, productiva y política"},1761,1,12590443,"HERNANDO AUGUSTO PEÑARANDA MAZON","Persona Natural","-","-",null,8250000,null,0,0,8250000,1466667,"2021-11-19","2021-11-23","2022-02-07","45 DÍAS",0,0,null,null,null,null,null,null,"X",null,0.18]
[268,2021,"FDLF-CD-268-2021","https://community.secop.gov.co/Public/Tendering/OpportunityDetail/Index?noticeUID=CO1.NTC.2405135&isFromPublicArea=True&isModal=true&asPopupView=true","Contratos de prestación de servicios profesionales y de apoyo a la gestión","Contratación directa","Prestación de servicios profesionales y de apoyo a la gestión, o para la ejecución de trabajos artísticos que sólo puedan encomendarse a determinadas personas naturales;","PRESTAR SERVICIOS PROFESIONALES, PARA LA EJECUCIÓN DE LAS ACTIVIDADES Y PROCESOS ADMINISTRATIVOS Y DE CAMPO RELACIONADOS CON LA REACTIVACIÓN ECONÓMICA EN EL MARCO DE LAS NECESIDADES DEL FONDO DE DESARROLLO LOCAL Y DINAMIZACIÓN PARA LA EJECUCIÓN DE LOS PROYECTOS QUE HACEN PARTE DEL PLAN DE DESARROLLO.","Inversión","Un nuevo Contrato Social y ambiental para la Bogotá del Siglo XXI",6,{"$f":"IF(ISERROR(VLOOKUP(K280,[2]Proposito_programa!$C$2:$E$59,2,FALSE)),\" \",VLOOKUP(K280,[2]Proposito_programa!$C$2:$E$59,2,FALSE))","v":"Sistema Distrital de Cuidado"},{"$f":"IF(ISERROR(VLOOKUP(K280,[2]Proposito_programa!$C$2:$E$59,3,FALSE)),\" \",VLOOKUP(K280,[2]Proposito_programa!$C$2:$E$59,3,FALSE))","v":"Propósito 1: Hacer un nuevo contrato social para incrementar la inclusión social, productiva y política"},1761,1,1010194031,"FRANCI PATRICIA PACHECO VALLEJO","Persona Natural","-","-",null,7500000,null,1,3666667,11166667,1500000,"2021-11-19","2021-11-22","2022-02-06","45 DÍAS",1,22,null,null,null,null,null,null,"X",null,0.13]
[269,2021,"FDLF-CD-269-2021","https://community.secop.gov.co/Public/Tendering/OpportunityDetail/Index?noticeUID=CO1.NTC.2427218&isFromPublicArea=True&isModal=true&asPopupView=true","Contratos de prestación de servicios profesionales y de apoyo a la gestión","Contratación directa","Prestación de servicios profesionales y de apoyo a la gestión, o para la ejecución de trabajos artísticos que sólo puedan encomendarse a determinadas personas naturales;","PRESTAR SERVICIOS PROFESIONALES, PARA LA EJECUCIÓN DE LAS ACTIVIDADES Y PROCESOS ADMINISTRATIVOS Y DE CAMPO RELACIONADOS CON LA REACTIVACIÓN ECONÓMICA EN EL MARCO DE LAS NECESIDADES DEL FONDO DE DESARROLLO LOCAL Y DINAMIZACIÓN PARA LA EJECUCIÓN DE LOS PROYECTOS QUE HACEN PARTE DEL PLAN DE DESARROLLO","Inversión","Un nuevo Contrato Social y ambiental para la Bogotá del Siglo XXI",6,{"$f":"IF(ISERROR(VLOOKUP(K281,[2]Proposito_programa!$C$2:$E$59,2,FALSE)),\" \",VLOOKUP(K281,[2]Proposito_programa!$C$2:$E$59,2,FALSE))","v":"Sistema Distrital de Cuidado"},{"$f":"IF(ISERROR(VLOOKUP(K281,[2]Proposito_programa!$C$2:$E$59,3,FALSE)),\" \",VLOOKUP(K281,[2]Proposito_programa!$C$2:$E$59,3,FALSE))","v":"Propósito 1: Hacer un nuevo contrato social para incrementar la inclusión social, productiva y política"},1761,1,79531044,"NELSON RODOLFO OSORIO PINILLA","Persona Natural","-","-",null,5000000,null,0,0,5000000," $                          -  ","2021-11-30","2021-12-06","2021-01-05","30 DIAS",0,0,null,null,null,null,null,null,"X",null,0]
[270,2021,"FDLF CPS 270 2021","https://community.secop.gov.co/Public/Tendering/OpportunityDetail/Index?noticeUID=CO1.NTC.2406492&isFromPublicArea=True&isModal=true&asPopupView=true","Contratos de prestación de servicios profesionales y de apoyo a la gestión","Contratación directa","Prestación de servicios profesionales y de apoyo a la gestión, o para la ejecución de trabajos artísticos que sólo puedan encomendarse a determinadas personas naturales;","PRESTAR SERVICIOS PROFESIONALES DE APOYO PARA PROMOVER CAMBIOS DE HÁBITOS DE RECICLAJE Y CONSUMO, SEGÚN LO ESTABLECIDO EN EL PROYECTO 1772 UN NUEVO CONTRATO PARA CAMBIAR HÁBITOS DE CONSUMO","Inversión","Un nuevo Contrato Social y ambiental para la Bogotá del Siglo XXI",38,{"$f":"IF(ISERROR(VLOOKUP(K282,[2]Proposito_programa!$C$2:$E$59,2,FALSE)),\" \",VLOOKUP(K282,[2]Proposito_programa!$C$2:$E$59,2,FALSE))","v":"Ecoeficiencia, reciclaje, manejo de residuos e inclusión de la población recicladora"},{"$f":"IF(ISERROR(VLOOKUP(K282,[2]Proposito_programa!$C$2:$E$59,3,FALSE)),\" \",VLOOKUP(K282,[2]Proposito_programa!$C$2:$E$59,3,FALSE))","v":"Propósito 2 : Cambiar Nuestros Hábitos de Vida para Reverdecer a Bogotá y Adaptarnos y Mitigar la Crisis Climática"},1772,1,1010210396,"KAREN GERALDINE CARRERO RAMIREZ ","Persona Natural","-","-",null,6541500,null,0,0,6541500," $                          -  ","2021-11-19","2021-11-23","2022-01-07","45 DÍAS",0,0,52559883,"RUTH MERCEDES SANABRIA PARDO",44545,3198082,null,null,"X",null,0]
[271,2021,"FDLF-CPS-271-2021","https://community.secop.gov.co/Public/Tendering/OpportunityDetail/Index?noticeUID=CO1.NTC.2406622&isFromPublicArea=True&isModal=true&asPopupView=true","Contratos de prestación de servicios profesionales y de apoyo a la gestión","Contratación directa","Prestación de servicios profesionales y de apoyo a la gestión, o para la ejecución de trabajos artísticos que sólo puedan encomendarse a determinadas personas naturales;","PRESTAR SERVICIOS PROFESIONALES PARA APOYAR LAS ACTIVIDADES DE REACTIVACIÓN ECONÓMICA DESARROLLADAS POR LA ALCALDÍA LOCAL DE FONTIBÓN","Inversión","Un nuevo Contrato Social y ambiental para la Bogotá del Siglo XXI",6,{"$f":"IF(ISERROR(VLOOKUP(K283,[2]Proposito_programa!$C$2:$E$59,2,FALSE)),\" \",VLOOKUP(K283,[2]Proposito_programa!$C$2:$E$59,2,FALSE))","v":"Sistema Distrital de Cuidado"},{"$f":"IF(ISERROR(VLOOKUP(K283,[2]Proposito_programa!$C$2:$E$59,3,FALSE)),\" \",VLOOKUP(K283,[2]Proposito_programa!$C$2:$E$59,3,FALSE))","v":"Propósito 1: Hacer un nuevo contrato social para incrementar la inclusión social, productiva y política"},1761,1,1016089405,"JUAN MIGUEL RIAÑO ABRIL","Persona Natural","-","-",null,6541500,null,0,0,6541500,1308300,"2021-11-19","2021-11-22","2022-11-06","45 DÍAS",0,0,null,null,null,null,null,null,"X",null,0.2]
[272,2021,"FDLF-CPS-272-2021","https://community.secop.gov.co/Public/Tendering/OpportunityDetail/Index?noticeUID=CO1.NTC.2406625&isFromPublicArea=True&isModal=true&asPopupView=true","Contratos de prestación de servicios profesionales y de apoyo a la gestión","Contratación directa","Prestación de servicios profesionales y de apoyo a la gestión, o para la ejecución de trabajos artísticos que sólo puedan encomendarse a determinadas personas naturales;","PRESTAR SERVICIOS PROFESIONALES PARA APOYAR LAS ACTIVIDADES DE REACTIVACIÓN ECONÓMICA DESARROLLADAS POR LA ALCALDÍA LOCAL DE FONTIBÓN","Inversión","Un nuevo Contrato Social y ambiental para la Bogotá del Siglo XXI",6,{"$f":"IF(ISERROR(VLOOKUP(K284,[2]Proposito_programa!$C$2:$E$59,2,FALSE)),\" \",VLOOKUP(K284,[2]Proposito_programa!$C$2:$E$59,2,FALSE))","v":"Sistema Distrital de Cuidado"},{"$f":"IF(ISERROR(VLOOKUP(K284,[2]Proposito_programa!$C$2:$E$59,3,FALSE)),\" \",VLOOKUP(K284,[2]Proposito_programa!$C$2:$E$59,3,FALSE))","v":"Propósito 1: Hacer un nuevo contrato social para incrementar la inclusión social, productiva y política"},1761,1,1032470567,"JUAN SEBASTIAN RAMIREZ GARCIA","Persona Natural","-","-",null,6541500,null,0,0,6541500," $                          -  ","2021-11-19","2021-11-22","2022-01-25","45 DÍAS",0,0,null,null,null,null,null,null,"X",null,0]
[273,2021,"FDLF-CD-273-2021","https://community.secop.gov.co/Public/Tendering/OpportunityDetail/Index?noticeUID=CO1.NTC.2418854&isFromPublicArea=True&isModal=true&asPopupView=true","Contratos de prestación de servicios profesionales y de apoyo a la gestión","Contratación directa","Prestación de servicios profesionales y de apoyo a la gestión, o para la ejecución de trabajos artísticos que sólo puedan encomendarse a determinadas personas naturales;","PRESTACIÓN DE SERVICIOS DE APOYO A LA GESTIÓN PARA BRINDAR ASISTENCIA, APOYO Y ACOMPAÑAMIENTO EN ACTIVIDADES OPERATIVAS, TÉCNICAS Y ADMINISTRATIVAS DE LA ALCALDÍA LOCAL DE FONTIBÓN EN EL MARCO DE ACUERDOS CIUDADANOS.","Inversión","Un nuevo Contrato Social y ambiental para la Bogotá del Siglo XXI",45,{"$f":"IF(ISERROR(VLOOKUP(K285,[2]Proposito_programa!$C$2:$E$59,2,FALSE)),\" \",VLOOKUP(K285,[2]Proposito_programa!$C$2:$E$59,2,FALSE))","v":"Espacio público más seguro y construido colectivamente"},{"$f":"IF(ISERROR(VLOOKUP(K285,[2]Proposito_programa!$C$2:$E$59,3,FALSE)),\" \",VLOOKUP(K285,[2]Proposito_programa!$C$2:$E$59,3,FALSE))","v":"Propósito 3: Inspirar confianza y legitimidad para vivir sin miedo y ser epicentro de cultura ciudadana, paz y reconciliación"},1776,1,1077974399,"ANDRES FELIPE TORRES OLARTE","Persona Natural","-","-",null,3500000,null,1,1700000,5200000," $                          -  ","2021-11-26","2021-11-26","2022-01-16","35 DÍAS",1,17,null,null,null,null,null,null,"X",null,0]
[274,2021,"FDLF-CD-274-2021","https://community.secop.gov.co/Public/Tendering/OpportunityDetail/Index?noticeUID=CO1.NTC.2419323&isFromPublicArea=True&isModal=true&asPopupView=true","Contratos de prestación de servicios profesionales y de apoyo a la gestión","Contratación directa","Prestación de servicios profesionales y de apoyo a la gestión, o para la ejecución de trabajos artísticos que sólo puedan encomendarse a determinadas personas naturales;","PRESTAR LOS SERVICIOS TÉCNICOS A LA GESTIÓN ADMINISTRATIVA EN ACTIVIDADES RELACIONADAS CON LOS ACUERDOS CIUDADANOS DE LA LOCALIDAD DE FONTIBÓN.","Inversión","Un nuevo Contrato Social y ambiental para la Bogotá del Siglo XXI",45,{"$f":"IF(ISERROR(VLOOKUP(K286,[2]Proposito_programa!$C$2:$E$59,2,FALSE)),\" \",VLOOKUP(K286,[2]Proposito_programa!$C$2:$E$59,2,FALSE))","v":"Espacio público más seguro y construido colectivamente"},{"$f":"IF(ISERROR(VLOOKUP(K286,[2]Proposito_programa!$C$2:$E$59,3,FALSE)),\" \",VLOOKUP(K286,[2]Proposito_programa!$C$2:$E$59,3,FALSE))","v":"Propósito 3: Inspirar confianza y legitimidad para vivir sin miedo y ser epicentro de cultura ciudadana, paz y reconciliación"},1776,1,79602263,"JOSE LUIS BELTRAN CAMARGO","Persona Natural","-","-",null,3500000,null,1,1700000,5200000," $                          -  ","2021-11-26","2021-11-26","2022-01-16","35 DÍAS",1,17,null,null,null,null,null,null,"X",null,0]
[275,2021,"FDLF-CD-275-2021","https://community.secop.gov.co/Public/Tendering/OpportunityDetail/Index?noticeUID=CO1.NTC.2417565&isFromPublicArea=True&isModal=true&asPopupView=true","Contratos de prestación de servicios profesionales y de apoyo a la gestión","Contratación directa","Prestación de servicios profesionales y de apoyo a la gestión, o para la ejecución de trabajos artísticos que sólo puedan encomendarse a determinadas personas naturales;","PRESTAR SERVICIOS PROFESIONALES EN EL ÁREA DE GESTIÓN DEL DESARROLLO, PARA APOYAR LA IMPLEMENTACIÓN DE ACCIONES RELACIONADAS CON EL TEMA DE MUJER, GÉNERO Y POBLACIONES DIVERSAS","Inversión","Un nuevo Contrato Social y ambiental para la Bogotá del Siglo XXI",40,{"$f":"IF(ISERROR(VLOOKUP(K287,[2]Proposito_programa!$C$2:$E$59,2,FALSE)),\" \",VLOOKUP(K287,[2]Proposito_programa!$C$2:$E$59,2,FALSE))","v":"Más mujeres viven una vida libre de violencias, se sienten seguras y acceden con confianza al sistema de justicia"},{"$f":"IF(ISERROR(VLOOKUP(K287,[2]Proposito_programa!$C$2:$E$59,3,FALSE)),\" \",VLOOKUP(K287,[2]Proposito_programa!$C$2:$E$59,3,FALSE))","v":"Propósito 3: Inspirar confianza y legitimidad para vivir sin miedo y ser epicentro de cultura ciudadana, paz y reconciliación"},1774,1,1020781990,"LINA MARIA MARTINEZ ARDILA","Persona Natural","-","-",null,5087833,null,0,0,5087833," $                          -  ","2021-11-25","2021-11-26","2022-01-16","35 DÍAS",0,0,null,null,null,null,null,null,"X",null,0]
[276,2021,"FDLF-CD-276-2021","https://community.secop.gov.co/Public/Tendering/OpportunityDetail/Index?noticeUID=CO1.NTC.2419918&isFromPublicArea=True&isModal=true&asPopupView=true","Contratos de prestación de servicios profesionales y de apoyo a la gestión","Contratación directa","Prestación de servicios profesionales y de apoyo a la gestión, o para la ejecución de trabajos artísticos que sólo puedan encomendarse a determinadas personas naturales;","PRESTAR SERVICIOS PROFESIONALES DE APOYO AL ÁREA DE GESTIÓN DE DESARROLLO LOCAL EN LA FORMULACIÓN Y SEGUIMIENTO DE LOS PROYECTOS DE INVERSIÓN Y FUNCIONAMIENTO QUE PERMITAN OPTIMIZAR LOS PROCESOS Y PROCEDIMIENTOS DEL FONDO DE DESARROLLO LOCAL DE FONTIBÓN INCLUYENDO LAS ACCIONES EN TORNO AL PARQUE AUTOMOTOR.","Inversión","Un nuevo Contrato Social y ambiental para la Bogotá del Siglo XXI",57,{"$f":"IF(ISERROR(VLOOKUP(K288,[2]Proposito_programa!$C$2:$E$59,2,FALSE)),\" \",VLOOKUP(K288,[2]Proposito_programa!$C$2:$E$59,2,FALSE))","v":"Gestión pública local"},{"$f":"IF(ISERROR(VLOOKUP(K288,[2]Proposito_programa!$C$2:$E$59,3,FALSE)),\" \",VLOOKUP(K288,[2]Proposito_programa!$C$2:$E$59,3,FALSE))","v":"Propósito 5: Construir Bogotá - Región con gobierno abierto, transparente y ciudadanía consciente"},1783,1,1030637106,"JAISSON HERNEY PALACIOS GOMEZ","Persona Natural","-","-",null,4942467,null,0,0,4942467," $                          -  ","2021-11-26","2021-12-01","2022-01-04","34 DÍAS",0,0,null,null,null,null,null,null,"X",null,0]
[277,2021,"FDLF-CD-277-2021","https://community.secop.gov.co/Public/Tendering/OpportunityDetail/Index?noticeUID=CO1.NTC.2419734&isFromPublicArea=True&isModal=true&asPopupView=true","Contratos de prestación de servicios profesionales y de apoyo a la gestión","Contratación directa","Prestación de servicios profesionales y de apoyo a la gestión, o para la ejecución de trabajos artísticos que sólo puedan encomendarse a determinadas personas naturales;","PRESTAR SERVICIOS COMO TÉCNICO DE APOYO ADMINISTRATIVO AL ÁREA DE GESTIÓN DEL DESARROLLO LOCAL, EN CUMPLIMIENTO DE LOS PROYECTOS DE FUNCIONAMIENTO E INVERSIÓN QUE EJECUTARA EL FONDO DE DESARROLLO LOCAL DE FONTIBÓN.","Inversión","Un nuevo Contrato Social y ambiental para la Bogotá del Siglo XXI",57,{"$f":"IF(ISERROR(VLOOKUP(K289,[2]Proposito_programa!$C$2:$E$59,2,FALSE)),\" \",VLOOKUP(K289,[2]Proposito_programa!$C$2:$E$59,2,FALSE))","v":"Gestión pública local"},{"$f":"IF(ISERROR(VLOOKUP(K289,[2]Proposito_programa!$C$2:$E$59,3,FALSE)),\" \",VLOOKUP(K289,[2]Proposito_programa!$C$2:$E$59,3,FALSE))","v":"Propósito 5: Construir Bogotá - Región con gobierno abierto, transparente y ciudadanía consciente"},1783,1,80799640,"JORGE ALEJANDRO DELGADO GONGORA","Persona Natural","-","-",null,4433310,null,1,2026667,6459977," $                          -  ","2021-11-26","2021-11-26","2021-12-30","35 DÍAS",1,16,null,null,null,null,null,null,"X",null,0]
[278,2021,"FDLF-CD-278-2021","https://community.secop.gov.co/Public/Tendering/OpportunityDetail/Index?noticeUID=CO1.NTC.2419043&isFromPublicArea=True&isModal=true&asPopupView=true","Contratos de prestación de servicios profesionales y de apoyo a la gestión","Contratación directa","Prestación de servicios profesionales y de apoyo a la gestión, o para la ejecución de trabajos artísticos que sólo puedan encomendarse a determinadas personas naturales;","PRESTAR LOS SERVICIOS DE APOYO A LA GESTIÓN DE LA ALCALDÍA LOCAL DE FONTIBÓN EN EL DESARROLLO DE ACTIVIDADES DE ACOMPAÑAMIENTO ADMINISTRATIVO, EN CAMPO Y PARTICIPACIÓN EN LOS PROCESOS NECESARIOS PARA LA CORRECTA EJECUCIÓN DE Y VISIBILIZACIÓN DE ACUERDOS FRENTE AL USO, ACCESO Y APROVECHAMIENTO DEL ESPACIO PÚBLICO.","Inversión","Un nuevo Contrato Social y ambiental para la Bogotá del Siglo XXI",45,{"$f":"IF(ISERROR(VLOOKUP(K290,[2]Proposito_programa!$C$2:$E$59,2,FALSE)),\" \",VLOOKUP(K290,[2]Proposito_programa!$C$2:$E$59,2,FALSE))","v":"Espacio público más seguro y construido colectivamente"},{"$f":"IF(ISERROR(VLOOKUP(K290,[2]Proposito_programa!$C$2:$E$59,3,FALSE)),\" \",VLOOKUP(K290,[2]Proposito_programa!$C$2:$E$59,3,FALSE))","v":"Propósito 3: Inspirar confianza y legitimidad para vivir sin miedo y ser epicentro de cultura ciudadana, paz y reconciliación"},1776,1,1013650912,"JUAN PABLO LEON RUEDA","Persona Natural","-","-",null,2916667,null,0,0,2916667," $                          -  ","2021-11-26","2021-11-30","2022-01-04","35 DÍAS",0,0,null,null,null,null,null,null,"X",null,0]
[279,2021,"FDLF-CD-279-2021","https://community.secop.gov.co/Public/Tendering/OpportunityDetail/Index?noticeUID=CO1.NTC.2459619&isFromPublicArea=True&isModal=true&asPopupView=true","Contratos de prestación de servicios profesionales y de apoyo a la gestión","Contratación directa","Prestación de servicios profesionales y de apoyo a la gestión, o para la ejecución de trabajos artísticos que sólo puedan encomendarse a determinadas personas naturales;","PRESTAR SERVICIOS DE APOYO PROFESIONAL AL ÁREA DE GESTIÓN DE DESARROLLO LOCAL DE FONTIBÓN ORIENTADO A LOS TEMAS DEPORTIVOS Y RECREATIVOS.","Inversión","Un nuevo Contrato Social y ambiental para la Bogotá del Siglo XXI",20,{"$f":"IF(ISERROR(VLOOKUP(K291,[2]Proposito_programa!$C$2:$E$59,2,FALSE)),\" \",VLOOKUP(K291,[2]Proposito_programa!$C$2:$E$59,2,FALSE))","v":"Bogotá, referente en cultura, deporte, recreación y actividad física, con parques para el desarrollo y la salud"},{"$f":"IF(ISERROR(VLOOKUP(K291,[2]Proposito_programa!$C$2:$E$59,3,FALSE)),\" \",VLOOKUP(K291,[2]Proposito_programa!$C$2:$E$59,3,FALSE))","v":"Propósito 1: Hacer un nuevo contrato social para incrementar la inclusión social, productiva y política"},1757,1,1016006281,"JOHN FREDDY AMAYA MORENO","Persona Natural","-","-",null,5400000,null,0,0,5400000," $                          -  ","2021-12-16","2021-12-17","2022-01-22","36 DÍAS",0,0,null,null,null,null,null,null,"X",null,0]
[280,2021,"FDLF-CD-280-2021","https://community.secop.gov.co/Public/Tendering/OpportunityDetail/Index?noticeUID=CO1.NTC.2421383&isFromPublicArea=True&isModal=true&asPopupView=true","Contratos de prestación de servicios profesionales y de apoyo a la gestión","Contratación directa","Prestación de servicios profesionales y de apoyo a la gestión, o para la ejecución de trabajos artísticos que sólo puedan encomendarse a determinadas personas naturales;","PRESTAR SERVICIOS PARA APOYAR JURÍDICAMENTE LA EJECUCIÓN DE LAS ACCIONES REQUERIDAS PARA LA DEPURACIÓN DE LAS ACTUACIONES ADMINISTRATIVAS QUE CURSAN EN LA ALCALDÍA LOCAL DE FONTIBÓN.","Inversión","Un nuevo Contrato Social y ambiental para la Bogotá del Siglo XXI",57,{"$f":"IF(ISERROR(VLOOKUP(K292,[2]Proposito_programa!$C$2:$E$59,2,FALSE)),\" \",VLOOKUP(K292,[2]Proposito_programa!$C$2:$E$59,2,FALSE))","v":"Gestión pública local"},{"$f":"IF(ISERROR(VLOOKUP(K292,[2]Proposito_programa!$C$2:$E$59,3,FALSE)),\" \",VLOOKUP(K292,[2]Proposito_programa!$C$2:$E$59,3,FALSE))","v":"Propósito 5: Construir Bogotá - Región con gobierno abierto, transparente y ciudadanía consciente"},1784,1,78038616,"OSCAR IGNACIO SALABARRIA BEDOYA ","Persona Natural","-","-",null,5330133,null,0,0,5330133," $                          -  ","2021-11-29","2021-12-06","2022-01-07","32 DÍAS",0,0,1106306993,"ANGELICA MARIA MUJICA OSPINA",44547,3664452,null,null,"X",null,0]
[281,2021,"FDLF-CD-281-2021","https://community.secop.gov.co/Public/Tendering/OpportunityDetail/Index?noticeUID=CO1.NTC.2419318&isFromPublicArea=True&isModal=true&asPopupView=true","Contratos de prestación de servicios profesionales y de apoyo a la gestión","Contratación directa","Prestación de servicios profesionales y de apoyo a la gestión, o para la ejecución de trabajos artísticos que sólo puedan encomendarse a determinadas personas naturales;","PRESTAR LOS SERVICIOS PROFESIONALES PARA LA ORIENTACIÓN Y FORMACIÓN EN EL MARCO DEL DESARROLLO DE ACTIVIDADES RELACIONADAS CON LOS ACUERDOS CIUDADANOS DE LA LOCALIDAD DE FONTIBÓN","Inversión","Un nuevo Contrato Social y ambiental para la Bogotá del Siglo XXI",45,{"$f":"IF(ISERROR(VLOOKUP(K293,[2]Proposito_programa!$C$2:$E$59,2,FALSE)),\" \",VLOOKUP(K293,[2]Proposito_programa!$C$2:$E$59,2,FALSE))","v":"Espacio público más seguro y construido colectivamente"},{"$f":"IF(ISERROR(VLOOKUP(K293,[2]Proposito_programa!$C$2:$E$59,3,FALSE)),\" \",VLOOKUP(K293,[2]Proposito_programa!$C$2:$E$59,3,FALSE))","v":"Propósito 3: Inspirar confianza y legitimidad para vivir sin miedo y ser epicentro de cultura ciudadana, paz y reconciliación"},1776,1,78759631,"OSCAR JOSE SUAREZ PEÑA","Persona Natural","-","-",null,5833333,null,0,0,5833333," $                          -  ","2021-11-26","2021-12-01","2022-01-05","35 DÍAS",0,0,null,null,null,null,null,null,"X",null,0]
[282,2021,"FDLF-CD-282-2021","https://community.secop.gov.co/Public/Tendering/OpportunityDetail/Index?noticeUID=CO1.NTC.2419590&isFromPublicArea=True&isModal=true&asPopupView=true","Contratos de prestación de servicios profesionales y de apoyo a la gestión","Contratación directa","Prestación de servicios profesionales y de apoyo a la gestión, o para la ejecución de trabajos artísticos que sólo puedan encomendarse a determinadas personas naturales;","PRESTAR SERVICIOS COMO PROFESIONAL DE APOYO ADMINISTRATIVO AL ÁREA DE GESTIÓN DEL DESARROLLO LOCAL, EN CUMPLIMIENTO DE LOS PROYECTOS DE FUNCIONAMIENTO E INVERSIÓN QUE EJECUTARA EL FONDO DE DESARROLLO LOCAL DE FONTIBÓN.","Inversión","Un nuevo Contrato Social y ambiental para la Bogotá del Siglo XXI",57,{"$f":"IF(ISERROR(VLOOKUP(K294,[2]Proposito_programa!$C$2:$E$59,2,FALSE)),\" \",VLOOKUP(K294,[2]Proposito_programa!$C$2:$E$59,2,FALSE))","v":"Gestión pública local"},{"$f":"IF(ISERROR(VLOOKUP(K294,[2]Proposito_programa!$C$2:$E$59,3,FALSE)),\" \",VLOOKUP(K294,[2]Proposito_programa!$C$2:$E$59,3,FALSE))","v":"Propósito 5: Construir Bogotá - Región con gobierno abierto, transparente y ciudadanía consciente"},1783,1,1013594413,"JEISSON ANDRES ORTIZ HERNANDEZ","Persona Natural","-","-",null,5833334,null,0,0,{"$f":"Y294+V294+W294","v":5833334}," $                          -  ","2021-11-26","2021-11-30","2022-01-04","35 DÍAS",0,0,null,null,null,null,null,null,"X",null,0]
[283,2021,"FDLF-CD-283-2021","https://community.secop.gov.co/Public/Tendering/OpportunityDetail/Index?noticeUID=CO1.NTC.2419580&isFromPublicArea=True&isModal=true&asPopupView=true","Contratos de prestación de servicios profesionales y de apoyo a la gestión","Contratación directa","Prestación de servicios profesionales y de apoyo a la gestión, o para la ejecución de trabajos artísticos que sólo puedan encomendarse a determinadas personas naturales;","PRESTAR SERVICIOS PROFESIONALES PARA APOYAR AL EQUIPO DE PRENSA Y COMUNICACIONES DE LA ALCALDÍA LOCAL EN LA CREACIÓN, REALIZACIÓN, PRODUCCIÓN Y EDICIÓN DE VÍDEOS, ASÍ COMO EL REGISTRO, EDICIÓN Y LA PRESENTACIÓN DE FOTOGRAFÍAS DE LOS ACONTECIMIENTOS, HECHOS Y EVENTOS EXTERNOS E INTERNOS DE LA ALCALDÍA LOCAL, PARA SER UTILIZADOS COMO INSUMOS DE COMUNICACIÓN EN LOS MEDIOS, ESPECIALMENTE ESCRITOS, DIGITALES Y AUDIOVISUALES.","Inversión","Un nuevo Contrato Social y ambiental para la Bogotá del Siglo XXI",57,{"$f":"IF(ISERROR(VLOOKUP(K295,[2]Proposito_programa!$C$2:$E$59,2,FALSE)),\" \",VLOOKUP(K295,[2]Proposito_programa!$C$2:$E$59,2,FALSE))","v":"Gestión pública local"},{"$f":"IF(ISERROR(VLOOKUP(K295,[2]Proposito_programa!$C$2:$E$59,3,FALSE)),\" \",VLOOKUP(K295,[2]Proposito_programa!$C$2:$E$59,3,FALSE))","v":"Propósito 5: Construir Bogotá - Región con gobierno abierto, transparente y ciudadanía consciente"},1783,1,80234523,"JULIAN ANDRES LOPEZ CERON","Persona Natural","-","-",null,6416667,null,0,0,6416667," $                          -  ","2021-11-26","2021-11-26","2021-12-30","35 DÍAS",0,0,null,null,null,null,null,null,"X",null,0]
[284,2021,"FDLF-CD-284-2021","https://community.secop.gov.co/Public/Tendering/OpportunityDetail/Index?noticeUID=CO1.NTC.2421488&isFromPublicArea=True&isModal=true&asPopupView=true","Arrendamiento de bienes inmuebles","Contratación directa","Prestación de servicios profesionales y de apoyo a la gestión, o para la ejecución de trabajos artísticos que sólo puedan encomendarse a determinadas personas naturales;","ARRENDAMIENTO DE INMUEBLE PARA ARCHIVO INSTITUCIONAL DE LA ALCALDÍA LOCAL DE FONTIBÓN Y COMPLEMENTARIAMENTE PARA PARQUEADERO DE VEHÍCULOS DE PROPIEDAD, TENENCIA O CUIDADO DEL FONDO DE DESARROLLO LOCAL DE FONTIBÓN.","Funcionamiento","Un nuevo Contrato Social y ambiental para la Bogotá del Siglo XXI","No aplica",{"$f":"IF(ISERROR(VLOOKUP(K296,[2]Proposito_programa!$C$2:$E$59,2,FALSE)),\" \",VLOOKUP(K296,[2]Proposito_programa!$C$2:$E$59,2,FALSE))","v":" "},{"$f":"IF(ISERROR(VLOOKUP(K296,[2]Proposito_programa!$C$2:$E$59,3,FALSE)),\" \",VLOOKUP(K296,[2]Proposito_programa!$C$2:$E$59,3,FALSE))","v":" "},201,1,900200519,"INVERSIONES CAOVA SAS","Persona Jurídica","-","-",null,95000000,null,0,0,95000000,0,"2021-11-26","2021-11-27","2022-09-26","304 DÍAS",0,0,null,null,null,null,null,"X",null,null,0.3]
[285,2021,"FDLF-CD-285-2021","https://community.secop.gov.co/Public/Tendering/OpportunityDetail/Index?noticeUID=CO1.NTC.2434800&isFromPublicArea=True&isModal=true&asPopupView=true","Contratos de prestación de servicios profesionales y de apoyo a la gestión","Contratación directa","Prestación de servicios profesionales y de apoyo a la gestión, o para la ejecución de trabajos artísticos que sólo puedan encomendarse a determinadas personas naturales;","PRESTAR SERVICIOS PROFESIONALES EN EL ÁREA DE GESTIÓN DEL DESARROLLO, PARA APOYAR LA FORMULACIÓN DE ESTRATEGIAS RELACIONADAS CON EL TEMA DE MUJER, GÉNERO Y POBLACIONES DIVERSAS","Inversión","Un nuevo Contrato Social y ambiental para la Bogotá del Siglo XXI",40,{"$f":"IF(ISERROR(VLOOKUP(K297,[2]Proposito_programa!$C$2:$E$59,2,FALSE)),\" \",VLOOKUP(K297,[2]Proposito_programa!$C$2:$E$59,2,FALSE))","v":"Más mujeres viven una vida libre de violencias, se sienten seguras y acceden con confianza al sistema de justicia"},{"$f":"IF(ISERROR(VLOOKUP(K297,[2]Proposito_programa!$C$2:$E$59,3,FALSE)),\" \",VLOOKUP(K297,[2]Proposito_programa!$C$2:$E$59,3,FALSE))","v":"Propósito 3: Inspirar confianza y legitimidad para vivir sin miedo y ser epicentro de cultura ciudadana, paz y reconciliación"},1774,1,1013650339,"GINA PAOLA RODRIGUEZ LOPEZ","Persona Natural","-","-",null,5666667,null,0,0,5666667," $                          -  ","2021-12-02","2021-12-06","2022-01-09","34 DÍAS",0,0,null,null,null,null,null,null,"X",null,0]
[286,2021,"FDLF-CD-286-2021","https://community.secop.gov.co/Public/Tendering/OpportunityDetail/Index?noticeUID=CO1.NTC.2435110&isFromPublicArea=True&isModal=true&asPopupView=true","Contratos de prestación de servicios profesionales y de apoyo a la gestión","Contratación directa","Prestación de servicios profesionales y de apoyo a la gestión, o para la ejecución de trabajos artísticos que sólo puedan encomendarse a determinadas personas naturales;","PRESTAR SERVICIOS PROFESIONALES PARA APOYAR LOS PROCESOS Y PROCEDIMIENTOS RELACIONADOS CON LOS PROYECTOS DE INVERSIÓN Y FUNCIONAMIENTO DEL AGDL, VERIFICACIÓN, REVISIÓN Y TRAMITE DE PAGOS PARA LOS CONTRATOS SUSCRITOS POR PARTE DEL FONDO DE DESARROLLO LOCAL","Inversión","Un nuevo Contrato Social y ambiental para la Bogotá del Siglo XXI",57,{"$f":"IF(ISERROR(VLOOKUP(K298,[2]Proposito_programa!$C$2:$E$59,2,FALSE)),\" \",VLOOKUP(K298,[2]Proposito_programa!$C$2:$E$59,2,FALSE))","v":"Gestión pública local"},{"$f":"IF(ISERROR(VLOOKUP(K298,[2]Proposito_programa!$C$2:$E$59,3,FALSE)),\" \",VLOOKUP(K298,[2]Proposito_programa!$C$2:$E$59,3,FALSE))","v":"Propósito 5: Construir Bogotá - Región con gobierno abierto, transparente y ciudadanía consciente"},1783,1,79697196,"CARLOS JAVIER CASTAÑO ALVARADO","Persona Natural","-","-",null,5666667,null,0,0,5666667," $                          -  ","2021-12-02","2021-12-03","2022-01-06","34 DÍAS",0,0,null,null,null,null,null,null,"X",null,0]
[287,2021,"FDLF-CD-287-2021","https://community.secop.gov.co/Public/Tendering/OpportunityDetail/Index?noticeUID=CO1.NTC.2434865&isFromPublicArea=True&isModal=true&asPopupView=true","Contratos de prestación de servicios profesionales y de apoyo a la gestión","Contratación directa","Prestación de servicios profesionales y de apoyo a la gestión, o para la ejecución de trabajos artísticos que sólo puedan encomendarse a determinadas personas naturales;","PRESTAR SERVICIOS DE APOYO OPERATIVO PARA LAS ACTIVIDADES RELACIONADAS CON EL MANTENIMIENTO Y REPARACIONES MENORES DE LAS SEDES DE LA ALCALDÍA LOCAL DE FONTIBÓN.","Inversión","Un nuevo Contrato Social y ambiental para la Bogotá del Siglo XXI",57,{"$f":"IF(ISERROR(VLOOKUP(K299,[2]Proposito_programa!$C$2:$E$59,2,FALSE)),\" \",VLOOKUP(K299,[2]Proposito_programa!$C$2:$E$59,2,FALSE))","v":"Gestión pública local"},{"$f":"IF(ISERROR(VLOOKUP(K299,[2]Proposito_programa!$C$2:$E$59,3,FALSE)),\" \",VLOOKUP(K299,[2]Proposito_programa!$C$2:$E$59,3,FALSE))","v":"Propósito 5: Construir Bogotá - Región con gobierno abierto, transparente y ciudadanía consciente"},1783,1,79127015,"WILLIAM MORENO RINCON","Persona Natural","-","-",null,2758409,null,0,0,2758409," $                          -  ","2021-12-02","2021-12-03","2022-01-06","34 DÍAS",0,0,null,null,null,null,null,null,"X",null,0]
[288,2021,"FDLF-CD-288-2021","https://community.secop.gov.co/Public/Tendering/OpportunityDetail/Index?noticeUID=CO1.NTC.2443403&isFromPublicArea=True&isModal=true&asPopupView=true","Contratos de prestación de servicios profesionales y de apoyo a la gestión","Contratación directa","Prestación de servicios profesionales y de apoyo a la gestión, o para la ejecución de trabajos artísticos que sólo puedan encomendarse a determinadas personas naturales;","PRESTAR SERVICIOS DE APOYO PARA REALIZAR LAS LABORES DE PLANTACIÓN, RIEGO, PODA, BLOQUEO, TRASPLANTE, LIMPIEZA Y DEMÁS ACTIVIDADES QUE LE SEAN ASIGNADAS EN EL MARCO DEL PROYECTO 1769 DE ARBORIZACIÓN EN LA LOCALIDAD DE FONTIBÓN.","Inversión","Un nuevo Contrato Social y ambiental para la Bogotá del Siglo XXI",33,{"$f":"IF(ISERROR(VLOOKUP(K300,[2]Proposito_programa!$C$2:$E$59,2,FALSE)),\" \",VLOOKUP(K300,[2]Proposito_programa!$C$2:$E$59,2,FALSE))","v":"Más árboles y más y mejor espacio público"},{"$f":"IF(ISERROR(VLOOKUP(K300,[2]Proposito_programa!$C$2:$E$59,3,FALSE)),\" \",VLOOKUP(K300,[2]Proposito_programa!$C$2:$E$59,3,FALSE))","v":"Propósito 2 : Cambiar Nuestros Hábitos de Vida para Reverdecer a Bogotá y Adaptarnos y Mitigar la Crisis Climática"},1769,1,1004629279,"LUIS CARLOS TELPIZ FUELAGAN","Persona Natural","-","-",null,1400000,null,0,0,1400000," $                          -  ","2021-12-07","2021-12-07","2022-01-06","30 DIAS",0,0,null,null,null,null,null,null,"X",null,0]
[289,2021,"FDLF-CD-289-2021","https://community.secop.gov.co/Public/Tendering/OpportunityDetail/Index?noticeUID=CO1.NTC.2435357&isFromPublicArea=True&isModal=False","Contratos de prestación de servicios profesionales y de apoyo a la gestión","Contratación directa","Prestación de servicios profesionales y de apoyo a la gestión, o para la ejecución de trabajos artísticos que sólo puedan encomendarse a determinadas personas naturales;","PRESTAR SERVICIOS DE APOYO PARA REALIZAR LAS LABORES DE PLANTACIÓN, RIEGO, PODA, BLOQUEO, TRASPLANTE, LIMPIEZA Y DEMÁS ACTIVIDADES QUE LE SEAN ASIGNADAS EN EL MARCO DEL PROYECTO 1769 DE ARBORIZACIÓN EN LA LOCALIDAD DE FONTIBÓN","Inversión","Un nuevo Contrato Social y ambiental para la Bogotá del Siglo XXI",33,{"$f":"IF(ISERROR(VLOOKUP(K301,[2]Proposito_programa!$C$2:$E$59,2,FALSE)),\" \",VLOOKUP(K301,[2]Proposito_programa!$C$2:$E$59,2,FALSE))","v":"Más árboles y más y mejor espacio público"},{"$f":"IF(ISERROR(VLOOKUP(K301,[2]Proposito_programa!$C$2:$E$59,3,FALSE)),\" \",VLOOKUP(K301,[2]Proposito_programa!$C$2:$E$59,3,FALSE))","v":"Propósito 2 : Cambiar Nuestros Hábitos de Vida para Reverdecer a Bogotá y Adaptarnos y Mitigar la Crisis Climática"},1769,1,5292076,"ALVARO DUVAN BENAVIDES ARAUJO","Persona Natural","-","-",null,1586667,null,0,0,1586667," $                          -  ","2021-12-02","2021-12-06","2022-01-09","34 DÍAS",0,0,null,null,null,null,null,null,"X",null,0]
[290,2021,"FDLF-CD-290-2021","https://community.secop.gov.co/Public/Tendering/OpportunityDetail/Index?noticeUID=CO1.NTC.2435023&isFromPublicArea=True&isModal=true&asPopupView=true","Contratos de prestación de servicios profesionales y de apoyo a la gestión","Contratación directa","Prestación de servicios profesionales y de apoyo a la gestión, o para la ejecución de trabajos artísticos que sólo puedan encomendarse a determinadas personas naturales;","PRESTAR SERVICIOS DE APOYO PARA REALIZAR LAS LABORES DE PLANTACIÓN, RIEGO, PODA, BLOQUEO, TRASPLANTE, LIMPIEZA Y DEMÁS ACTIVIDADES QUE LE SEAN ASIGNADAS EN EL MARCO DEL PROYECTO 1769 DE ARBORIZACIÓN EN LA LOCALIDAD DE FONTIBÓN","Inversión","Un nuevo Contrato Social y ambiental para la Bogotá del Siglo XXI",33,{"$f":"IF(ISERROR(VLOOKUP(K302,[2]Proposito_programa!$C$2:$E$59,2,FALSE)),\" \",VLOOKUP(K302,[2]Proposito_programa!$C$2:$E$59,2,FALSE))","v":"Más árboles y más y mejor espacio público"},{"$f":"IF(ISERROR(VLOOKUP(K302,[2]Proposito_programa!$C$2:$E$59,3,FALSE)),\" \",VLOOKUP(K302,[2]Proposito_programa!$C$2:$E$59,3,FALSE))","v":"Propósito 2 : Cambiar Nuestros Hábitos de Vida para Reverdecer a Bogotá y Adaptarnos y Mitigar la Crisis Climática"},1769,1,1124479442,"NERIO JOSE GONZALEZ CASTILLO","Persona Natural","-","-",null,1586667,null,0,0,1586667," $                          -  ","2021-12-02","2021-12-06","2022-01-09","34 DÍAS",0,0,null,null,null,null,null,null,"X",null,0]
[291,2021,"FDLF-CD-291-2021","https://community.secop.gov.co/Public/Tendering/OpportunityDetail/Index?noticeUID=CO1.NTC.2435633&isFromPublicArea=True&isModal=true&asPopupView=true","Contratos de prestación de servicios profesionales y de apoyo a la gestión","Contratación directa","Prestación de servicios profesionales y de apoyo a la gestión, o para la ejecución de trabajos artísticos que sólo puedan encomendarse a determinadas personas naturales;","PRESTAR SERVICIOS PROFESIONALES PARA LA GESTIÓN EN EL ÁREA DE DESARROLLO LOCAL DE FONTIBÓN, EN EL APOYO DE LA PRESENTACIÓN Y SEGUIMIENTO DE LOS PROYECTOS DE PARQUES QUE DESARROLLE LA ENTIDAD, Y EN LOS REQUERIMIENTOS DE INFRAESTRUCTURA CIVIL QUE TENGA LA ALCALDÍA LOCAL.","Inversión","Un nuevo Contrato Social y ambiental para la Bogotá del Siglo XXI",33,{"$f":"IF(ISERROR(VLOOKUP(K303,[2]Proposito_programa!$C$2:$E$59,2,FALSE)),\" \",VLOOKUP(K303,[2]Proposito_programa!$C$2:$E$59,2,FALSE))","v":"Más árboles y más y mejor espacio público"},{"$f":"IF(ISERROR(VLOOKUP(K303,[2]Proposito_programa!$C$2:$E$59,3,FALSE)),\" \",VLOOKUP(K303,[2]Proposito_programa!$C$2:$E$59,3,FALSE))","v":"Propósito 2 : Cambiar Nuestros Hábitos de Vida para Reverdecer a Bogotá y Adaptarnos y Mitigar la Crisis Climática"},1770,1,1031128344,"EDWIN ANDRES LOPEZ AMAYA","Persona Natural","-","-",null,4943600,null,0,0,4943600," $                          -  ","2021-12-02","2021-12-06","2022-01-09","34 DÍAS",0,0,null,null,null,null,null,null,"X",null,0]
[292,2021,"FDLF-CD-292-2021","https://community.secop.gov.co/Public/Tendering/OpportunityDetail/Index?noticeUID=CO1.NTC.2437786&isFromPublicArea=True&isModal=true&asPopupView=true","Contratos de prestación de servicios profesionales y de apoyo a la gestión","Contratación directa","Prestación de servicios profesionales y de apoyo a la gestión, o para la ejecución de trabajos artísticos que sólo puedan encomendarse a determinadas personas naturales;","PRESTAR LOS SERVICIOS PROFESIONALES A LA ALCALDÍA LOCAL DE FONTIBÓN, PARA LA EJECUCIÓN DE LAS ACTIVIDADES Y PROCESOS ADMINISTRATIVOS Y DE CAMPO RELACIONADOS CON LA REACTIVACIÓN ECONÓMICA EN EL MARCO DE LAS NECESIDADES DEL FONDO DE DESARROLLO LOCAL Y DINAMIZACIÓN PARA LA EJECUCIÓN DE LOS PROYECTOS QUE HACEN PARTE DEL PLAN DE DESARROLLO","Inversión","Un nuevo Contrato Social y ambiental para la Bogotá del Siglo XXI",6,{"$f":"IF(ISERROR(VLOOKUP(K304,[2]Proposito_programa!$C$2:$E$59,2,FALSE)),\" \",VLOOKUP(K304,[2]Proposito_programa!$C$2:$E$59,2,FALSE))","v":"Sistema Distrital de Cuidado"},{"$f":"IF(ISERROR(VLOOKUP(K304,[2]Proposito_programa!$C$2:$E$59,3,FALSE)),\" \",VLOOKUP(K304,[2]Proposito_programa!$C$2:$E$59,3,FALSE))","v":"Propósito 1: Hacer un nuevo contrato social para incrementar la inclusión social, productiva y política"},1761,1,79132395,"HUGO LÓPEZ ORTEGA","Persona Natural","-","-",null,6233333,null,0,0,6233333," $                          -  ","2021-12-03","2021-12-10","2022-01-13","34 DÍAS",0,0,null,null,null,null,null,null,"X",null,0]
[293,2021,"FDLF-CD-293-2021","https://community.secop.gov.co/Public/Tendering/OpportunityDetail/Index?noticeUID=CO1.NTC.2445751&isFromPublicArea=True&isModal=true&asPopupView=true","Contratos de prestación de servicios profesionales y de apoyo a la gestión","Contratación directa","Prestación de servicios profesionales y de apoyo a la gestión, o para la ejecución de trabajos artísticos que sólo puedan encomendarse a determinadas personas naturales;","APOYAR AL EQUIPO DE PRENSA Y COMUNICACIONES DE LA ALCALDÍA LOCAL EN LA REALIZACIÓN DE PRODUCTOS Y PIEZAS DIGITALES, IMPRESAS Y PUBLICITARIAS DE GRAN FORMATO Y DE ANIMACIÓN GRÁFICA, ASÍ COMO APOYAR LA PRODUCCIÓN Y MONTAJE DE EVENTOS. 4","Inversión","Un nuevo Contrato Social y ambiental para la Bogotá del Siglo XXI",57,{"$f":"IF(ISERROR(VLOOKUP(K305,[2]Proposito_programa!$C$2:$E$59,2,FALSE)),\" \",VLOOKUP(K305,[2]Proposito_programa!$C$2:$E$59,2,FALSE))","v":"Gestión pública local"},{"$f":"IF(ISERROR(VLOOKUP(K305,[2]Proposito_programa!$C$2:$E$59,3,FALSE)),\" \",VLOOKUP(K305,[2]Proposito_programa!$C$2:$E$59,3,FALSE))","v":"Propósito 5: Construir Bogotá - Región con gobierno abierto, transparente y ciudadanía consciente"},1783,1,1010193154,"ERIKA LIZETH VASQUEZ RAMIREZ","Persona Natural","-","-",null,4361000,null,0,0,4361000," $                          -  ","2021-12-10","2021-12-14","2022-01-13","30 DIAS",0,0,null,null,null,null,null,null,"X",null,0]
[294,2021,"FDLF-SAMC-033-2021","https://community.secop.gov.co/Public/Tendering/OpportunityDetail/Index?noticeUID=CO1.NTC.2428382&isFromPublicArea=True&isModal=true&asPopupView=true","Contratos de prestación de servicios","Selección abreviada","Selección abreviada por menor cuantía ","PRESTAR EL SERVICIO DE APOYO LOGISTICO PARA EL DESARROLLO DE CARAVANAS, PARA LA CELEBRACIÓN DE LAS FIESTAS TRADICIONALES NAVIDEÑAS EN LA LOCALIDAD DE FONTIBÓN","Inversión","Un nuevo Contrato Social y ambiental para la Bogotá del Siglo XXI",55,{"$f":"IF(ISERROR(VLOOKUP(K306,[2]Proposito_programa!$C$2:$E$59,2,FALSE)),\" \",VLOOKUP(K306,[2]Proposito_programa!$C$2:$E$59,2,FALSE))","v":"Fortalecimiento de cultura ciudadana y su institucionalidad"},{"$f":"IF(ISERROR(VLOOKUP(K306,[2]Proposito_programa!$C$2:$E$59,3,FALSE)),\" \",VLOOKUP(K306,[2]Proposito_programa!$C$2:$E$59,3,FALSE))","v":"Propósito 5: Construir Bogotá - Región con gobierno abierto, transparente y ciudadanía consciente"},1782,7,830140609,"GRUPO INVERSIONES Y SOLUCIONES SAS","Persona Jurídica","-","-",null,212287472,null,0,0,212287472,106143736,"2021-12-14","2021-12-16","2022-01-15","30 DIAS",1,15,null,null,null,null,null,"X",null,null,0.5]
[295,2021,"FDLF CMA 014 2021","https://community.secop.gov.co/Public/Tendering/OpportunityDetail/Index?noticeUID=CO1.NTC.2390080&isFromPublicArea=True&isModal=true&asPopupView=true","Interventoría","Concurso de méritos",null,"REALIZAR LA INTERVENTORIA, TECNICA, ADMINISTRATIVA, JURIDICA, FINANCIERA, SOCIAL, AMBIENTAL Y DE SEGURIDAD Y SALUD EN EL TRABAJO AL CONTRATO cuyo objeto es: REALIZAR LAS OBRAS DE CONSERVACIÓN DE LA MALLA VIAL Y ESPACIO PÚBLICO ASOCIADO EN LA LOCALIDAD DE FONTIBÓN, BOGOTÁ, D.C. A TRAVÉS DEL SISTEMA DE PRECIOS UNITARIOS FIJOS, SIN FORMULA DE REAJUSTE Y A MONTO AGOTABLE","Inversión","Un nuevo Contrato Social y ambiental para la Bogotá del Siglo XXI",49,{"$f":"IF(ISERROR(VLOOKUP(K307,[2]Proposito_programa!$C$2:$E$59,2,FALSE)),\" \",VLOOKUP(K307,[2]Proposito_programa!$C$2:$E$59,2,FALSE))","v":"Movilidad segura, sostenible y accesible"},{"$f":"IF(ISERROR(VLOOKUP(K307,[2]Proposito_programa!$C$2:$E$59,3,FALSE)),\" \",VLOOKUP(K307,[2]Proposito_programa!$C$2:$E$59,3,FALSE))","v":"Propósito 4: Hacer de Bogotá Región un modelo de movilidad multimodal, incluyente y sostenible"},1780,16,900241875,"MIRS LATINOAMERICA S.A.S","Persona Jurídica","-","-",null,138172626,null,0,0,138172626," $                          -  ","2021-12-07","2021-12-10","2022-05-15","105 DÍAS",0,0,null,null,null,null,null,"X",null,null,0]
[296,2021,"FDLF-SAMC-019-2021","https://community.secop.gov.co/Public/Tendering/OpportunityDetail/Index?noticeUID=CO1.NTC.2415922&isFromPublicArea=True&isModal=true&asPopupView=true","Contratos de prestación de servicios","Selección abreviada","Selección abreviada por menor cuantía ","CONTRATAR LA PRESTACIÓN DE SERVICIOS LOGÍSTICOS, OPERATIVOS Y TÉCNICOS PARA EL DESARROLLO Y REALIZACIÓN DEL PROYECTO CARNAVAL DE FIN DE AÑO DE FONTIBÓN 2021- RESIGNIFICANDO LA VIDA","Inversión","Un nuevo Contrato Social y ambiental para la Bogotá del Siglo XXI",21,{"$f":"IF(ISERROR(VLOOKUP(K308,[2]Proposito_programa!$C$2:$E$59,2,FALSE)),\" \",VLOOKUP(K308,[2]Proposito_programa!$C$2:$E$59,2,FALSE))","v":"Creación y vida cotidiana: Apropiación ciudadana del arte, la cultura y el patrimonio, para la democracia cultural"},{"$f":"IF(ISERROR(VLOOKUP(K308,[2]Proposito_programa!$C$2:$E$59,3,FALSE)),\" \",VLOOKUP(K308,[2]Proposito_programa!$C$2:$E$59,3,FALSE))","v":"Propósito 1: Hacer un nuevo contrato social para incrementar la inclusión social, productiva y política"},1758,3,80222117,"MIGUEL ANGEL VALLEJO BURGOS","Persona Jurídica","-","-",null,152709766,null,0,0,152709766," $                          -  ","2021-12-07","2021-12-14","2022-01-28","45 DÍAS",1,60,null,null,null,null,null,"X",null,null,0]
[297,2021,"FDLF-CD-297-2021","https://community.secop.gov.co/Public/Tendering/OpportunityDetail/Index?noticeUID=CO1.NTC.2445750&isFromPublicArea=True&isModal=true&asPopupView=true","Contratos de prestación de servicios profesionales y de apoyo a la gestión","Contratación directa","Prestación de servicios profesionales y de apoyo a la gestión, o para la ejecución de trabajos artísticos que sólo puedan encomendarse a determinadas personas naturales;","PRESTAR SERVICIOS PROFESIONALES PARA LA GESTIÓN EN EL ÁREA DE DESARROLLO LOCAL DE FONTIBÓN, EN EL APOYO DE LA FORMULACIÓN, PLANEACIÓN, PRESENTACIÓN Y SEGUIMIENTO DEL PROYECTO 1770 - UN NUEVO CONTRATO PARA LOS PARQUES DE FONTIBÓN, Y EN LOS REQUERIMIENTOS DE INFRAESTRUCTURA CIVIL QUE TENGA LA ALCALDÍA LOCAL.","Inversión","Un nuevo Contrato Social y ambiental para la Bogotá del Siglo XXI",33,{"$f":"IF(ISERROR(VLOOKUP(K309,[2]Proposito_programa!$C$2:$E$59,2,FALSE)),\" \",VLOOKUP(K309,[2]Proposito_programa!$C$2:$E$59,2,FALSE))","v":"Más árboles y más y mejor espacio público"},{"$f":"IF(ISERROR(VLOOKUP(K309,[2]Proposito_programa!$C$2:$E$59,3,FALSE)),\" \",VLOOKUP(K309,[2]Proposito_programa!$C$2:$E$59,3,FALSE))","v":"Propósito 2 : Cambiar Nuestros Hábitos de Vida para Reverdecer a Bogotá y Adaptarnos y Mitigar la Crisis Climática"},1770,1,1032403462,"CHRISTIAN CERINZA OSPINA","Persona Natural","-","-",null,6500000,null,0,0,6500000," $                          -  ","2021-12-09","2021-12-10","2022-01-09","30 DIAS",0,0,null,null,null,null,null,null,"X",null,0]
[298,2021,"FDLF-CD-298-2021","https://community.secop.gov.co/Public/Tendering/OpportunityDetail/Index?noticeUID=CO1.NTC.2449339&isFromPublicArea=True&isModal=true&asPopupView=true","Contratos de prestación de servicios profesionales y de apoyo a la gestión","Contratación directa","Prestación de servicios profesionales y de apoyo a la gestión, o para la ejecución de trabajos artísticos que sólo puedan encomendarse a determinadas personas naturales;","PRESTAR SERVICIOS DE APOYO EN LAS ACTIVIDADES DE SEGURIDAD Y CONVIVENCIA CIUDADANA, DE ACUERDO CON LAS NECESIDADES Y ESTRATEGIAS EMANADAS POR EL ÁREA DE GESTIÓN DEL DESARROLLO LOCAL, DE LA ALCALDÍA LOCAL DE FONTIBÓN.","Inversión","Un nuevo Contrato Social y ambiental para la Bogotá del Siglo XXI",43,{"$f":"IF(ISERROR(VLOOKUP(K310,[2]Proposito_programa!$C$2:$E$59,2,FALSE)),\" \",VLOOKUP(K310,[2]Proposito_programa!$C$2:$E$59,2,FALSE))","v":"Cultura ciudadana para la confianza, la convivencia y la participación desde la vida cotidiana"},{"$f":"IF(ISERROR(VLOOKUP(K310,[2]Proposito_programa!$C$2:$E$59,3,FALSE)),\" \",VLOOKUP(K310,[2]Proposito_programa!$C$2:$E$59,3,FALSE))","v":"Propósito 3: Inspirar confianza y legitimidad para vivir sin miedo y ser epicentro de cultura ciudadana, paz y reconciliación"},1775,1,80804691,"JOHAN MANUEL RAMOS RODRIGUEZ","Persona Natural","-","-",null,2433890,null,0,0,2433890," $                          -  ","2021-12-10","2021-12-14","2022-01-13","30 DIAS",0,0,null,null,null,null,null,null,"X",null,0]
[299,2021,"FDLF-CD-299-2021","https://community.secop.gov.co/Public/Tendering/OpportunityDetail/Index?noticeUID=CO1.NTC.2446037&isFromPublicArea=True&isModal=true&asPopupView=true","Contratos de prestación de servicios profesionales y de apoyo a la gestión","Contratación directa","Prestación de servicios profesionales y de apoyo a la gestión, o para la ejecución de trabajos artísticos que sólo puedan encomendarse a determinadas personas naturales;","PRESTAR LOS SERVICIOS PROFESIONALES A LA ALCALDÍA LOCAL DE FONTIBÓN, PARA LA EJECUCIÓN DE LAS ACTIVIDADES Y PROCESOS ADMINISTRATIVOS Y DE CAMPO RELACIONADOS CON LA REACTIVACIÓN ECONÓMICA EN EL MARCO DE LAS NECESIDADES DEL FONDO DE DESARROLLO LOCAL Y DINAMIZACIÓN PARA LA EJECUCIÓN DE LOS PROYECTOS QUE HACEN PARTE DEL PLAN DE DESARROLLO.","Inversión","Un nuevo Contrato Social y ambiental para la Bogotá del Siglo XXI",6,{"$f":"IF(ISERROR(VLOOKUP(K311,[2]Proposito_programa!$C$2:$E$59,2,FALSE)),\" \",VLOOKUP(K311,[2]Proposito_programa!$C$2:$E$59,2,FALSE))","v":"Sistema Distrital de Cuidado"},{"$f":"IF(ISERROR(VLOOKUP(K311,[2]Proposito_programa!$C$2:$E$59,3,FALSE)),\" \",VLOOKUP(K311,[2]Proposito_programa!$C$2:$E$59,3,FALSE))","v":"Propósito 1: Hacer un nuevo contrato social para incrementar la inclusión social, productiva y política"},1761,1,79855996,"MARLOM EDISON GONZALEZ SILVA","Persona Natural",null,"-",null,5500000,null,0,0,5500000," $                          -  ","2021-12-09","2021-12-10","2022-01-09","30 DIAS",0,0,null,null,null,null,null,null,"X",null,0]
[300,2021,"FDLF-MC-022-2021","https://community.secop.gov.co/Public/Tendering/OpportunityDetail/Index?noticeUID=CO1.NTC.2416392&isFromPublicArea=True&isModal=true&asPopupView=true","Suministro","Contratación mínima cuantia",null,"CONTRATAR EL SUMINISTRO DE REFRIGERIOS Y/O ALIMENTOS PREPARADOS A PREVIOS UNITARIOS Y A MONTO AGOTABLE, NECESARIOS EN LAS DIFERENTES ACTIVIDADES QUE REALIZA LA ADMINSITRACIÓN LOCAL DE FONTIBÓN","Funcionamiento","Un nuevo Contrato Social y ambiental para la Bogotá del Siglo XXI","No aplica",{"$f":"IF(ISERROR(VLOOKUP(K312,[2]Proposito_programa!$C$2:$E$59,2,FALSE)),\" \",VLOOKUP(K312,[2]Proposito_programa!$C$2:$E$59,2,FALSE))","v":" "},{"$f":"IF(ISERROR(VLOOKUP(K312,[2]Proposito_programa!$C$2:$E$59,3,FALSE)),\" \",VLOOKUP(K312,[2]Proposito_programa!$C$2:$E$59,3,FALSE))","v":" "},101,4,800081700,"FRUPYS LTDA","Persona Natural",null,"-",null,25400000,null,0,0,25400000," $                          -  ","2021-12-10","2021-12-15","2022-04-14","122 DÍAS",0,0,null,null,null,null,null,"X",null,null,0]
[301,2021,"FDLF-CD-301-2021","https://community.secop.gov.co/Public/Tendering/OpportunityDetail/Index?noticeUID=CO1.NTC.2454321&isFromPublicArea=True&isModal=true&asPopupView=true","Contratos de prestación de servicios profesionales y de apoyo a la gestión","Contratación directa","Prestación de servicios profesionales y de apoyo a la gestión, o para la ejecución de trabajos artísticos que sólo puedan encomendarse a determinadas personas naturales;","PRESTAR SERVICIOS PROFESIONALES AL ÁREA DE GESTIÓN DEL DESARROLLO LOCAL DE LA ALCALDÍA LOCAL DE FONTIBÓN, PARA REALIZAR EL CONTROL, SEGUIMIENTO, ACTUALIZACIÓN Y ANÁLISIS DEL BANCO DE PROGRAMAS Y PROYECTOS, ASÍ COMO TAMBIÉN LOS INSTRUMENTOS DE LA PLANEACIÓN","Inversión","Un nuevo Contrato Social y ambiental para la Bogotá del Siglo XXI",57,{"$f":"IF(ISERROR(VLOOKUP(K313,[2]Proposito_programa!$C$2:$E$59,2,FALSE)),\" \",VLOOKUP(K313,[2]Proposito_programa!$C$2:$E$59,2,FALSE))","v":"Gestión pública local"},{"$f":"IF(ISERROR(VLOOKUP(K313,[2]Proposito_programa!$C$2:$E$59,3,FALSE)),\" \",VLOOKUP(K313,[2]Proposito_programa!$C$2:$E$59,3,FALSE))","v":"Propósito 5: Construir Bogotá - Región con gobierno abierto, transparente y ciudadanía consciente"},1783,1,79833124,"PABLO ENRIQUE DELGADO MELENDEZ","Persona Natural","-","-",null,3200000,null,0,0,3200000," $                          -  ","2021-12-14","2021-12-15","2021-12-30","16 DÍAS",0,0,null,null,null,null,null,null,"X",null,0]
[302,2021,"FDLF SAMC 020 2021","https://community.secop.gov.co/Public/Tendering/OpportunityDetail/Index?noticeUID=CO1.NTC.2415594&isFromPublicArea=True&isModal=true&asPopupView=true","Contratos de prestación de servicios","Selección abreviada","Selección abreviada por menor cuantía ","PRESTAR LOS SERVICIOS DE ESTERILIZACION Y BRIGADAS MEDICA VETERINARIAS A FELINOS Y CANINOS EN CONDICIÓN DE ABANDONO Y ANIMALES DE COMPAÑÍA DE LOS ESTRATOS 1, 2 Y 3; ASÍ COMO BRINDAR ACOMPAÑAMIENTO EN LAS ACCIONES DE CULTURA CIUDADANA EN TENENCIA RESPONSABLE Y ADOPCIÓN EN LA LOCALIDAD DE FONTIBON.","Inversión","Un nuevo Contrato Social y ambiental para la Bogotá del Siglo XXI",34,{"$f":"IF(ISERROR(VLOOKUP(K314,[2]Proposito_programa!$C$2:$E$59,2,FALSE)),\" \",VLOOKUP(K314,[2]Proposito_programa!$C$2:$E$59,2,FALSE))","v":"Bogotá protectora de los animales"},{"$f":"IF(ISERROR(VLOOKUP(K314,[2]Proposito_programa!$C$2:$E$59,3,FALSE)),\" \",VLOOKUP(K314,[2]Proposito_programa!$C$2:$E$59,3,FALSE))","v":"Propósito 2 : Cambiar Nuestros Hábitos de Vida para Reverdecer a Bogotá y Adaptarnos y Mitigar la Crisis Climática"},1771,7,832003656,"CORPORACION NACIONAL PARA EL DESARROLLO SOSTENIBLE CONADES","Persona Jurídica","-","-",null,191328633,null,0,0,191328633," $                          -  ","2021-12-10","2021-12-20","2022-06-19","182 DÍAS",0,0,null,null,null,null,null,"X",null,null,0]
[303,2021,"FDLF -SAMC 021-2021","https://community.secop.gov.co/Public/Tendering/OpportunityDetail/Index?noticeUID=CO1.NTC.2416012&isFromPublicArea=True&isModal=true&asPopupView=true","Contratos de prestación de servicios","Selección abreviada","Selección abreviada por menor cuantía ","PRESTAR SERVICIOS DE MANTENIMIENTO PREVENTIVO Y CORRECTIVO CON SUMINISTRO E INSTALACIÓN DE REPUESTOS Y ACCESORIOS NUEVOS Y ORIGINALES DE CADA UNA DE LAS MARCAS DEL PARQUE AUTOMOTOR DEL FONDO DE DESARROLLO LOCAL DE FONTIBÓN, A MONTO AGOTABLE","Funcionamiento","Un nuevo Contrato Social y ambiental para la Bogotá del Siglo XXI","No aplica",{"$f":"IF(ISERROR(VLOOKUP(K315,[2]Proposito_programa!$C$2:$E$59,2,FALSE)),\" \",VLOOKUP(K315,[2]Proposito_programa!$C$2:$E$59,2,FALSE))","v":" "},{"$f":"IF(ISERROR(VLOOKUP(K315,[2]Proposito_programa!$C$2:$E$59,3,FALSE)),\" \",VLOOKUP(K315,[2]Proposito_programa!$C$2:$E$59,3,FALSE))","v":" "},604,3,900927037,"DORADAUTOS SAS","Persona Jurídica","-",null,null,120000000,null,0,0,120000000," $                          -  ","2021-12-14","2021-12-15","2022-04-14","335 DÍAS",0,0,null,null,null,null,null,"X",null,null,0]
[304,2021,"FDLF SAMC 035 2021","https://community.secop.gov.co/Public/Tendering/OpportunityDetail/Index?noticeUID=CO1.NTC.2426008&isFromPublicArea=True&isModal=true&asPopupView=true","Contratos de prestación de servicios","Selección abreviada","Selección abreviada por menor cuantía ","CONTRATAR LA PRESTACIÓN DE SERVICIOS LOGÍSTICOS, OPERATIVOS Y TÉCNICOS PARA EL DESARROLLO Y REALIZACIÓN DE FESTIVALES ARTÍSTICOS Y CULTURALES, CONMEMORACIONES LOCALES, Y PROCESOS DE FORMACIÓN EN EL MARCO DE LOS PROYECTOS DE INVERSIÓN EN EL PLAN DE DESARROLLO UN NUEVO CONTRATO SOCIAL Y AMBIENTAL PARA FONTIBÓN","Inversión","Un nuevo Contrato Social y ambiental para la Bogotá del Siglo XXI",21,{"$f":"IF(ISERROR(VLOOKUP(K316,[2]Proposito_programa!$C$2:$E$59,2,FALSE)),\" \",VLOOKUP(K316,[2]Proposito_programa!$C$2:$E$59,2,FALSE))","v":"Creación y vida cotidiana: Apropiación ciudadana del arte, la cultura y el patrimonio, para la democracia cultural"},{"$f":"IF(ISERROR(VLOOKUP(K316,[2]Proposito_programa!$C$2:$E$59,3,FALSE)),\" \",VLOOKUP(K316,[2]Proposito_programa!$C$2:$E$59,3,FALSE))","v":"Propósito 1: Hacer un nuevo contrato social para incrementar la inclusión social, productiva y política"},1758,1,900216251,"ASOCIACION PARA EL DESARROLLO INTEGRAL DE LA FAMILIA COLOMBIANA","Persona Jurídica","-","-",null,181443101,null,0,0,181443101," $                          -  ","2021-12-17","2022-01-01","2022-04-30","122 DÍAS",0,0,null,null,null,null,null,"X",null,null,0]
[304,2021,"FDLF SAMC 035 2021","https://community.secop.gov.co/Public/Tendering/OpportunityDetail/Index?noticeUID=CO1.NTC.2426008&isFromPublicArea=True&isModal=true&asPopupView=true","Contratos de prestación de servicios","Selección abreviada","Selección abreviada por menor cuantía ","CONTRATAR LA PRESTACIÓN DE SERVICIOS LOGÍSTICOS, OPERATIVOS Y TÉCNICOS PARA EL DESARROLLO Y REALIZACIÓN DE FESTIVALES ARTÍSTICOS Y CULTURALES, CONMEMORACIONES LOCALES, Y PROCESOS DE FORMACIÓN EN EL MARCO DE LOS PROYECTOS DE INVERSIÓN EN EL PLAN DE DESARROLLO UN NUEVO CONTRATO SOCIAL Y AMBIENTAL PARA FONTIBÓN","Inversión","Un nuevo Contrato Social y ambiental para la Bogotá del Siglo XXI",40,{"$f":"IF(ISERROR(VLOOKUP(K317,[2]Proposito_programa!$C$2:$E$59,2,FALSE)),\" \",VLOOKUP(K317,[2]Proposito_programa!$C$2:$E$59,2,FALSE))","v":"Más mujeres viven una vida libre de violencias, se sienten seguras y acceden con confianza al sistema de justicia"},{"$f":"IF(ISERROR(VLOOKUP(K317,[2]Proposito_programa!$C$2:$E$59,3,FALSE)),\" \",VLOOKUP(K317,[2]Proposito_programa!$C$2:$E$59,3,FALSE))","v":"Propósito 3: Inspirar confianza y legitimidad para vivir sin miedo y ser epicentro de cultura ciudadana, paz y reconciliación"},1774,1,900216251,"ASOCIACION PARA EL DESARROLLO INTEGRAL DE LA FAMILIA COLOMBIANA","Persona Jurídica",null,null,null,59711961,null,0,0,59711961," $                          -  ","2021-12-17","2022-01-01","2022-04-30","122 DÍAS",0,0,null,null,null,null,null,"X",null,null,0]
[305,2021,"FDLF CMA 031 2021","https://community.secop.gov.co/Public/Tendering/OpportunityDetail/Index?noticeUID=CO1.NTC.2416095&isFromPublicArea=True&isModal=true&asPopupView=true","Interventoría","Concurso de méritos",null,"EJECUTAR LA INTERVENTORIA TECNICA, FINANCIERA, ADMINISTRATIVA, DE CALIDAD, LEGAL SOCIAL, AMBIENTAL Y DE SEGURIDAD Y SALUD EN EL TRABAJO AL CONTRATO DE OBRA CUYO OBJETO ES: \"CONTRATAR MEDIANTE EL SISTEMA DE PRECIOS UNITARIOS FIJOS SIN FORMULA DE AJUSTE, A MONTO AGOTABLE, EL DIAGNÓSTICO, MANTENIMIENTO Y/O DOTACIÓN DEL MOBILIARIO DE LOS PARQUES VECINALES Y DE BOLSILLO, DE LA LOCALIDAD DE FONTIBÓN EN BOGOTÁ D.C.","Inversión","Un nuevo Contrato Social y ambiental para la Bogotá del Siglo XXI",33,{"$f":"IF(ISERROR(VLOOKUP(K318,[2]Proposito_programa!$C$2:$E$59,2,FALSE)),\" \",VLOOKUP(K318,[2]Proposito_programa!$C$2:$E$59,2,FALSE))","v":"Más árboles y más y mejor espacio público"},{"$f":"IF(ISERROR(VLOOKUP(K318,[2]Proposito_programa!$C$2:$E$59,3,FALSE)),\" \",VLOOKUP(K318,[2]Proposito_programa!$C$2:$E$59,3,FALSE))","v":"Propósito 2 : Cambiar Nuestros Hábitos de Vida para Reverdecer a Bogotá y Adaptarnos y Mitigar la Crisis Climática"},1770,7,900426155,"PROYECTISTAS ASOCIADOS SAS","Persona Jurídica","-","-",null,74006219,null,0,0,74006219," $                          -  ","2021-12-20","2022-01-02","2022-06-01","152 DÍAS",0,0,null,null,null,null,null,"X",null,null,0]
[306,2021,"FDLF-MC-047-2021","https://community.secop.gov.co/Public/Tendering/OpportunityDetail/Index?noticeUID=CO1.NTC.2451744&isFromPublicArea=True&isModal=true&asPopupView=true","Contratos de prestación de servicios","Contratación mínima cuantia",null,"PRESTAR LOS SERVICIOS DE APOYO LOGÍSTICO PARA LA CELEBRACIÓN DEL DÍA DEL COMUNAL 2021, A LOS DIGNATARIOS DE LA LOCALIDAD DE FONTIBÓN","Inversión","Un nuevo Contrato Social y ambiental para la Bogotá del Siglo XXI",55,{"$f":"IF(ISERROR(VLOOKUP(K319,[2]Proposito_programa!$C$2:$E$59,2,FALSE)),\" \",VLOOKUP(K319,[2]Proposito_programa!$C$2:$E$59,2,FALSE))","v":"Fortalecimiento de cultura ciudadana y su institucionalidad"},{"$f":"IF(ISERROR(VLOOKUP(K319,[2]Proposito_programa!$C$2:$E$59,3,FALSE)),\" \",VLOOKUP(K319,[2]Proposito_programa!$C$2:$E$59,3,FALSE))","v":"Propósito 5: Construir Bogotá - Región con gobierno abierto, transparente y ciudadanía consciente"},1782,7,901281435,"EVENTOS Y PRODUCCIONES SALOMON SAS","Persona Jurídica","-","-",null,21727000,null,0,0,21727000," $                          -  ","2021-12-20","2022-02-01","2022-06-30","150 DÍAS",0,0,null,null,null,null,null,"X",null,null,0]
[307,2021,"FDLF-SASI-015-2021","https://community.secop.gov.co/Public/Tendering/OpportunityDetail/Index?noticeUID=CO1.NTC.2404254&isFromPublicArea=True&isModal=true&asPopupView=true","Compraventa de bienes muebles","Selección abreviada","Subasta inversa ","ADQUIRIR LA DOTACIÓN PEDAGÓGICA DE LOS SERVICIOS DE ATENCIÓN A LA PRIMERA INFANCIA Y ADOLESCENCIA DEL CENTRO AMAR Y LOS JARDINES INFANTILES DE LA LOCALIDAD DE FONTIBÓN","Inversión","Un nuevo Contrato Social y ambiental para la Bogotá del Siglo XXI",6,{"$f":"IF(ISERROR(VLOOKUP(K320,[2]Proposito_programa!$C$2:$E$59,2,FALSE)),\" \",VLOOKUP(K320,[2]Proposito_programa!$C$2:$E$59,2,FALSE))","v":"Sistema Distrital de Cuidado"},{"$f":"IF(ISERROR(VLOOKUP(K320,[2]Proposito_programa!$C$2:$E$59,3,FALSE)),\" \",VLOOKUP(K320,[2]Proposito_programa!$C$2:$E$59,3,FALSE))","v":"Propósito 1: Hacer un nuevo contrato social para incrementar la inclusión social, productiva y política"},1762,6,901142692,"COMERCIALIZADORA E&T SAS","Persona Jurídica","-","-",null,169019124,null,0,0,169019124," $                          -  ","2021-12-20","2021-12-28","2022-03-27","90 DÍAS",0,0,null,null,null,null,null,"X",null,null,0]
[308,2021,"FDLF-SASI-012-2021","https://community.secop.gov.co/Public/Tendering/OpportunityDetail/Index?noticeUID=CO1.NTC.2396786&isFromPublicArea=True&isModal=true&asPopupView=true","Compraventa de bienes muebles","Selección abreviada","Subasta inversa ","ADQUIRIR ELEMENTOS E IMPLEMENTOS RECREATIVOS Y DEPORTIVOS PARA EL DESARROLLO DE LOS PROCESOS RECREO DEPORTIVOS DE FONTIBON EN EL MARCO DEL PROYECTO DE INVERSIÓN 1757 UN NUEVO CONTRATO PARA EL DEPORTE EN FONTIBÓN","Inversión","Un nuevo Contrato Social y ambiental para la Bogotá del Siglo XXI",20,{"$f":"IF(ISERROR(VLOOKUP(K321,[2]Proposito_programa!$C$2:$E$59,2,FALSE)),\" \",VLOOKUP(K321,[2]Proposito_programa!$C$2:$E$59,2,FALSE))","v":"Bogotá, referente en cultura, deporte, recreación y actividad física, con parques para el desarrollo y la salud"},{"$f":"IF(ISERROR(VLOOKUP(K321,[2]Proposito_programa!$C$2:$E$59,3,FALSE)),\" \",VLOOKUP(K321,[2]Proposito_programa!$C$2:$E$59,3,FALSE))","v":"Propósito 1: Hacer un nuevo contrato social para incrementar la inclusión social, productiva y política"},1757,10,900276220,"ELITE DEPORTIVA SAS","Persona Jurídica","-","-",null,281886490,null,0,0,281886490," $                          -  ","2021-12-20","2022-02-10","2022-03-09","30 DIAS",0,0,null,null,null,null,null,"X",null,null,0]
[309,2021,"FDLF-SASI-011-2021","https://community.secop.gov.co/Public/Tendering/OpportunityDetail/Index?noticeUID=CO1.NTC.2401804&isFromPublicArea=True&isModal=true&asPopupView=true","Compraventa de bienes muebles","Selección abreviada","Subasta inversa ","ADQUIRIR ELEMENTOS DE CÓMPUTO Y TECNOLOGÍA PARA LAS INSTITUCIONES EDUCATIVAS OFICIALES DE LA LOCALIDAD DE FONTIBÓN","Inversión","Un nuevo Contrato Social y ambiental para la Bogotá del Siglo XXI",14,{"$f":"IF(ISERROR(VLOOKUP(K322,[2]Proposito_programa!$C$2:$E$59,2,FALSE)),\" \",VLOOKUP(K322,[2]Proposito_programa!$C$2:$E$59,2,FALSE))","v":"Formación integral: más y mejor tiempo en los colegios"},{"$f":"IF(ISERROR(VLOOKUP(K322,[2]Proposito_programa!$C$2:$E$59,3,FALSE)),\" \",VLOOKUP(K322,[2]Proposito_programa!$C$2:$E$59,3,FALSE))","v":"Propósito 1: Hacer un nuevo contrato social para incrementar la inclusión social, productiva y política"},1754,10,830016004,"REDCOMPUTO LIMITADA","Persona Jurídica","-","-",null,315273000,null,0,0,315273000," $                          -  ","2021-12-22","2021-12-29","2022-03-28","90 DÍAS",0,0,null,null,null,null,null,"X",null,null,0]
[310,2021,"FDLF-SAMC-013-2021","https://community.secop.gov.co/Public/Tendering/OpportunityDetail/Index?noticeUID=CO1.NTC.2410353&isFromPublicArea=True&isModal=true&asPopupView=true","Contratos de prestación de servicios","Selección abreviada","Selección abreviada por menor cuantía ","IMPLEMENTAR UN PROCESO DE PARTICIPACIÓN EN EL MANEJO DE EMERGENCIAS QUE INVOLUCRE A LAS FAMILIAS MULTIESPECIE, PARA LA PRIORIZACIÓN Y DISEÑO DEL FORTALECIMIENTO AL MANEJO DE EMERGENCIAS Y DESASTRES REFERENCIADOS A LA CONTRIBUCIÓN DE MEDIDAS DE MITIGACIÓN, PREVENCIÓN Y CONTROL DEL RIESGO","Inversión","Un nuevo Contrato Social y ambiental para la Bogotá del Siglo XXI",30,{"$f":"IF(ISERROR(VLOOKUP(K323,[2]Proposito_programa!$C$2:$E$59,2,FALSE)),\" \",VLOOKUP(K323,[2]Proposito_programa!$C$2:$E$59,2,FALSE))","v":"Eficiencia en la atención de emergencias"},{"$f":"IF(ISERROR(VLOOKUP(K323,[2]Proposito_programa!$C$2:$E$59,3,FALSE)),\" \",VLOOKUP(K323,[2]Proposito_programa!$C$2:$E$59,3,FALSE))","v":"Propósito 2 : Cambiar Nuestros Hábitos de Vida para Reverdecer a Bogotá y Adaptarnos y Mitigar la Crisis Climática"},1768,2,900017592,"ASOCIACION ARKAMBIENTAL","Persona Jurídica","-","-",null,151904749,null,0,0,151904749," $                          -  ","2021-12-21","2022-02-04","2022-08-03","182 DÍAS",0,0,null,null,null,null,null,"X",null,null,0]
[311,2021,"FDLF-LP-017-2021","https://community.secop.gov.co/Public/Tendering/OpportunityDetail/Index?noticeUID=CO1.NTC.2417643&isFromPublicArea=True&isModal=true&asPopupView=true","Contratos de prestación de servicios","Licitación pública",null,"PRESTAR LOS SERVICIOS TECNICOS Y LOGISTICOS PARA LA FORMACIÓN Y PROMOCIÓN EN TEMAS DE PREVENCIÓN A LA VIOLENCIA INTRAFAMILIAR Y VIOLENCIA SEXUAL EN LA LOCALIDAD DE FONTIBÓN","Inversión","Un nuevo Contrato Social y ambiental para la Bogotá del Siglo XXI",6,{"$f":"IF(ISERROR(VLOOKUP(K324,[2]Proposito_programa!$C$2:$E$59,2,FALSE)),\" \",VLOOKUP(K324,[2]Proposito_programa!$C$2:$E$59,2,FALSE))","v":"Sistema Distrital de Cuidado"},{"$f":"IF(ISERROR(VLOOKUP(K324,[2]Proposito_programa!$C$2:$E$59,3,FALSE)),\" \",VLOOKUP(K324,[2]Proposito_programa!$C$2:$E$59,3,FALSE))","v":"Propósito 1: Hacer un nuevo contrato social para incrementar la inclusión social, productiva y política"},1762,11,9000626665,"PRIME PRODUCCIONES S.A","Persona Jurídica","-","-",null,368170073,null,0,0,368170073," $                          -  ","2021-12-20","2021-12-28","2022-05-27","152 DÍAS",0,0,null,null,null,null,null,"X",null,null,0]
[312,2021,"FDLF-MC-050-2021","https://community.secop.gov.co/Public/Tendering/OpportunityDetail/Index?noticeUID=CO1.NTC.2455540&isFromPublicArea=True&isModal=true&asPopupView=true","Suministro","Contratación mínima cuantia",null,"SUMINISTRO DE LOS ELEMENTOS DE FERRETERÍA NECESARIOS PARA REALIZAR EL MANTENIMIENTO, REPARACIONES O MEJORAS DE TIPO LOCATIVO DE LOS BIENES INMUEBLES Y MUEBLES A CARGO DEL FONDO DE DESARROLLO LOCAL DE FONTIBÓN","Funcionamiento","Un nuevo Contrato Social y ambiental para la Bogotá del Siglo XXI","No aplica",{"$f":"IF(ISERROR(VLOOKUP(K325,[2]Proposito_programa!$C$2:$E$59,2,FALSE)),\" \",VLOOKUP(K325,[2]Proposito_programa!$C$2:$E$59,2,FALSE))","v":" "},{"$f":"IF(ISERROR(VLOOKUP(K325,[2]Proposito_programa!$C$2:$E$59,3,FALSE)),\" \",VLOOKUP(K325,[2]Proposito_programa!$C$2:$E$59,3,FALSE))","v":" "},302,4,830073899,"COMERCIALIZADORA ELECTROCON SAS","Persona Jurídica","-","-",null,25400000,null,0,0,25400000,0,"2021-12-23","2021-01-03","2022-09-02","243 DÍAS",0,0,null,null,null,null,null,"X",null,null,0.02]
[313,2021,"FDLF-LP-008-2021","https://community.secop.gov.co/Public/Tendering/OpportunityDetail/Index?noticeUID=CO1.NTC.2390526&isFromPublicArea=True&isModal=true&asPopupView=true","Obra pública","Licitación pública",null,"REALIZAR LAS OBRAS DE CONSERVACIÓN DE LA MALLA VIAL Y ESPACIO PÚBLICO ASOCIADO EN LA LOCALIDAD DE FONTIBÓN, BOGOTÁ, D.C. A TRAVÉS DEL SISTEMA DE PRECIOS UNITARIOS FIJOS, SIN FORMULA DE REAJUSTE Y A MONTO AGOTABLE","Inversión","Un nuevo Contrato Social y ambiental para la Bogotá del Siglo XXI",49,{"$f":"IF(ISERROR(VLOOKUP(K326,[2]Proposito_programa!$C$2:$E$59,2,FALSE)),\" \",VLOOKUP(K326,[2]Proposito_programa!$C$2:$E$59,2,FALSE))","v":"Movilidad segura, sostenible y accesible"},{"$f":"IF(ISERROR(VLOOKUP(K326,[2]Proposito_programa!$C$2:$E$59,3,FALSE)),\" \",VLOOKUP(K326,[2]Proposito_programa!$C$2:$E$59,3,FALSE))","v":"Propósito 4: Hacer de Bogotá Región un modelo de movilidad multimodal, incluyente y sostenible"},1780,44,8305097503,"MANVIALES SAS","Persona Jurídica","-","-",null,1236086370,null,0,0,{"$f":"Y326+V326+W326","v":1236086370}," $                          -  ","2021-12-22","2022-01-31","2022-05-15","105 DÍAS",0,0,null,null,null,null,null,"X",null,null,0]
[314,2021,"FDLF-LP-009-2021","https://community.secop.gov.co/Public/Tendering/OpportunityDetail/Index?noticeUID=CO1.NTC.2406440&isFromPublicArea=True&isModal=true&asPopupView=true","Obra pública","Licitación pública",null,"CONTRATAR MEDIANTE EL SISTEMA DE PRECIOS UNITARIOS FIJOS SIN FORMULA DE AJUSTE, A MONTO AGOTABLE, EL DIAGNÓSTICO, ADECUACIÓN, MANTENIMIENTO Y/O DOTACIÓN DEL MOBILIARIO DE LOS PARQUES VECINALES Y DE BOLSILLO DE LA LOCALIDAD DE FONTIBÓN EN BOGOTÁ D.C.","Inversión","Un nuevo Contrato Social y ambiental para la Bogotá del Siglo XXI",33,{"$f":"IF(ISERROR(VLOOKUP(K327,[2]Proposito_programa!$C$2:$E$59,2,FALSE)),\" \",VLOOKUP(K327,[2]Proposito_programa!$C$2:$E$59,2,FALSE))","v":"Más árboles y más y mejor espacio público"},{"$f":"IF(ISERROR(VLOOKUP(K327,[2]Proposito_programa!$C$2:$E$59,3,FALSE)),\" \",VLOOKUP(K327,[2]Proposito_programa!$C$2:$E$59,3,FALSE))","v":"Propósito 2 : Cambiar Nuestros Hábitos de Vida para Reverdecer a Bogotá y Adaptarnos y Mitigar la Crisis Climática"},1770,17,900053011,"CONSTRUCTORA VALHER","Persona Jurídica","-","-",null,620219700,null,0,0,620219700," $                          -  ","2021-12-22","2022-01-31","2022-05-30","122 DÍAS",0,0,null,null,null,null,null,"X",null,null,0]
[315,2021,"FDLF-MC-049-2021","https://community.secop.gov.co/Public/Tendering/OpportunityDetail/Index?noticeUID=CO1.NTC.2455232&isFromPublicArea=True&isModal=true&asPopupView=true","Compraventa de bienes muebles","Contratación mínima cuantia",null,"ADQUISICIÓN DE CARPAS PARA ACTIVIDADES QUE SE REALICEN EN EL MARCO DE LA GESTIÓN INSTITUCIONAL EN LA LOCALIDAD DE FONTIBÓN.","Funcionamiento","Un nuevo Contrato Social y ambiental para la Bogotá del Siglo XXI","No aplica",{"$f":"IF(ISERROR(VLOOKUP(K328,[2]Proposito_programa!$C$2:$E$59,2,FALSE)),\" \",VLOOKUP(K328,[2]Proposito_programa!$C$2:$E$59,2,FALSE))","v":" "},{"$f":"IF(ISERROR(VLOOKUP(K328,[2]Proposito_programa!$C$2:$E$59,3,FALSE)),\" \",VLOOKUP(K328,[2]Proposito_programa!$C$2:$E$59,3,FALSE))","v":" "},302,1," 830.123.987","CEDEINCO","Persona Jurídica","-","-",null,25400000,null,0,0,25400000," $                          -  ","2021-12-31","2022-02-10","2022-03-09","30 DÍAS",0,0,null,null,null,null,null,"X",null,null,0]
[316,2021,"FDLF LP 016 2021","https://community.secop.gov.co/Public/Tendering/OpportunityDetail/Index?noticeUID=CO1.NTC.2412336&isFromPublicArea=True&isModal=true&asPopupView=true","Contratos de prestación de servicios","Licitación pública",null,"PRESTAR LOS SERVICIOS PARA LA IMPLEMENTACIÓN DE 36 PROCESOS CIUDADANOS DE EDUCACIÓN AMBIENTAL PROCEDA PARA LA VIGENCIA 2021 QUE SE ADAPTEN A LOS CONTEXTOS SOCIALES DE LA LOCALIDAD DE FONTIBÓN","Inversión","Un nuevo Contrato Social y ambiental para la Bogotá del Siglo XXI",27,{"$f":"IF(ISERROR(VLOOKUP(K329,[2]Proposito_programa!$C$2:$E$59,2,FALSE)),\" \",VLOOKUP(K329,[2]Proposito_programa!$C$2:$E$59,2,FALSE))","v":"Cambio cultural para la gestión de la crisis climática"},{"$f":"IF(ISERROR(VLOOKUP(K329,[2]Proposito_programa!$C$2:$E$59,3,FALSE)),\" \",VLOOKUP(K329,[2]Proposito_programa!$C$2:$E$59,3,FALSE))","v":"Propósito 2 : Cambiar Nuestros Hábitos de Vida para Reverdecer a Bogotá y Adaptarnos y Mitigar la Crisis Climática"},1766,4,901259581,"ALGOAP INC S.A.S.","Persona Jurídica","-","-",null,601233430,null,0,0,601233430," $                          -  ","2021-12-23","2021-01-11","2022-07-10","182 DÍAS",0,0,null,null,null,null,null,"X",null,null,0]
[317,2021,"FDLF SAMC 040 2021","https://community.secop.gov.co/Public/Tendering/OpportunityDetail/Index?noticeUID=CO1.NTC.2444537&isFromPublicArea=True&isModal=true&asPopupView=true","Obra pública","Selección abreviada","Selección abreviada por menor cuantía ","CONTRATAR A PRECIOS UNITARIOS FIJOS SIN FORMULA DE AJUSTE, LAS REPARACIONES LOCATIVAS DE LOS SALONES COMUNALES PRIORIZADOS EN LA LOCALIDAD DE FONTIBON.","Inversión","Un nuevo Contrato Social y ambiental para la Bogotá del Siglo XXI",55,{"$f":"IF(ISERROR(VLOOKUP(K330,[2]Proposito_programa!$C$2:$E$59,2,FALSE)),\" \",VLOOKUP(K330,[2]Proposito_programa!$C$2:$E$59,2,FALSE))","v":"Fortalecimiento de cultura ciudadana y su institucionalidad"},{"$f":"IF(ISERROR(VLOOKUP(K330,[2]Proposito_programa!$C$2:$E$59,3,FALSE)),\" \",VLOOKUP(K330,[2]Proposito_programa!$C$2:$E$59,3,FALSE))","v":"Propósito 5: Construir Bogotá - Región con gobierno abierto, transparente y ciudadanía consciente"},1782,5," 900.498.361","INGENIEROS PROYECTAR SAS","Persona Jurídica","-","-",null,218815333,null,0,0,{"$f":"Y330+V330+W330","v":218815333}," $                          -  ","2021-12-22","2022-01-26","2022-05-25","122 DÍAS",0,0,null,null,null,null,null,"X",null,null,0]
[318,2021,"FDLF SAMC 041 2021","https://community.secop.gov.co/Public/Tendering/OpportunityDetail/Index?noticeUID=CO1.NTC.2447771&isFromPublicArea=True&isModal=true&asPopupView=true","Contratos de prestación de servicios","Selección abreviada","Selección abreviada por menor cuantía ","FORTALECER ORGANIZACIONES DE VÍCTIMAS (OV), ORGANIZACIÓN DE VÍCTIMAS DE LAS ETNIAS AFRO, ORGANIZACIONES DEFENSORAS VÍCTIMAS (ODV), PERSONAS VICTIMAS, ORGANIZACIONES DE PERSONAS EN REINCORPORACIÓN Y PERSONAS EN REINCORPORACIÓN HABITANTES DE LA LOCALIDAD DE FONTIBÓN MEDIANTE PROCESOS DE FORMACIÓN Y APOYO DE INICIATIVAS","Inversión","Un nuevo Contrato Social y ambiental para la Bogotá del Siglo XXI",39,{"$f":"IF(ISERROR(VLOOKUP(K331,[2]Proposito_programa!$C$2:$E$59,2,FALSE)),\" \",VLOOKUP(K331,[2]Proposito_programa!$C$2:$E$59,2,FALSE))","v":"Bogotá territorio de paz y atención integral a las víctimas del conflicto armado"},{"$f":"IF(ISERROR(VLOOKUP(K331,[2]Proposito_programa!$C$2:$E$59,3,FALSE)),\" \",VLOOKUP(K331,[2]Proposito_programa!$C$2:$E$59,3,FALSE))","v":"Propósito 3: Inspirar confianza y legitimidad para vivir sin miedo y ser epicentro de cultura ciudadana, paz y reconciliación"},1773,2,812006863,"FUNVIFRA","Persona Jurídica","-","-",null,209776545,null,0,0,209776545," $                          -  ","2021-12-23","2022-01-31","2022-07-30","182 DÍAS",0,0,null,null,null,null,null,"X",null,null,0]
[319,2021,"FDLF-MC-054-2021","https://community.secop.gov.co/Public/Tendering/OpportunityDetail/Index?noticeUID=CO1.NTC.2464117&isFromPublicArea=True&isModal=true&asPopupView=true","Contratos de prestación de servicios","Contratación mínima cuantia",null,"PRESTAR LOS SERVICIOS DE URGENCIAS MEDICO VETERINARIAS A FELINOS Y CANINOS EN CONDICIÓN DE ABANDONO Y ANIMALES DE COMPAÑÍA DE LOS ESTRATOS 1, 2 Y 3; EN LA LOCALIDAD DE FONTIBÓN","Inversión","Un nuevo Contrato Social y ambiental para la Bogotá del Siglo XXI",34,{"$f":"IF(ISERROR(VLOOKUP(K332,[2]Proposito_programa!$C$2:$E$59,2,FALSE)),\" \",VLOOKUP(K332,[2]Proposito_programa!$C$2:$E$59,2,FALSE))","v":"Bogotá protectora de los animales"},{"$f":"IF(ISERROR(VLOOKUP(K332,[2]Proposito_programa!$C$2:$E$59,3,FALSE)),\" \",VLOOKUP(K332,[2]Proposito_programa!$C$2:$E$59,3,FALSE))","v":"Propósito 2 : Cambiar Nuestros Hábitos de Vida para Reverdecer a Bogotá y Adaptarnos y Mitigar la Crisis Climática"},1771,2,900856657,"D&M SOLUTIONS SAS","Persona Jurídica","-","-",null,25000000,null,0,0,25000000," $                          -  ","2021-12-30","2022-01-14","2022-07-13","182 DÍAS",0,0,null,null,null,null,null,"X",null,null,0]
[320,2021,"FDLF-SASI-038-2021","https://community.secop.gov.co/Public/Tendering/OpportunityDetail/Index?noticeUID=CO1.NTC.2435024&isFromPublicArea=True&isModal=true&asPopupView=true","Suministro","Selección abreviada","Subasta inversa ","SUMINISTRO DE BIENES E INSUMOS PARA EL DESARROLLO DE ACCIONES DE ARBORIZACIÓN Y AGRICULTURA URBANA EN LA LOCALIDAD DE FONTIBÓN","Inversión","Un nuevo Contrato Social y ambiental para la Bogotá del Siglo XXI",24,{"$f":"IF(ISERROR(VLOOKUP(K333,[2]Proposito_programa!$C$2:$E$59,2,FALSE)),\" \",VLOOKUP(K333,[2]Proposito_programa!$C$2:$E$59,2,FALSE))","v":"Bogotá región emprendedora e innovadora"},{"$f":"IF(ISERROR(VLOOKUP(K333,[2]Proposito_programa!$C$2:$E$59,3,FALSE)),\" \",VLOOKUP(K333,[2]Proposito_programa!$C$2:$E$59,3,FALSE))","v":"Propósito 1: Hacer un nuevo contrato social para incrementar la inclusión social, productiva y política"},1759,4," 901.550.670","UT SB/PADYF INSUMOS FONTIBON","Persona Jurídica","-","-",null,202784581,null,0,0,202784581," $                          -  ","2021-12-30","2022-01-14","2022-08-13","213 DÍAS",0,0,null,null,null,null,null,"X",null,null,0]
[321,2021,"FDLF-SASI-038-2021","https://community.secop.gov.co/Public/Tendering/OpportunityDetail/Index?noticeUID=CO1.NTC.2435024&isFromPublicArea=True&isModal=true&asPopupView=true","Suministro","Selección abreviada","Subasta inversa ","SUMINISTRO DE BIENES E INSUMOS PARA EL DESARROLLO DE ACCIONES DE ARBORIZACIÓN Y AGRICULTURA URBANA EN LA LOCALIDAD DE FONTIBÓN","Inversión","Un nuevo Contrato Social y ambiental para la Bogotá del Siglo XXI",24,{"$f":"IF(ISERROR(VLOOKUP(K334,[2]Proposito_programa!$C$2:$E$59,2,FALSE)),\" \",VLOOKUP(K334,[2]Proposito_programa!$C$2:$E$59,2,FALSE))","v":"Bogotá región emprendedora e innovadora"},{"$f":"IF(ISERROR(VLOOKUP(K334,[2]Proposito_programa!$C$2:$E$59,3,FALSE)),\" \",VLOOKUP(K334,[2]Proposito_programa!$C$2:$E$59,3,FALSE))","v":"Propósito 1: Hacer un nuevo contrato social para incrementar la inclusión social, productiva y política"},1759,4," 901.550.670","UT SB/PADYF INSUMOS FONTIBON","Persona Jurídica","-","-",null,56792056,null,0,0,56792056," $                          -  ","2021-12-30","2022-01-14","2022-08-13","213 DÍAS",0,0,null,null,null,null,null,"X",null,null,0]
[321,2021,"FDLF-SASI-038-2021","https://community.secop.gov.co/Public/Tendering/OpportunityDetail/Index?noticeUID=CO1.NTC.2435024&isFromPublicArea=True&isModal=true&asPopupView=true","Suministro","Selección abreviada","Subasta inversa ","SUMINISTRO DE BIENES E INSUMOS PARA EL DESARROLLO DE ACCIONES DE ARBORIZACIÓN Y AGRICULTURA URBANA EN LA LOCALIDAD DE FONTIBÓN","Inversión","Un nuevo Contrato Social y ambiental para la Bogotá del Siglo XXI",33,{"$f":"IF(ISERROR(VLOOKUP(K335,[2]Proposito_programa!$C$2:$E$59,2,FALSE)),\" \",VLOOKUP(K335,[2]Proposito_programa!$C$2:$E$59,2,FALSE))","v":"Más árboles y más y mejor espacio público"},{"$f":"IF(ISERROR(VLOOKUP(K335,[2]Proposito_programa!$C$2:$E$59,3,FALSE)),\" \",VLOOKUP(K335,[2]Proposito_programa!$C$2:$E$59,3,FALSE))","v":"Propósito 2 : Cambiar Nuestros Hábitos de Vida para Reverdecer a Bogotá y Adaptarnos y Mitigar la Crisis Climática"},1769,4," 901.550.670","UT SB/PADYF INSUMOS FONTIBON","Persona Jurídica","-","-",null,139413201,null,null,null,139413201," $                          -  ","2021-12-30","2022-01-14","2022-08-13","213 DÍAS",0,0,null,null,null,null,null,"X",null,null,0]
[322,2021,"FDLF-SASI-038-2021","https://community.secop.gov.co/Public/Tendering/OpportunityDetail/Index?noticeUID=CO1.NTC.2435024&isFromPublicArea=True&isModal=true&asPopupView=true","Suministro","Selección abreviada","Subasta inversa ","SUMINISTRO DE BIENES E INSUMOS PARA EL DESARROLLO DE ACCIONES DE ARBORIZACIÓN Y AGRICULTURA URBANA EN LA LOCALIDAD DE FONTIBÓN","Inversión","Un nuevo Contrato Social y ambiental para la Bogotá del Siglo XXI",24,{"$f":"IF(ISERROR(VLOOKUP(K336,[2]Proposito_programa!$C$2:$E$59,2,FALSE)),\" \",VLOOKUP(K336,[2]Proposito_programa!$C$2:$E$59,2,FALSE))","v":"Bogotá región emprendedora e innovadora"},{"$f":"IF(ISERROR(VLOOKUP(K336,[2]Proposito_programa!$C$2:$E$59,3,FALSE)),\" \",VLOOKUP(K336,[2]Proposito_programa!$C$2:$E$59,3,FALSE))","v":"Propósito 1: Hacer un nuevo contrato social para incrementar la inclusión social, productiva y política"},1759,4," 901.550.670","UT SB/PADYF INSUMOS FONTIBON","Persona Jurídica","-","-",null,14195696,null,0,0,14195696," $                          -  ","2021-12-30","2022-01-14","2022-08-13","213 DÍAS",0,0,null,null,null,null,null,"X",null,null,0]
[323,2021,"FDLF-LP-010-2021","https://community.secop.gov.co/Public/Tendering/OpportunityDetail/Index?noticeUID=CO1.NTC.2413758&isFromPublicArea=True&isModal=true&asPopupView=true","Contratos de prestación de servicios","Licitación pública",null,"PRESTAR LOS SERVICIOS PARA PROMOVER EL FORTALECIMIENTO DEL SISTEMA DE RECICLAJE DE LA LOCALIDAD DE FONTIBÓN, INVOLUCRANDO LOS RECICLADORES DE OFICIO Y A LA CIUDADANÍA LOCAL, A TRAVÉS DE PROCESOS FORMATIVOS ENFOCADOS EN SEPARACIÓN EN LA FUENTE QUE FOMENTEN LA ECONOMÍA CIRCULAR, PROMOVIENDO EL DESARROLLO SOSTENIBLE","Inversión","Un nuevo Contrato Social y ambiental para la Bogotá del Siglo XXI",38,{"$f":"IF(ISERROR(VLOOKUP(K337,[2]Proposito_programa!$C$2:$E$59,2,FALSE)),\" \",VLOOKUP(K337,[2]Proposito_programa!$C$2:$E$59,2,FALSE))","v":"Ecoeficiencia, reciclaje, manejo de residuos e inclusión de la población recicladora"},{"$f":"IF(ISERROR(VLOOKUP(K337,[2]Proposito_programa!$C$2:$E$59,3,FALSE)),\" \",VLOOKUP(K337,[2]Proposito_programa!$C$2:$E$59,3,FALSE))","v":"Propósito 2 : Cambiar Nuestros Hábitos de Vida para Reverdecer a Bogotá y Adaptarnos y Mitigar la Crisis Climática"},1772,4,900374639,"SOLUCIONES INTEGRALES TM SAS","Persona Jurídica","-","-",null,300879297,null,0,0,300879297," $                          -  ","2021-12-27","2022-02-16","2022-08-15","182 DÍAS",0,0,null,null,null,null,null,"X",null,null,0]
[324,2021,"FDLF-SASI-039-2021","https://community.secop.gov.co/Public/Tendering/OpportunityDetail/Index?noticeUID=CO1.NTC.2438355&isFromPublicArea=True&isModal=true&asPopupView=true","Suministro","Selección abreviada","Subasta inversa ","ADQUIRIR ELEMENTOS Y EQUIPOS NECESARIOS PARA LA DOTACIÓN DE EQUIPAMIENTOS CULTURALES DE LA LOCALIDAD DE FONTIBÓN","Inversión","Un nuevo Contrato Social y ambiental para la Bogotá del Siglo XXI",21,{"$f":"IF(ISERROR(VLOOKUP(K338,[2]Proposito_programa!$C$2:$E$59,2,FALSE)),\" \",VLOOKUP(K338,[2]Proposito_programa!$C$2:$E$59,2,FALSE))","v":"Creación y vida cotidiana: Apropiación ciudadana del arte, la cultura y el patrimonio, para la democracia cultural"},{"$f":"IF(ISERROR(VLOOKUP(K338,[2]Proposito_programa!$C$2:$E$59,3,FALSE)),\" \",VLOOKUP(K338,[2]Proposito_programa!$C$2:$E$59,3,FALSE))","v":"Propósito 1: Hacer un nuevo contrato social para incrementar la inclusión social, productiva y política"},1758,6,901151389,"S&S SERVICIOS Y SUMINISTROS STELAR S.A.S","Persona Jurídica","-","-",null,180000000,null,0,0,180000000," $                          -  ","2021-12-30","2022-01-14","2022-06-13","152 DÍAS",0,0,null,null,null,null,null,"X",null,null,0]
[325,2021,"FDLF-SASI-039-2021","https://community.secop.gov.co/Public/Tendering/OpportunityDetail/Index?noticeUID=CO1.NTC.2438355&isFromPublicArea=True&isModal=true&asPopupView=true","Suministro","Selección abreviada","Subasta inversa ","ADQUIRIR ELEMENTOS Y EQUIPOS NECESARIOS PARA LA DOTACIÓN DE EQUIPAMIENTOS CULTURALES DE LA LOCALIDAD DE FONTIBÓN","Inversión","Un nuevo Contrato Social y ambiental para la Bogotá del Siglo XXI",21,{"$f":"IF(ISERROR(VLOOKUP(K339,[2]Proposito_programa!$C$2:$E$59,2,FALSE)),\" \",VLOOKUP(K339,[2]Proposito_programa!$C$2:$E$59,2,FALSE))","v":"Creación y vida cotidiana: Apropiación ciudadana del arte, la cultura y el patrimonio, para la democracia cultural"},{"$f":"IF(ISERROR(VLOOKUP(K339,[2]Proposito_programa!$C$2:$E$59,3,FALSE)),\" \",VLOOKUP(K339,[2]Proposito_programa!$C$2:$E$59,3,FALSE))","v":"Propósito 1: Hacer un nuevo contrato social para incrementar la inclusión social, productiva y política"},1758,6,830005066,"SECVIDEO","Persona Jurídica","-","-",null,220000000,null,0,0,220000000," $                          -  ","2021-12-30","2022-01-14","2022-06-13","152 DÍAS",0,0,null,null,null,null,null,"X",null,null,0]
[326,2021,"FDLF MC 052 2021","https://community.secop.gov.co/Public/Tendering/OpportunityDetail/Index?noticeUID=CO1.NTC.2456682&isFromPublicArea=True&isModal=true&asPopupView=true","Contratos de prestación de servicios","Contratación mínima cuantia",null,"REALIZAR EL MANTENIMIENTO PREVENTIVO Y CORRECTIVO CON BOLSA DE REPUESTOS PARA LA PLANTA ELÉCTRICA Y PARA LOS EQUIPOS QUE COMPONEN ELSISTEMA DE PRESIÓN DE AGUA POTABLE, LAVADO, DESINFECCIÓN E IMPERMEABILIZACIÓN TANQUES ELEVADOS Y SUBTERRÁNEO DEL EDIFICIO DE LA ALCALDÍA LOCAL DE FONTIBON","Funcionamiento","Un nuevo Contrato Social y ambiental para la Bogotá del Siglo XXI","No aplica",{"$f":"IF(ISERROR(VLOOKUP(K340,[2]Proposito_programa!$C$2:$E$59,2,FALSE)),\" \",VLOOKUP(K340,[2]Proposito_programa!$C$2:$E$59,2,FALSE))","v":" "},{"$f":"IF(ISERROR(VLOOKUP(K340,[2]Proposito_programa!$C$2:$E$59,3,FALSE)),\" \",VLOOKUP(K340,[2]Proposito_programa!$C$2:$E$59,3,FALSE))","v":" "},605,4,830509631,"TECNIELECTRICOS S.A.S","Persona Jurídica","-","-",null,23900000,null,0,0,23900000," $                          -  ","2021-12-28","2022-01-18","2022-01-17","365 DÍAS",0,0,null,null,null,null,null,"X",null,null,0]
[327,2021,"FDLF SASI 042 2021","https://community.secop.gov.co/Public/Tendering/OpportunityDetail/Index?noticeUID=CO1.NTC.2443401&isFromPublicArea=True&isModal=true&asPopupView=true","Compraventa de bienes muebles","Selección abreviada","Subasta inversa ","ADQUIRIR EL MOBILIARIO DE LAS AULAS MODULARES, HERRAMIENTAS PEDAGÓGICAS Y TECNOLÓGICAS PARA LA IMPLEMENTACIÓN DE LOS PROYECTOS DE PRIMERA INFANCIA EN LAS INSTITUCIONES EDUCATIVAS DISTRITALES EN LA LOCALIDAD DE FONTIBÓN","Inversión","Un nuevo Contrato Social y ambiental para la Bogotá del Siglo XXI",12,{"$f":"IF(ISERROR(VLOOKUP(K341,[2]Proposito_programa!$C$2:$E$59,2,FALSE)),\" \",VLOOKUP(K341,[2]Proposito_programa!$C$2:$E$59,2,FALSE))","v":"Educación inicial: Bases sólidas para la vida."},{"$f":"IF(ISERROR(VLOOKUP(K341,[2]Proposito_programa!$C$2:$E$59,3,FALSE)),\" \",VLOOKUP(K341,[2]Proposito_programa!$C$2:$E$59,3,FALSE))","v":"Propósito 1: Hacer un nuevo contrato social para incrementar la inclusión social, productiva y política"},1753,6,901011888,"COLCONDI SAS","Persona Jurídica","-","-",null,418136698,null,0,0,418136698," $                          -  ","2021-12-29","2022-02-10","2022-07-09","152 DÍAS",0,0,null,null,null,null,null,"X",null,null,0]
[328,2021,"FDLF SASI 042 2021","https://community.secop.gov.co/Public/Tendering/OpportunityDetail/Index?noticeUID=CO1.NTC.2443401&isFromPublicArea=True&isModal=true&asPopupView=true","Compraventa de bienes muebles","Selección abreviada","Subasta inversa ","ADQUIRIR EL MOBILIARIO DE LAS AULAS MODULARES, HERRAMIENTAS PEDAGÓGICAS Y TECNOLÓGICAS PARA LA IMPLEMENTACIÓN DE LOS PROYECTOS DE PRIMERA INFANCIA EN LAS INSTITUCIONES EDUCATIVAS DISTRITALES EN LA LOCALIDAD DE FONTIBÓN.","Inversión","Un nuevo Contrato Social y ambiental para la Bogotá del Siglo XXI",12,{"$f":"IF(ISERROR(VLOOKUP(K342,[2]Proposito_programa!$C$2:$E$59,2,FALSE)),\" \",VLOOKUP(K342,[2]Proposito_programa!$C$2:$E$59,2,FALSE))","v":"Educación inicial: Bases sólidas para la vida."},{"$f":"IF(ISERROR(VLOOKUP(K342,[2]Proposito_programa!$C$2:$E$59,3,FALSE)),\" \",VLOOKUP(K342,[2]Proposito_programa!$C$2:$E$59,3,FALSE))","v":"Propósito 1: Hacer un nuevo contrato social para incrementar la inclusión social, productiva y política"},1753,6," 900.171.311","TECHNOLOGY WORLD GROUP SAS","Persona Jurídica","-","-",null,373285705,null,0,0,373285705," $                          -  ","2021-12-29","2022-02-10","2022-07-09","152 DÍAS",0,0,null,null,null,null,null,"X",null,null,0]
[329,2021,"FDLF-SASI-036-2021","https://community.secop.gov.co/Public/Tendering/OpportunityDetail/Index?noticeUID=CO1.NTC.2429900&isFromPublicArea=True&isModal=true&asPopupView=true","Suministro","Selección abreviada","Subasta inversa ","SUMINISTRO DE ELEMENTOS Y ÚTILES DE OFICINA, PARA LAS DIFERENTES DEPENDENCIAS DE LA ALCALDÍA LOCAL DE FONTIBÓN Y LA JUNTA ADMINISTRADORA LOCAL","Funcionamiento","Un nuevo Contrato Social y ambiental para la Bogotá del Siglo XXI","No aplica",{"$f":"IF(ISERROR(VLOOKUP(K343,[2]Proposito_programa!$C$2:$E$59,2,FALSE)),\" \",VLOOKUP(K343,[2]Proposito_programa!$C$2:$E$59,2,FALSE))","v":" "},{"$f":"IF(ISERROR(VLOOKUP(K343,[2]Proposito_programa!$C$2:$E$59,3,FALSE)),\" \",VLOOKUP(K343,[2]Proposito_programa!$C$2:$E$59,3,FALSE))","v":" "},108,9,900916649,"C I WARRIORS COMPANY SAS","Persona Jurídica","-","-",null,111021,null,0,0,111021," $                          -  ","2021-12-28","2021-12-30","2022-12-31","365 DÍAS",0,0,null,null,null,null,null,"X",null,null,0]
[329,2021,"FDLF-SASI-036-2021","https://community.secop.gov.co/Public/Tendering/OpportunityDetail/Index?noticeUID=CO1.NTC.2429900&isFromPublicArea=True&isModal=true&asPopupView=true","Suministro","Selección abreviada","Subasta inversa ","SUMINISTRO DE ELEMENTOS Y ÚTILES DE OFICINA, PARA LAS DIFERENTES DEPENDENCIAS DE LA ALCALDÍA LOCAL DE FONTIBÓN Y LA JUNTA ADMINISTRADORA LOCAL","Funcionamiento","Un nuevo Contrato Social y ambiental para la Bogotá del Siglo XXI","No aplica",{"$f":"IF(ISERROR(VLOOKUP(K344,[2]Proposito_programa!$C$2:$E$59,2,FALSE)),\" \",VLOOKUP(K344,[2]Proposito_programa!$C$2:$E$59,2,FALSE))","v":" "},{"$f":"IF(ISERROR(VLOOKUP(K344,[2]Proposito_programa!$C$2:$E$59,3,FALSE)),\" \",VLOOKUP(K344,[2]Proposito_programa!$C$2:$E$59,3,FALSE))","v":" "},105,9,900916649,"C I WARRIORS COMPANY SAS","Persona Jurídica",null,null,null,7265199,null,0,0,7265199," $                          -  ","2021-12-28","2021-12-30","2022-12-31","365 DÍAS",0,0,null,null,null,null,null,"X",null,null,0]
[329,2021,"FDLF-SASI-036-2021","https://community.secop.gov.co/Public/Tendering/OpportunityDetail/Index?noticeUID=CO1.NTC.2429900&isFromPublicArea=True&isModal=true&asPopupView=true","Suministro","Selección abreviada","Subasta inversa ","SUMINISTRO DE ELEMENTOS Y ÚTILES DE OFICINA, PARA LAS DIFERENTES DEPENDENCIAS DE LA ALCALDÍA LOCAL DE FONTIBÓN Y LA JUNTA ADMINISTRADORA LOCAL","Funcionamiento","Un nuevo Contrato Social y ambiental para la Bogotá del Siglo XXI","No aplica",{"$f":"IF(ISERROR(VLOOKUP(K345,[2]Proposito_programa!$C$2:$E$59,2,FALSE)),\" \",VLOOKUP(K345,[2]Proposito_programa!$C$2:$E$59,2,FALSE))","v":" "},{"$f":"IF(ISERROR(VLOOKUP(K345,[2]Proposito_programa!$C$2:$E$59,3,FALSE)),\" \",VLOOKUP(K345,[2]Proposito_programa!$C$2:$E$59,3,FALSE))","v":" "},301,9,900916649,"C I WARRIORS COMPANY SAS","Persona Jurídica",null,null,null,13322493,null,0,0,13322493," $                          -  ","2021-12-28","2021-12-30","2022-12-31","365 DÍAS",0,0,null,null,null,null,null,"X",null,null,0]
[329,2021,"FDLF-SASI-036-2021","https://community.secop.gov.co/Public/Tendering/OpportunityDetail/Index?noticeUID=CO1.NTC.2429900&isFromPublicArea=True&isModal=true&asPopupView=true","Suministro","Selección abreviada","Subasta inversa ","SUMINISTRO DE ELEMENTOS Y ÚTILES DE OFICINA, PARA LAS DIFERENTES DEPENDENCIAS DE LA ALCALDÍA LOCAL DE FONTIBÓN Y LA JUNTA ADMINISTRADORA LOCAL","Funcionamiento","Un nuevo Contrato Social y ambiental para la Bogotá del Siglo XXI","No aplica",{"$f":"IF(ISERROR(VLOOKUP(K346,[2]Proposito_programa!$C$2:$E$59,2,FALSE)),\" \",VLOOKUP(K346,[2]Proposito_programa!$C$2:$E$59,2,FALSE))","v":" "},{"$f":"IF(ISERROR(VLOOKUP(K346,[2]Proposito_programa!$C$2:$E$59,3,FALSE)),\" \",VLOOKUP(K346,[2]Proposito_programa!$C$2:$E$59,3,FALSE))","v":" "},208,9,900916649,"C I WARRIORS COMPANY SAS","Persona Jurídica",null,null,null,19735941,null,0,0,19735941," $                          -  ","2021-12-28","2021-12-30","2022-12-31","365 DÍAS",0,0,null,null,null,null,null,"X",null,null,0]
[329,2021,"FDLF-SASI-036-2021","https://community.secop.gov.co/Public/Tendering/OpportunityDetail/Index?noticeUID=CO1.NTC.2429900&isFromPublicArea=True&isModal=true&asPopupView=true","Suministro","Selección abreviada","Subasta inversa ","SUMINISTRO DE ELEMENTOS Y ÚTILES DE OFICINA, PARA LAS DIFERENTES DEPENDENCIAS DE LA ALCALDÍA LOCAL DE FONTIBÓN Y LA JUNTA ADMINISTRADORA LOCAL","Funcionamiento","Un nuevo Contrato Social y ambiental para la Bogotá del Siglo XXI","No aplica",{"$f":"IF(ISERROR(VLOOKUP(K347,[2]Proposito_programa!$C$2:$E$59,2,FALSE)),\" \",VLOOKUP(K347,[2]Proposito_programa!$C$2:$E$59,2,FALSE))","v":" "},{"$f":"IF(ISERROR(VLOOKUP(K347,[2]Proposito_programa!$C$2:$E$59,3,FALSE)),\" \",VLOOKUP(K347,[2]Proposito_programa!$C$2:$E$59,3,FALSE))","v":" "},205,9,900916649,"C I WARRIORS COMPANY SAS","Persona Jurídica",null,null,null,8357346,null,0,0,8357346," $                          -  ","2021-12-28","2021-12-30","2022-12-31","365 DÍAS",0,0,null,null,null,null,null,"X",null,null,0]
[329,2021,"FDLF-SASI-036-2021","https://community.secop.gov.co/Public/Tendering/OpportunityDetail/Index?noticeUID=CO1.NTC.2429900&isFromPublicArea=True&isModal=true&asPopupView=true","Suministro","Selección abreviada","Subasta inversa ","SUMINISTRO DE ELEMENTOS Y ÚTILES DE OFICINA, PARA LAS DIFERENTES DEPENDENCIAS DE LA ALCALDÍA LOCAL DE FONTIBÓN Y LA JUNTA ADMINISTRADORA LOCAL","Funcionamiento","Un nuevo Contrato Social y ambiental para la Bogotá del Siglo XXI","No aplica",{"$f":"IF(ISERROR(VLOOKUP(K348,[2]Proposito_programa!$C$2:$E$59,2,FALSE)),\" \",VLOOKUP(K348,[2]Proposito_programa!$C$2:$E$59,2,FALSE))","v":" "},{"$f":"IF(ISERROR(VLOOKUP(K348,[2]Proposito_programa!$C$2:$E$59,3,FALSE)),\" \",VLOOKUP(K348,[2]Proposito_programa!$C$2:$E$59,3,FALSE))","v":" "},206,9,900916649,"C I WARRIORS COMPANY SAS","Persona Jurídica",null,null,null,6558514,null,0,0,6558514," $                          -  ","2021-12-28","2021-12-30","2022-12-31","365 DÍAS",0,0,null,null,null,null,null,"X",null,null,0]
[329,2021,"FDLF-SASI-036-2021","https://community.secop.gov.co/Public/Tendering/OpportunityDetail/Index?noticeUID=CO1.NTC.2429900&isFromPublicArea=True&isModal=true&asPopupView=true","Suministro","Selección abreviada","Subasta inversa ","SUMINISTRO DE ELEMENTOS Y ÚTILES DE OFICINA, PARA LAS DIFERENTES DEPENDENCIAS DE LA ALCALDÍA LOCAL DE FONTIBÓN Y LA JUNTA ADMINISTRADORA LOCAL","Funcionamiento","Un nuevo Contrato Social y ambiental para la Bogotá del Siglo XXI","No aplica",{"$f":"IF(ISERROR(VLOOKUP(K349,[2]Proposito_programa!$C$2:$E$59,2,FALSE)),\" \",VLOOKUP(K349,[2]Proposito_programa!$C$2:$E$59,2,FALSE))","v":" "},{"$f":"IF(ISERROR(VLOOKUP(K349,[2]Proposito_programa!$C$2:$E$59,3,FALSE)),\" \",VLOOKUP(K349,[2]Proposito_programa!$C$2:$E$59,3,FALSE))","v":" "},302,9,900916649,"C I WARRIORS COMPANY SAS","Persona Jurídica",null,null,null,2898531,null,0,0,2898531," $                          -  ","2021-12-28","2021-12-30","2022-12-31","365 DÍAS",0,0,null,null,null,null,null,"X",null,null,0]
[330,2021,"FDLF-SAMC-044-2021","https://community.secop.gov.co/Public/Tendering/OpportunityDetail/Index?noticeUID=CO1.NTC.2456681&isFromPublicArea=True&isModal=true&asPopupView=true","Contratos de prestación de servicios","Selección abreviada","Selección abreviada por menor cuantía ","PRESTAR LOS SERVICIOS PARA ADECUACIONES Y EMBELLECIMIENTO POR MEDIO DE LA INSTALACIÓN DE 360 M2 DE JARDINES VERTICALES MEDIANTE LA VINCULACIÓN DE INSTITUCIONES EDUCATIVAS Y JUNTAS DE ACCIÓN COMUNAL PARA INCENTIVAR PRÁCTICAS ECO URBANÍSTICAS, QUE MITIGUEN LOS IMPACTOS ASOCIADOS A LA CONTAMINACIÓN DEL AIRE Y MEJORE LA ADAPTACIÓN AL CAMBIO CLIMÁTICO","Inversión","Un nuevo Contrato Social y ambiental para la Bogotá del Siglo XXI",27,{"$f":"IF(ISERROR(VLOOKUP(K350,[2]Proposito_programa!$C$2:$E$59,2,FALSE)),\" \",VLOOKUP(K350,[2]Proposito_programa!$C$2:$E$59,2,FALSE))","v":"Cambio cultural para la gestión de la crisis climática"},{"$f":"IF(ISERROR(VLOOKUP(K350,[2]Proposito_programa!$C$2:$E$59,3,FALSE)),\" \",VLOOKUP(K350,[2]Proposito_programa!$C$2:$E$59,3,FALSE))","v":"Propósito 2 : Cambiar Nuestros Hábitos de Vida para Reverdecer a Bogotá y Adaptarnos y Mitigar la Crisis Climática"},1766,2,900361,"CONSORCIO INTERVENCION URBANA","Consorcio","-","-",null,194649376,null,0,0,194649376," $                          -  ","2021-12-28","2021-12-01","2022-04-30","122 DÍAS",0,0,null,null,null,null,null,"X",null,null,0]
[332,2021,"FDLF-SAMC-034-2021","https://community.secop.gov.co/Public/Tendering/OpportunityDetail/Index?noticeUID=CO1.NTC.2441723&isFromPublicArea=True&isModal=true&asPopupView=true","Contratos de prestación de servicios","Selección abreviada","Selección abreviada por menor cuantía ","PRESTACIÓN DE LOS SERVICIOS COMO OPERADOR LOGÍSTICO PARA APOYAR LA ORGANIZACIÓN, PRODUCCIÓN Y EJECUCIÓN DE EVENTOS Y ACTIVIDADES QUE DESARROLLE LA ALCALDÍA LOCAL DE FONTIBON EN EL TERRITORIO","Funcionamiento","Un nuevo Contrato Social y ambiental para la Bogotá del Siglo XXI","No aplica",{"$f":"IF(ISERROR(VLOOKUP(K351,[2]Proposito_programa!$C$2:$E$59,2,FALSE)),\" \",VLOOKUP(K351,[2]Proposito_programa!$C$2:$E$59,2,FALSE))","v":" "},{"$f":"IF(ISERROR(VLOOKUP(K351,[2]Proposito_programa!$C$2:$E$59,3,FALSE)),\" \",VLOOKUP(K351,[2]Proposito_programa!$C$2:$E$59,3,FALSE))","v":" "},506,4,79867234,"CARLOS ALBERTO PINZON MOLINA","Persona Natural","-","-",null,84807611,null,0,0,84807611," $                          -  ","2021-12-29","2022-01-05","2022-07-04","182 DÍAS",0,0,null,null,null,null,null,"X",null,null,0]
[333,2021,"FDLF-SAMC-037-2021","https://community.secop.gov.co/Public/Tendering/OpportunityDetail/Index?noticeUID=CO1.NTC.2445901&isFromPublicArea=True&isModal=true&asPopupView=true","Contratos de prestación de servicios","Selección abreviada","Selección abreviada por menor cuantía ","DISEÑO Y PRODUCCIÓN DE LAS PIEZAS COMUNICATIVAS REQUERIDAS POR LA ALCALDÍA LOC A L DE FONTIBÓN, PARA LA DIVULGACIÓN DE LAS POLÍTICAS, PLANES, PROGRAMAS, LOGROS, ACCIONES, CAMPAÑAS Y/O ESTRATEGIAS ADELANTADAS EN EL DESARROLLO DE SU GESTIÓN PÚBLICA","Funcionamiento","Un nuevo Contrato Social y ambiental para la Bogotá del Siglo XXI","No aplica",{"$f":"IF(ISERROR(VLOOKUP(K352,[2]Proposito_programa!$C$2:$E$59,2,FALSE)),\" \",VLOOKUP(K352,[2]Proposito_programa!$C$2:$E$59,2,FALSE))","v":" "},{"$f":"IF(ISERROR(VLOOKUP(K352,[2]Proposito_programa!$C$2:$E$59,3,FALSE)),\" \",VLOOKUP(K352,[2]Proposito_programa!$C$2:$E$59,3,FALSE))","v":" "},310,1,900879034,"INVERSIONES AYL SAS","Persona Jurídica","-","-",null,49984225,null,0,0,49984225," $                          -  ","2021-12-29","2022-01-21","2022-07-20","182 DÍAS",0,0,null,null,null,null,null,"X",null,null,0]
[334,2021,"FDLF-SAMC-045-2021","https://community.secop.gov.co/Public/Tendering/OpportunityDetail/Index?noticeUID=CO1.NTC.2459020&isFromPublicArea=True&isModal=true&asPopupView=true","Contratos de prestación de servicios","Selección abreviada","Selección abreviada por menor cuantía ","DISEÑAR E IMPLEMENTAR ESTRATEGIAS PARA LA DOTACIÓN Y ACCIONES DE POSICIONAMIENTO PARA LAS INSTANCIAS DE PARTICIPACIÓN QUE FUNCIONEN EN LOCALIDAD DE FONTIBON","Inversión","Un nuevo Contrato Social y ambiental para la Bogotá del Siglo XXI",55,{"$f":"IF(ISERROR(VLOOKUP(K353,[2]Proposito_programa!$C$2:$E$59,2,FALSE)),\" \",VLOOKUP(K353,[2]Proposito_programa!$C$2:$E$59,2,FALSE))","v":"Fortalecimiento de cultura ciudadana y su institucionalidad"},{"$f":"IF(ISERROR(VLOOKUP(K353,[2]Proposito_programa!$C$2:$E$59,3,FALSE)),\" \",VLOOKUP(K353,[2]Proposito_programa!$C$2:$E$59,3,FALSE))","v":"Propósito 5: Construir Bogotá - Región con gobierno abierto, transparente y ciudadanía consciente"},1782,8," 80.222.117","MIGUEL ANGEL VALLEJO BURGOS","Persona Natural","-","-",null,252104600,null,0,0,252104600," $                          -  ","2021-12-30","2022-02-07","2022-07-06","152 DÍAS",0,0,null,null,null,null,null,"X",null,null,0]
[335,2021,"FDLF-MC-059-2021","https://community.secop.gov.co/Public/Tendering/OpportunityDetail/Index?noticeUID=CO1.NTC.2474213&isFromPublicArea=True&isModal=true&asPopupView=true","Compraventa de bienes muebles","Contratación mínima cuantia",null,"ADQUISICION DE ELEMENTOS DE APOYO LOGISTICO PARA EL FORTALECIMIENTO DE LA MESA DE PARTICIPACIÓN EFECTIVA DE VÍCTIMAS DEL CONFLICTO ARMADO DE FONTIBÓN EN EL MARCO DEL PROYECTO 1773- UN NUEVO CONTRATO PARA CONSTRUIR PAZ Y RECONCILIACIÓN EN FONTIBÓN","Inversión","Un nuevo Contrato Social y ambiental para la Bogotá del Siglo XXI",39,{"$f":"IF(ISERROR(VLOOKUP(K354,[2]Proposito_programa!$C$2:$E$59,2,FALSE)),\" \",VLOOKUP(K354,[2]Proposito_programa!$C$2:$E$59,2,FALSE))","v":"Bogotá territorio de paz y atención integral a las víctimas del conflicto armado"},{"$f":"IF(ISERROR(VLOOKUP(K354,[2]Proposito_programa!$C$2:$E$59,3,FALSE)),\" \",VLOOKUP(K354,[2]Proposito_programa!$C$2:$E$59,3,FALSE))","v":"Propósito 3: Inspirar confianza y legitimidad para vivir sin miedo y ser epicentro de cultura ciudadana, paz y reconciliación"},1773,5,901281435,"EVENTOS Y PRODUCCIONES SALOMON SAS","Persona Jurídica","-","-",null,25438728,null,0,0,25438728," $                          -  ","2021-12-31","2022-01-14","2022-04-13","90 DÍAS",0,0,null,null,null,null,null,"X",null,null,0]
[336,2021,"FDLF-MC-058-2021","https://community.secop.gov.co/Public/Tendering/OpportunityDetail/Index?noticeUID=CO1.NTC.2473982&isFromPublicArea=True&isModal=true&asPopupView=true","Compraventa de bienes muebles","Contratación mínima cuantia",null,"ADQUISICIÓN DE DISTINTIVOS PARA LA IDENTIFICACIÓN Y FORTALECIMIENTO DE LAS INSTANCIAS DE PARTICIPACIÓN DE LA ALCALDÍA LOCAL DE FONTIBÓN EN EL MARCO DE LA EJECUCIÓN DEL PROYECTO No. 1782 \"UN NUEVO CONTRATO PARA LA PARTICIPACIÓN CIUDADANA EN FONTIBÓN","Inversión","Un nuevo Contrato Social y ambiental para la Bogotá del Siglo XXI",55,{"$f":"IF(ISERROR(VLOOKUP(K355,[2]Proposito_programa!$C$2:$E$59,2,FALSE)),\" \",VLOOKUP(K355,[2]Proposito_programa!$C$2:$E$59,2,FALSE))","v":"Fortalecimiento de cultura ciudadana y su institucionalidad"},{"$f":"IF(ISERROR(VLOOKUP(K355,[2]Proposito_programa!$C$2:$E$59,3,FALSE)),\" \",VLOOKUP(K355,[2]Proposito_programa!$C$2:$E$59,3,FALSE))","v":"Propósito 5: Construir Bogotá - Región con gobierno abierto, transparente y ciudadanía consciente"},1782,5,900975944,"FEC S&S SAS","Persona Jurídica","-","-",null,25438728,null,0,0,25438728," $                          -  ","2021-12-31","2022-01-14","2022-03-13","60 DÍAS",0,0,null,null,null,null,null,"X",null,null,0]
[337,2021,"FDLF-CPS-337-2021","https://community.secop.gov.co/Public/Tendering/OpportunityDetail/Index?noticeUID=CO1.NTC.2483352&isFromPublicArea=True&isModal=true&asPopupView=true","Contratos de prestación de servicios profesionales y de apoyo a la gestión","Contratación directa","Prestación de servicios profesionales y de apoyo a la gestión, o para la ejecución de trabajos artísticos que sólo puedan encomendarse a determinadas personas naturales;","PRESTAR SERVICIOS DE APOYO PARA REALIZAR LAS LABORES DE PLANTACIÓN, RIEGO, PODA, BLOQUEO, TRASPLANTE, LIMPIEZA Y DEMÁS ACTIVIDADES QUE LE SEAN ASIGNADAS EN EL MARCO DEL PROYECTO 1766 REVERDECER LA LOCALIDAD DE FONTIBÓN","Inversión","Un nuevo Contrato Social y ambiental para la Bogotá del Siglo XXI",27,{"$f":"IF(ISERROR(VLOOKUP(K356,[2]Proposito_programa!$C$2:$E$59,2,FALSE)),\" \",VLOOKUP(K356,[2]Proposito_programa!$C$2:$E$59,2,FALSE))","v":"Cambio cultural para la gestión de la crisis climática"},{"$f":"IF(ISERROR(VLOOKUP(K356,[2]Proposito_programa!$C$2:$E$59,3,FALSE)),\" \",VLOOKUP(K356,[2]Proposito_programa!$C$2:$E$59,3,FALSE))","v":"Propósito 2 : Cambiar Nuestros Hábitos de Vida para Reverdecer a Bogotá y Adaptarnos y Mitigar la Crisis Climática"},1766,1,1000161282,"ASHLEY KATHERINE MEDINA","Persona Natural","-","-",null,4666667,null,0,0,4666667," $                          -  ","2021-12-31","2022-02-02","2022-05-12","100 DÍAS",0,0,1065830265,"Shirlec Karelly Luquetta Ramos ","2022-02-02",null,null,"X",null,null,0]
[338,2021,"FDLF-CD-338-2021","https://community.secop.gov.co/Public/Tendering/OpportunityDetail/Index?noticeUID=CO1.NTC.2483506&isFromPublicArea=True&isModal=true&asPopupView=true","Contratos de prestación de servicios profesionales y de apoyo a la gestión","Contratación directa","Prestación de servicios profesionales y de apoyo a la gestión, o para la ejecución de trabajos artísticos que sólo puedan encomendarse a determinadas personas naturales;","PRESTAR SERVICIOS DE APOYO PARA REALIZAR LAS LABORES DE PLANTACIÓN, RIEGO, PODA, BLOQUEO, TRASPLANTE, LIMPIEZA Y DEMÁS ACTIVIDADES QUE LE SEAN ASIGNADAS EN EL MARCO DEL PROYECTO 1766 REVERDECER LA LOCALIDAD DE FONTIBÓN.","Inversión","Un nuevo Contrato Social y ambiental para la Bogotá del Siglo XXI",27,{"$f":"IF(ISERROR(VLOOKUP(K357,[2]Proposito_programa!$C$2:$E$59,2,FALSE)),\" \",VLOOKUP(K357,[2]Proposito_programa!$C$2:$E$59,2,FALSE))","v":"Cambio cultural para la gestión de la crisis climática"},{"$f":"IF(ISERROR(VLOOKUP(K357,[2]Proposito_programa!$C$2:$E$59,3,FALSE)),\" \",VLOOKUP(K357,[2]Proposito_programa!$C$2:$E$59,3,FALSE))","v":"Propósito 2 : Cambiar Nuestros Hábitos de Vida para Reverdecer a Bogotá y Adaptarnos y Mitigar la Crisis Climática"},1766,1," 1.023.948.533","CINDY VANESSA AREVALO CASTAÑEDA","Persona Natural","-","-",null,4666667,null,0,0,4666667," $                          -  ","2021-12-31","2022-02-16","2022-05-27","100 DÍAS",0,0,null,null,null,null,null,"X",null,null,0]
[339,2021,"FDLF-CD-339-2021","https://community.secop.gov.co/Public/Tendering/OpportunityDetail/Index?noticeUID=CO1.NTC.2483504&isFromPublicArea=True&isModal=true&asPopupView=true","Contratos de prestación de servicios profesionales y de apoyo a la gestión","Contratación directa","Prestación de servicios profesionales y de apoyo a la gestión, o para la ejecución de trabajos artísticos que sólo puedan encomendarse a determinadas personas naturales;","Prestar servicios profesionales para la ejecucion de las capacitaciones, el diagnostico, la elaboracion de metodologias pedagogicas y demas actividades que contribuyan al fomento de la agricultura urbana en la localidad de Fontibon.","Inversión","Un nuevo Contrato Social y ambiental para la Bogotá del Siglo XXI",24,{"$f":"IF(ISERROR(VLOOKUP(K358,[2]Proposito_programa!$C$2:$E$59,2,FALSE)),\" \",VLOOKUP(K358,[2]Proposito_programa!$C$2:$E$59,2,FALSE))","v":"Bogotá región emprendedora e innovadora"},{"$f":"IF(ISERROR(VLOOKUP(K358,[2]Proposito_programa!$C$2:$E$59,3,FALSE)),\" \",VLOOKUP(K358,[2]Proposito_programa!$C$2:$E$59,3,FALSE))","v":"Propósito 1: Hacer un nuevo contrato social para incrementar la inclusión social, productiva y política"},1759,1,1016023490,"GERARDO MARTINEZ VASQUEZ","Persona Natural","-","-",null,15466666,null,0,0,15466666," $                          -  ","2021-12-31","2021-01-05","2022-04-14","100 DÍAS",0,0,null,null,null,null,null,"X",null,null,0]
[340,2021,"FDLF-CD-340-2021","https://community.secop.gov.co/Public/Tendering/OpportunityDetail/Index?noticeUID=CO1.NTC.2483455&isFromPublicArea=True&isModal=true&asPopupView=true","Contratos de prestación de servicios profesionales y de apoyo a la gestión","Contratación directa","Prestación de servicios profesionales y de apoyo a la gestión, o para la ejecución de trabajos artísticos que sólo puedan encomendarse a determinadas personas naturales;","PRESTAR SERVICIOS PROFESIONALES PARA LA EJECUCION DE LAS CAPACITACIONES, EL DIAGNOSTICO, LA ELABORACION DE METODOLOGIAS PEDAGOGICAS Y DEMAS ACTIVIDADES QUE CONTRIBUYAN AL FOMENTO DE LA AGRICULTURA URBANA EN LA LOCALIDAD DE FONTIBON.","Inversión","Un nuevo Contrato Social y ambiental para la Bogotá del Siglo XXI",24,{"$f":"IF(ISERROR(VLOOKUP(K359,[2]Proposito_programa!$C$2:$E$59,2,FALSE)),\" \",VLOOKUP(K359,[2]Proposito_programa!$C$2:$E$59,2,FALSE))","v":"Bogotá región emprendedora e innovadora"},{"$f":"IF(ISERROR(VLOOKUP(K359,[2]Proposito_programa!$C$2:$E$59,3,FALSE)),\" \",VLOOKUP(K359,[2]Proposito_programa!$C$2:$E$59,3,FALSE))","v":"Propósito 1: Hacer un nuevo contrato social para incrementar la inclusión social, productiva y política"},1759,1," 80.800.815","DANIEL ALEJANDRO RODRIGUEZ CASTRILLON","Persona Natural","-","-",null,15466666,null,0,0,15466666," $                          -  ","2021-12-31","2021-01-05","2022-04-14","100 DÍAS",0,0,null,null,null,null,null,"X",null,null,0]
[341,2021,"FDLF MC 060 2021","https://community.secop.gov.co/Public/Tendering/OpportunityDetail/Index?noticeUID=CO1.NTC.2476749&isFromPublicArea=True&isModal=true&asPopupView=true","Contratos de prestación de servicios","Contratación mínima cuantia",null,"PRESTAR LOS SERVICIOS ARTÍSTICOS, PUBLICITARIOS Y LOGÍSTICOS PARA EL POSICIONAMIENTO Y PROMOCIÓN DEL BUEN TRATO EN LA LOCALIDAD DE FONTIBÓN","Inversión","Un nuevo Contrato Social y ambiental para la Bogotá del Siglo XXI",6,{"$f":"IF(ISERROR(VLOOKUP(K360,[2]Proposito_programa!$C$2:$E$59,2,FALSE)),\" \",VLOOKUP(K360,[2]Proposito_programa!$C$2:$E$59,2,FALSE))","v":"Sistema Distrital de Cuidado"},{"$f":"IF(ISERROR(VLOOKUP(K360,[2]Proposito_programa!$C$2:$E$59,3,FALSE)),\" \",VLOOKUP(K360,[2]Proposito_programa!$C$2:$E$59,3,FALSE))","v":"Propósito 1: Hacer un nuevo contrato social para incrementar la inclusión social, productiva y política"},1762,1,900843188,"Fundacion G3","Persona Natural","-","-",null,25438728,null,0,0,25438728," $                          -  ","2021-12-31","2022-02-16","2022-06-15","122 DÍAS",0,0,null,null,null,null,null,"X",null,null,0]
[342,2021,"FDLF MC 061 2021","https://community.secop.gov.co/Public/Tendering/OpportunityDetail/Index?noticeUID=CO1.NTC.2477069&isFromPublicArea=True&isModal=true&asPopupView=true","Contratos de prestación de servicios","Contratación mínima cuantia",null,"PRESTACIÓN DE SERVICIOS LOGÍSTICOS Y TÉCNICOS PARA EL DISEÑO Y LA REALIZACIÓN DE UN PRODUCTO DE MEMORIA CORTO-DOCUMENTAL SOBRE MUJERES VÍCTIMAS DE VIOLENCIAS BASADAS EN GÉNERO EN EL MARCO DEL CONFLICTO ARMADO QUE HAN LOGRADO CONSTRUIR PROYECTOS PRODUCTIVOS, PEDAGÓGICOS Y/O ARTÍSTICOS EN LA LOCALIDAD DE FONTIBÓN","Inversión","Un nuevo Contrato Social y ambiental para la Bogotá del Siglo XXI",39,{"$f":"IF(ISERROR(VLOOKUP(K361,[2]Proposito_programa!$C$2:$E$59,2,FALSE)),\" \",VLOOKUP(K361,[2]Proposito_programa!$C$2:$E$59,2,FALSE))","v":"Bogotá territorio de paz y atención integral a las víctimas del conflicto armado"},{"$f":"IF(ISERROR(VLOOKUP(K361,[2]Proposito_programa!$C$2:$E$59,3,FALSE)),\" \",VLOOKUP(K361,[2]Proposito_programa!$C$2:$E$59,3,FALSE))","v":"Propósito 3: Inspirar confianza y legitimidad para vivir sin miedo y ser epicentro de cultura ciudadana, paz y reconciliación"},1773,6,900020684,"GRUPO VECTOR SOCIEDAD POR ACCIONES SIMPLIFICADA","Persona Jurídica","-","-",null,18204393,null,0,0,18204393," $                          -  ","2021-12-31","2022-01-31","2022-04-30","90 DÍAS",0,0,null,null,null,null,null,"X",null,null,0]
[343,2021,"FDLF MC 064 2021","https://community.secop.gov.co/Public/Tendering/OpportunityDetail/Index?noticeUID=CO1.NTC.2479244&isFromPublicArea=True&isModal=true&asPopupView=true","Compraventa de bienes muebles","Contratación mínima cuantia",null,"CONTRATAR LA ADQUISICIÓN DE ELEMENTOS PARA LA REALIZACIÓN DE FERIAS EMPRESARIALES Y DE EMPRENDIMIENTO EN LA ALCALDÍA LOCAL DE FONTIBÓN","Inversión","Un nuevo Contrato Social y ambiental para la Bogotá del Siglo XXI",6,{"$f":"IF(ISERROR(VLOOKUP(K362,[2]Proposito_programa!$C$2:$E$59,2,FALSE)),\" \",VLOOKUP(K362,[2]Proposito_programa!$C$2:$E$59,2,FALSE))","v":"Sistema Distrital de Cuidado"},{"$f":"IF(ISERROR(VLOOKUP(K362,[2]Proposito_programa!$C$2:$E$59,3,FALSE)),\" \",VLOOKUP(K362,[2]Proposito_programa!$C$2:$E$59,3,FALSE))","v":"Propósito 1: Hacer un nuevo contrato social para incrementar la inclusión social, productiva y política"},1761,4,901263311,"SUMINISTROS Y ASESORIAS S&R S.A.S","Persona Natural","-","-",null,25438728,null,0,0,25438728," $                          -  ","2021-12-31","2022-01-27","2022-02-26","30 DIAS",0,0,null,null,null,null,null,"X",null,null,0]
[344,2021,"FDLF MC 065 2021","https://community.secop.gov.co/Public/Tendering/OpportunityDetail/Index?noticeUID=CO1.NTC.2479249&isFromPublicArea=True&isModal=true&asPopupView=true","Compraventa de bienes muebles","Contratación mínima cuantia",null,"ADQUISICIÓN DE CHAQUETAS INSTITUCIONALES PARA LA ALCALDÍA LOCAL DE FONTIBÓN","Inversión","Un nuevo Contrato Social y ambiental para la Bogotá del Siglo XXI",57,{"$f":"IF(ISERROR(VLOOKUP(K363,[2]Proposito_programa!$C$2:$E$59,2,FALSE)),\" \",VLOOKUP(K363,[2]Proposito_programa!$C$2:$E$59,2,FALSE))","v":"Gestión pública local"},{"$f":"IF(ISERROR(VLOOKUP(K363,[2]Proposito_programa!$C$2:$E$59,3,FALSE)),\" \",VLOOKUP(K363,[2]Proposito_programa!$C$2:$E$59,3,FALSE))","v":"Propósito 5: Construir Bogotá - Región con gobierno abierto, transparente y ciudadanía consciente"},1783,12,900990752,"PROYECTOS INSTITUCIONALES DE COLOMBIA SAS","Persona Jurídica","-","-",null,25438728,null,0,0,25438728," $                          -  ","2021-12-31","2022-01-26","2022-02-25","30 DIAS",0,0,null,null,null,null,null,"X",null,null,0]
[346,2021,"FDLF-SASI-043-2021","https://community.secop.gov.co/Public/Tendering/OpportunityDetail/Index?noticeUID=CO1.NTC.2446035&isFromPublicArea=True&isModal=true&asPopupView=true","Suministro","Selección abreviada","Subasta inversa ","SUMINISTRAR ELEMENTOS, EN EL MARCO DEL PROCESO DE ESCUELAS DE FORMACIÓN HYNTIBA PARA LA LOCALIDAD DE FONTIBÓN","Inversión","Un nuevo Contrato Social y ambiental para la Bogotá del Siglo XXI",40,{"$f":"IF(ISERROR(VLOOKUP(K364,[2]Proposito_programa!$C$2:$E$59,2,FALSE)),\" \",VLOOKUP(K364,[2]Proposito_programa!$C$2:$E$59,2,FALSE))","v":"Más mujeres viven una vida libre de violencias, se sienten seguras y acceden con confianza al sistema de justicia"},{"$f":"IF(ISERROR(VLOOKUP(K364,[2]Proposito_programa!$C$2:$E$59,3,FALSE)),\" \",VLOOKUP(K364,[2]Proposito_programa!$C$2:$E$59,3,FALSE))","v":"Propósito 3: Inspirar confianza y legitimidad para vivir sin miedo y ser epicentro de cultura ciudadana, paz y reconciliación"},1774,2,"901.555.177-5","UT SIGHOL 2021","Persona Natural","-",null,null,179448758,null,0,0,179448758," $                          -  ","2021-12-31","2022-02-04","2022-03-06","122 DÍAS",0,0,null,null,null,null,null,"X",null,null,0]
[346,2021,"FDLF-SASI-043-2021","https://community.secop.gov.co/Public/Tendering/OpportunityDetail/Index?noticeUID=CO1.NTC.2446035&isFromPublicArea=True&isModal=true&asPopupView=true","Suministro","Selección abreviada","Subasta inversa ","SUMINISTRAR ELEMENTOS, EN EL MARCO DEL PROCESO DE ESCUELAS DE FORMACIÓN HYNTIBA PARA LA LOCALIDAD DE FONTIBÓN","Inversión","Un nuevo Contrato Social y ambiental para la Bogotá del Siglo XXI",40,{"$f":"IF(ISERROR(VLOOKUP(K365,[2]Proposito_programa!$C$2:$E$59,2,FALSE)),\" \",VLOOKUP(K365,[2]Proposito_programa!$C$2:$E$59,2,FALSE))","v":"Más mujeres viven una vida libre de violencias, se sienten seguras y acceden con confianza al sistema de justicia"},{"$f":"IF(ISERROR(VLOOKUP(K365,[2]Proposito_programa!$C$2:$E$59,3,FALSE)),\" \",VLOOKUP(K365,[2]Proposito_programa!$C$2:$E$59,3,FALSE))","v":"Propósito 3: Inspirar confianza y legitimidad para vivir sin miedo y ser epicentro de cultura ciudadana, paz y reconciliación"},1775,2,"901.555.177-5","UT SIGHOL 2021","Persona Natural",null,null,null,143651750,null,null,null,143651750,null,"2021-12-31","2022-02-04","2022-03-06","122 DÍAS",0,0,null,null,null,null,null,"X",null,null,0]
[346,2021,"FDLF-SASI-043-2021","https://community.secop.gov.co/Public/Tendering/OpportunityDetail/Index?noticeUID=CO1.NTC.2446035&isFromPublicArea=True&isModal=true&asPopupView=true","Suministro","Selección abreviada","Subasta inversa ","SUMINISTRAR ELEMENTOS, EN EL MARCO DEL PROCESO DE ESCUELAS DE FORMACIÓN HYNTIBA PARA LA LOCALIDAD DE FONTIBÓN","Inversión","Un nuevo Contrato Social y ambiental para la Bogotá del Siglo XXI",40,{"$f":"IF(ISERROR(VLOOKUP(K366,[2]Proposito_programa!$C$2:$E$59,2,FALSE)),\" \",VLOOKUP(K366,[2]Proposito_programa!$C$2:$E$59,2,FALSE))","v":"Más mujeres viven una vida libre de violencias, se sienten seguras y acceden con confianza al sistema de justicia"},{"$f":"IF(ISERROR(VLOOKUP(K366,[2]Proposito_programa!$C$2:$E$59,3,FALSE)),\" \",VLOOKUP(K366,[2]Proposito_programa!$C$2:$E$59,3,FALSE))","v":"Propósito 3: Inspirar confianza y legitimidad para vivir sin miedo y ser epicentro de cultura ciudadana, paz y reconciliación"},2007,2,"901.555.177-5","UT SIGHOL 2021","Persona Natural",null,null,null,17742034,null,null,null,17742034,null,"2021-12-31","2022-02-04","2022-03-06","122 DÍAS",0,0,null,null,null,null,null,"X",null,null,0]
[346,2021,"FDLF-SASI-043-2021","https://community.secop.gov.co/Public/Tendering/OpportunityDetail/Index?noticeUID=CO1.NTC.2446035&isFromPublicArea=True&isModal=true&asPopupView=true","Suministro","Selección abreviada","Subasta inversa ","SUMINISTRAR ELEMENTOS, EN EL MARCO DEL PROCESO DE ESCUELAS DE FORMACIÓN HYNTIBA PARA LA LOCALIDAD DE FONTIBÓN","Inversión","Un nuevo Contrato Social y ambiental para la Bogotá del Siglo XXI",55,{"$f":"IF(ISERROR(VLOOKUP(K367,[2]Proposito_programa!$C$2:$E$59,2,FALSE)),\" \",VLOOKUP(K367,[2]Proposito_programa!$C$2:$E$59,2,FALSE))","v":"Fortalecimiento de cultura ciudadana y su institucionalidad"},{"$f":"IF(ISERROR(VLOOKUP(K367,[2]Proposito_programa!$C$2:$E$59,3,FALSE)),\" \",VLOOKUP(K367,[2]Proposito_programa!$C$2:$E$59,3,FALSE))","v":"Propósito 5: Construir Bogotá - Región con gobierno abierto, transparente y ciudadanía consciente"},1782,2,"901.555.177-5","UT SIGHOL 2021","Persona Natural",null,null,null,20206200,null,null,null,20206200,null,"2021-12-31","2022-02-04","2022-03-06","122 DÍAS",0,0,null,null,null,null,null,"X",null,null,0]
[347,2021,"FDLF-MIC-055-2021","https://community.secop.gov.co/Public/Tendering/OpportunityDetail/Index?noticeUID=CO1.NTC.2471332&isFromPublicArea=True&isModal=true&asPopupView=true","Compraventa de bienes muebles","Contratación mínima cuantia",null,"PRESTAR LOS SERVICIOS DE MANTENIMIENTO PREVENTIVO Y CORRECTIVO PARA LOS EQUIPOS DE CÓMPUTO, IMPRESORAS Y ESCÁNERES CON SUMINISTRO DE REPUESTOS A MONTO AGOTABLE, DE PROPIEDAD DEL FONDO DE DESARROLLO LOCAL DE FONTIBÓN\".","Funcionamiento","Un nuevo Contrato Social y ambiental para la Bogotá del Siglo XXI","No aplica",{"$f":"IF(ISERROR(VLOOKUP(K368,[2]Proposito_programa!$C$2:$E$59,2,FALSE)),\" \",VLOOKUP(K368,[2]Proposito_programa!$C$2:$E$59,2,FALSE))","v":" "},{"$f":"IF(ISERROR(VLOOKUP(K368,[2]Proposito_programa!$C$2:$E$59,3,FALSE)),\" \",VLOOKUP(K368,[2]Proposito_programa!$C$2:$E$59,3,FALSE))","v":" "},603,1,901158838,"DISTRIBUIDORA RED COMPUTO SAS","Persona Jurídica","-","-",null,20000000,null,0,0,20000000," $                          -  ","2021-12-31","2022-01-31","2022-07-31","182 DÍAS",0,0,null,null,null,null,null,"X",null,null,0]
[348,2021,"FDLF-MC-063-2021","https://community.secop.gov.co/Public/Tendering/OpportunityDetail/Index?noticeUID=CO1.NTC.2479558&isFromPublicArea=True&isModal=true&asPopupView=true","Compraventa de bienes muebles","Contratación mínima cuantia",null,"ADQUISICIÓN DE DOS (2) DESFIBRILADORES EXTERNOS AUTOMÁTICOS (DEA) PARA LA ALCALDÍA LOCAL DE FONTIBÓN","Inversión","Un nuevo Contrato Social y ambiental para la Bogotá del Siglo XXI",57,{"$f":"IF(ISERROR(VLOOKUP(K369,[2]Proposito_programa!$C$2:$E$59,2,FALSE)),\" \",VLOOKUP(K369,[2]Proposito_programa!$C$2:$E$59,2,FALSE))","v":"Gestión pública local"},{"$f":"IF(ISERROR(VLOOKUP(K369,[2]Proposito_programa!$C$2:$E$59,3,FALSE)),\" \",VLOOKUP(K369,[2]Proposito_programa!$C$2:$E$59,3,FALSE))","v":"Propósito 5: Construir Bogotá - Región con gobierno abierto, transparente y ciudadanía consciente"},1783,1,901263311,"SUMINISTROS Y ASESORIAS S&R S.A.S","Persona Jurídica","-","-",null,11197557,null,0,0,11197557," $                          -  ","2021-12-31","2022-02-04","2022-04-03","60 DÍAS",0,0,null,null,null,null,null,"X",null,null,0]
[349,2021,"FDLF-MC-062-2021","https://community.secop.gov.co/Public/Tendering/OpportunityDetail/Index?noticeUID=CO1.NTC.2479238&isFromPublicArea=True&isModal=true&asPopupView=true","Contratos de prestación de servicios","Contratación mínima cuantia",null,"DESARROLLAR ACCIONES DEL PROCESO DE FORMACIÓN A FORMADORES DIRIGIDO A LIDERES COMUNALES DE LA LOCALIDAD DE FONTIBON","Inversión","Un nuevo Contrato Social y ambiental para la Bogotá del Siglo XXI",55,{"$f":"IF(ISERROR(VLOOKUP(K370,[2]Proposito_programa!$C$2:$E$59,2,FALSE)),\" \",VLOOKUP(K370,[2]Proposito_programa!$C$2:$E$59,2,FALSE))","v":"Fortalecimiento de cultura ciudadana y su institucionalidad"},{"$f":"IF(ISERROR(VLOOKUP(K370,[2]Proposito_programa!$C$2:$E$59,3,FALSE)),\" \",VLOOKUP(K370,[2]Proposito_programa!$C$2:$E$59,3,FALSE))","v":"Propósito 5: Construir Bogotá - Región con gobierno abierto, transparente y ciudadanía consciente"},1782,2,800181439,"BONGA BUSTAMANTE SAS","Persona Jurídica","-","-",null,25250000,null,0,0,25250000," $                          -  ","2021-12-31","2022-02-10","2022-04-09","60 DÍAS",0,0,null,null,null,null,null,"X",null,null,0]
[23,2021,"FDLF-CI-023-2021","https://community.secop.gov.co/Public/Tendering/OpportunityDetail/Index?noticeUID=CO1.NTC.2388034&isFromPublicArea=True&isModal=true&asPopupView=true","Convenios de cooperacion","Contratación directa","Contratos interadministrativos","AUNAR ESFUERZOS ADMINISTRATIVOS, LOGÍSTICOS Y FINANCIEROS, ENTRE EL FONDO DE DESARROLLO LOCAL DE FONTIBÓN Y LA UNIVERSIDAD DISTRITAL FRANCISCO JOSÉ DE CALDAS, QUE PERMITA EL DESARROLLO DE ACCIONES ORIENTADAS A LA INVESTIGACIÓN-FORMACIÓN SOBRE LAS FORMAS DE DESPLIEGUE Y CONSTRUCCIÓN DE ACCIONES LOCALES ENTORNO AL CUIDADO, LA PARTICIPACIÓN CIUDADANA Y LA GESTIÓN CULTURAL COMUNITARIA PARA LA VIGENCIA 2021","Inversión","Un nuevo Contrato Social y ambiental para la Bogotá del Siglo XXI",6,{"$f":"IF(ISERROR(VLOOKUP(K371,[2]Proposito_programa!$C$2:$E$59,2,FALSE)),\" \",VLOOKUP(K371,[2]Proposito_programa!$C$2:$E$59,2,FALSE))","v":"Sistema Distrital de Cuidado"},{"$f":"IF(ISERROR(VLOOKUP(K371,[2]Proposito_programa!$C$2:$E$59,3,FALSE)),\" \",VLOOKUP(K371,[2]Proposito_programa!$C$2:$E$59,3,FALSE))","v":"Propósito 1: Hacer un nuevo contrato social para incrementar la inclusión social, productiva y política"},1763,1,899992307,"UNIVERSIDAD DISTRITAL FRANCISCO JOSE DE CALDAS","Persona Jurídica","-","-",null,210492000,null,0,0,210492000," $                          -  ","2021-11-12","2022-01-20","2022-07-19","180 DÍAS",0,0,null,null,null,null,null,"X",null,null,0]
[23,2021,"FDLF-CI-023-2021","https://community.secop.gov.co/Public/Tendering/OpportunityDetail/Index?noticeUID=CO1.NTC.2388034&isFromPublicArea=True&isModal=true&asPopupView=true","Convenios de cooperacion","Contratación directa","Contratos interadministrativos","AUNAR ESFUERZOS ADMINISTRATIVOS, LOGÍSTICOS Y FINANCIEROS, ENTRE EL FONDO DE DESARROLLO LOCAL DE FONTIBÓN Y LA UNIVERSIDAD DISTRITAL FRANCISCO JOSÉ DE CALDAS, QUE PERMITA EL DESARROLLO DE ACCIONES ORIENTADAS A LA INVESTIGACIÓN-FORMACIÓN SOBRE LAS FORMAS DE DESPLIEGUE Y CONSTRUCCIÓN DE ACCIONES LOCALES ENTORNO AL CUIDADO, LA PARTICIPACIÓN CIUDADANA Y LA GESTIÓN CULTURAL COMUNITARIA PARA LA VIGENCIA 2021","Inversión","Un nuevo Contrato Social y ambiental para la Bogotá del Siglo XXI",21,{"$f":"IF(ISERROR(VLOOKUP(K372,[2]Proposito_programa!$C$2:$E$59,2,FALSE)),\" \",VLOOKUP(K372,[2]Proposito_programa!$C$2:$E$59,2,FALSE))","v":"Creación y vida cotidiana: Apropiación ciudadana del arte, la cultura y el patrimonio, para la democracia cultural"},{"$f":"IF(ISERROR(VLOOKUP(K372,[2]Proposito_programa!$C$2:$E$59,3,FALSE)),\" \",VLOOKUP(K372,[2]Proposito_programa!$C$2:$E$59,3,FALSE))","v":"Propósito 1: Hacer un nuevo contrato social para incrementar la inclusión social, productiva y política"},1758,1,899992307,"UNIVERSIDAD DISTRITAL FRANCISCO JOSE DE CALDAS","Persona Jurídica",null,null,null,46780580,null,0,0,46780580,null,"2021-11-12","2022-01-20","2022-07-19","180 DÍAS",0,0,null,null,null,null,null,"X",null,null,0]
[23,2021,"FDLF-CI-023-2021","https://community.secop.gov.co/Public/Tendering/OpportunityDetail/Index?noticeUID=CO1.NTC.2388034&isFromPublicArea=True&isModal=true&asPopupView=true","Convenios de cooperacion","Contratación directa","Contratos interadministrativos","AUNAR ESFUERZOS ADMINISTRATIVOS, LOGÍSTICOS Y FINANCIEROS, ENTRE EL FONDO DE DESARROLLO LOCAL DE FONTIBÓN Y LA UNIVERSIDAD DISTRITAL FRANCISCO JOSÉ DE CALDAS, QUE PERMITA EL DESARROLLO DE ACCIONES ORIENTADAS A LA INVESTIGACIÓN-FORMACIÓN SOBRE LAS FORMAS DE DESPLIEGUE Y CONSTRUCCIÓN DE ACCIONES LOCALES ENTORNO AL CUIDADO, LA PARTICIPACIÓN CIUDADANA Y LA GESTIÓN CULTURAL COMUNITARIA PARA LA VIGENCIA 2021","Inversión","Un nuevo Contrato Social y ambiental para la Bogotá del Siglo XXI",40,{"$f":"IF(ISERROR(VLOOKUP(K373,[2]Proposito_programa!$C$2:$E$59,2,FALSE)),\" \",VLOOKUP(K373,[2]Proposito_programa!$C$2:$E$59,2,FALSE))","v":"Más mujeres viven una vida libre de violencias, se sienten seguras y acceden con confianza al sistema de justicia"},{"$f":"IF(ISERROR(VLOOKUP(K373,[2]Proposito_programa!$C$2:$E$59,3,FALSE)),\" \",VLOOKUP(K373,[2]Proposito_programa!$C$2:$E$59,3,FALSE))","v":"Propósito 3: Inspirar confianza y legitimidad para vivir sin miedo y ser epicentro de cultura ciudadana, paz y reconciliación"},1774,1,899992307,"UNIVERSIDAD DISTRITAL FRANCISCO JOSE DE CALDAS","Persona Jurídica",null,null,null,15946840,null,0,0,15946840,null,"2021-11-12","2022-01-20","2022-07-19","180 DÍAS",0,0,null,null,null,null,null,"X",null,null,0]
[23,2021,"FDLF-CI-023-2021","https://community.secop.gov.co/Public/Tendering/OpportunityDetail/Index?noticeUID=CO1.NTC.2388034&isFromPublicArea=True&isModal=true&asPopupView=true","Convenios de cooperacion","Contratación directa","Contratos interadministrativos","AUNAR ESFUERZOS ADMINISTRATIVOS, LOGÍSTICOS Y FINANCIEROS, ENTRE EL FONDO DE DESARROLLO LOCAL DE FONTIBÓN Y LA UNIVERSIDAD DISTRITAL FRANCISCO JOSÉ DE CALDAS, QUE PERMITA EL DESARROLLO DE ACCIONES ORIENTADAS A LA INVESTIGACIÓN-FORMACIÓN SOBRE LAS FORMAS DE DESPLIEGUE Y CONSTRUCCIÓN DE ACCIONES LOCALES ENTORNO AL CUIDADO, LA PARTICIPACIÓN CIUDADANA Y LA GESTIÓN CULTURAL COMUNITARIA PARA LA VIGENCIA 2021","Inversión","Un nuevo Contrato Social y ambiental para la Bogotá del Siglo XXI",55,{"$f":"IF(ISERROR(VLOOKUP(K374,[2]Proposito_programa!$C$2:$E$59,2,FALSE)),\" \",VLOOKUP(K374,[2]Proposito_programa!$C$2:$E$59,2,FALSE))","v":"Fortalecimiento de cultura ciudadana y su institucionalidad"},{"$f":"IF(ISERROR(VLOOKUP(K374,[2]Proposito_programa!$C$2:$E$59,3,FALSE)),\" \",VLOOKUP(K374,[2]Proposito_programa!$C$2:$E$59,3,FALSE))","v":"Propósito 5: Construir Bogotá - Región con gobierno abierto, transparente y ciudadanía consciente"},1782,1,899992307,"UNIVERSIDAD DISTRITAL FRANCISCO JOSE DE CALDAS","Persona Jurídica",null,null,null,46780580,null,0,0,46780580,null,"2021-11-12","2022-01-20","2022-07-19","180 DÍAS",0,0,null,null,null,null,null,"X",null,null,0]
[25,2021,"FDLF-CI-025-2021","https://community.secop.gov.co/Public/Tendering/OpportunityDetail/Index?noticeUID=CO1.NTC.2390907&isFromPublicArea=True&isModal=true&asPopupView=true","Convenios de cooperacion","Contratación directa","Contratos interadministrativos","AUNAR ESFUERZOS TECNICOS, OPERATIVOS Y FINANCIEROS ENTRE EL FONDO DE DESARROLLO LOCAL DE FONTIBÓN Y LA SUBRED INTEGRADA DE SERVICIOS DE SALUD SUR OCCIDENTE, PARA APORTAR A LA CALIDAD DE VIDA DE GRUPOS POBLACIONALES DE ADOLESCENTES, JOVENES, MIGRANTES MATERNAS, NIÑOS-NIÑAS Y POBLACIÓN ETNICA HABITANTES DE LA LOCALIDAD DE FONTIBÓN, A TRAVÉS LA IMPLEMENTACIÓN DE ACCIONES DE RECONOCIMIENTO Y FORTALECIMIEENTO POBLACIONAL Y ACCIONES COMPLEMENTARIAS EN SALUD","Inversión","Un nuevo Contrato Social y ambiental para la Bogotá del Siglo XXI",6,{"$f":"IF(ISERROR(VLOOKUP(K375,[2]Proposito_programa!$C$2:$E$59,2,FALSE)),\" \",VLOOKUP(K375,[2]Proposito_programa!$C$2:$E$59,2,FALSE))","v":"Sistema Distrital de Cuidado"},{"$f":"IF(ISERROR(VLOOKUP(K375,[2]Proposito_programa!$C$2:$E$59,3,FALSE)),\" \",VLOOKUP(K375,[2]Proposito_programa!$C$2:$E$59,3,FALSE))","v":"Propósito 1: Hacer un nuevo contrato social para incrementar la inclusión social, productiva y política"},1764,1,900959048,"SUBRED INTEGRADA DE SERVICIOS DE SALUD SUR OCCIDENTE ESE.","Persona Jurídica","-","-",null,296993000,null,0,0,296993000," $                          -  ","2021-11-12","2021-12-27","2022-08-26","240 DÍAS",0,0,null,null,null,null,null,"X",null,null,0]
[25,2021,"FDLF-CI-025-2021","https://community.secop.gov.co/Public/Tendering/OpportunityDetail/Index?noticeUID=CO1.NTC.2390907&isFromPublicArea=True&isModal=true&asPopupView=true","Convenios de cooperacion","Contratación directa","Contratos interadministrativos","AUNAR ESFUERZOS TECNICOS, OPERATIVOS Y FINANCIEROS ENTRE EL FONDO DE DESARROLLO LOCAL DE FONTIBÓN Y LA SUBRED INTEGRADA DE SERVICIOS DE SALUD SUR OCCIDENTE, PARA APORTAR A LA CALIDAD DE VIDA DE GRUPOS POBLACIONALES DE ADOLESCENTES, JOVENES, MIGRANTES MATERNAS, NIÑOS-NIÑAS Y POBLACIÓN ETNICA HABITANTES DE LA LOCALIDAD DE FONTIBÓN, A TRAVÉS LA IMPLEMENTACIÓN DE ACCIONES DE RECONOCIMIENTO Y FORTALECIMIEENTO POBLACIONAL Y ACCIONES COMPLEMENTARIAS EN SALUD","Inversión","Un nuevo Contrato Social y ambiental para la Bogotá del Siglo XXI",8,{"$f":"IF(ISERROR(VLOOKUP(K376,[2]Proposito_programa!$C$2:$E$59,2,FALSE)),\" \",VLOOKUP(K376,[2]Proposito_programa!$C$2:$E$59,2,FALSE))","v":"Prevención y atención de maternidad temprana"},{"$f":"IF(ISERROR(VLOOKUP(K376,[2]Proposito_programa!$C$2:$E$59,3,FALSE)),\" \",VLOOKUP(K376,[2]Proposito_programa!$C$2:$E$59,3,FALSE))","v":"Propósito 1: Hacer un nuevo contrato social para incrementar la inclusión social, productiva y política"},1765,1,900959048,"SUBRED INTEGRADA DE SERVICIOS DE SALUD SUR OCCIDENTE ESE.","Persona Jurídica",null,null,null,178432000,null,0,0,178432000,null,"2021-11-12","2021-12-27","2022-08-26","240 DÍAS",0,0,null,null,null,null,null,"X",null,null,0]
[25,2021,"FDLF-CI-025-2021","https://community.secop.gov.co/Public/Tendering/OpportunityDetail/Index?noticeUID=CO1.NTC.2390907&isFromPublicArea=True&isModal=true&asPopupView=true","Convenios de cooperacion","Contratación directa","Contratos interadministrativos","AUNAR ESFUERZOS TECNICOS, OPERATIVOS Y FINANCIEROS ENTRE EL FONDO DE DESARROLLO LOCAL DE FONTIBÓN Y LA SUBRED INTEGRADA DE SERVICIOS DE SALUD SUR OCCIDENTE, PARA APORTAR A LA CALIDAD DE VIDA DE GRUPOS POBLACIONALES DE ADOLESCENTES, JOVENES, MIGRANTES MATERNAS, NIÑOS-NIÑAS Y POBLACIÓN ETNICA HABITANTES DE LA LOCALIDAD DE FONTIBÓN, A TRAVÉS LA IMPLEMENTACIÓN DE ACCIONES DE RECONOCIMIENTO Y FORTALECIMIEENTO POBLACIONAL Y ACCIONES COMPLEMENTARIAS EN SALUD","Inversión","Un nuevo Contrato Social y ambiental para la Bogotá del Siglo XXI",21,{"$f":"IF(ISERROR(VLOOKUP(K377,[2]Proposito_programa!$C$2:$E$59,2,FALSE)),\" \",VLOOKUP(K377,[2]Proposito_programa!$C$2:$E$59,2,FALSE))","v":"Creación y vida cotidiana: Apropiación ciudadana del arte, la cultura y el patrimonio, para la democracia cultural"},{"$f":"IF(ISERROR(VLOOKUP(K377,[2]Proposito_programa!$C$2:$E$59,3,FALSE)),\" \",VLOOKUP(K377,[2]Proposito_programa!$C$2:$E$59,3,FALSE))","v":"Propósito 1: Hacer un nuevo contrato social para incrementar la inclusión social, productiva y política"},1758,1,900959048,"SUBRED INTEGRADA DE SERVICIOS DE SALUD SUR OCCIDENTE ESE.","Persona Jurídica",null,null,null,28462850,null,0,0,28462850,null,"2021-11-12","2021-12-27","2022-08-26","240 DÍAS",0,0,null,null,null,null,null,"X",null,null,0]
[25,2021,"FDLF-CI-025-2021","https://community.secop.gov.co/Public/Tendering/OpportunityDetail/Index?noticeUID=CO1.NTC.2390907&isFromPublicArea=True&isModal=true&asPopupView=true","Convenios de cooperacion","Contratación directa","Contratos interadministrativos","AUNAR ESFUERZOS TECNICOS, OPERATIVOS Y FINANCIEROS ENTRE EL FONDO DE DESARROLLO LOCAL DE FONTIBÓN Y LA SUBRED INTEGRADA DE SERVICIOS DE SALUD SUR OCCIDENTE, PARA APORTAR A LA CALIDAD DE VIDA DE GRUPOS POBLACIONALES DE ADOLESCENTES, JOVENES, MIGRANTES MATERNAS, NIÑOS-NIÑAS Y POBLACIÓN ETNICA HABITANTES DE LA LOCALIDAD DE FONTIBÓN, A TRAVÉS LA IMPLEMENTACIÓN DE ACCIONES DE RECONOCIMIENTO Y FORTALECIMIEENTO POBLACIONAL Y ACCIONES COMPLEMENTARIAS EN SALUD","Inversión","Un nuevo Contrato Social y ambiental para la Bogotá del Siglo XXI",39,{"$f":"IF(ISERROR(VLOOKUP(K378,[2]Proposito_programa!$C$2:$E$59,2,FALSE)),\" \",VLOOKUP(K378,[2]Proposito_programa!$C$2:$E$59,2,FALSE))","v":"Bogotá territorio de paz y atención integral a las víctimas del conflicto armado"},{"$f":"IF(ISERROR(VLOOKUP(K378,[2]Proposito_programa!$C$2:$E$59,3,FALSE)),\" \",VLOOKUP(K378,[2]Proposito_programa!$C$2:$E$59,3,FALSE))","v":"Propósito 3: Inspirar confianza y legitimidad para vivir sin miedo y ser epicentro de cultura ciudadana, paz y reconciliación"},1773,1,900959048,"SUBRED INTEGRADA DE SERVICIOS DE SALUD SUR OCCIDENTE ESE.","Persona Jurídica",null,null,null,27710572,null,0,0,27710572,null,"2021-11-12","2021-12-27","2022-08-26","240 DÍAS",0,0,null,null,null,null,null,"X",null,null,0]
[28,2021,"FDLF-CI-028-2021","https://community.secop.gov.co/Public/Tendering/OpportunityDetail/Index?noticeUID=CO1.NTC.2389796&isFromPublicArea=True&isModal=true&asPopupView=true","Contratos interadministrativos","Contratación directa","Contratos interadministrativos","PRESTAR LOS SERVICIOS DE INTERNET DEDICADO PARA LAS SEDES DE LA ALCALDIA LOCAL DE FONTIBON","Funcionamiento","Un nuevo Contrato Social y ambiental para la Bogotá del Siglo XXI","No aplica",{"$f":"IF(ISERROR(VLOOKUP(K379,[2]Proposito_programa!$C$2:$E$59,2,FALSE)),\" \",VLOOKUP(K379,[2]Proposito_programa!$C$2:$E$59,2,FALSE))","v":" "},{"$f":"IF(ISERROR(VLOOKUP(K379,[2]Proposito_programa!$C$2:$E$59,3,FALSE)),\" \",VLOOKUP(K379,[2]Proposito_programa!$C$2:$E$59,3,FALSE))","v":" "},404,1,899999115,"ETB SA ESP","Persona Jurídica","-","-",null,77493276,null,0,0,77493276,null,"2021-11-12","2021-11-25","2022-11-24","360 DÍAS",0,0,null,null,null,null,null,"X",null,null,0]
[29,2021,"FDLF-CI-029-2021","https://community.secop.gov.co/Public/Tendering/OpportunityDetail/Index?noticeUID=CO1.NTC.2390859&isFromPublicArea=True&isModal=true&asPopupView=true","Convenios de cooperacion","Contratación directa","Contratos interadministrativos","AUNAR ESFUERZOS TÉCNICOS, ADMINISTRATIVOS Y FINANCIEROS CON EL FIN DE DESARROLLAR ACCIONES ARTICULADAS ENTRE LAS PARTES, ORIENTADAS A FOMENTAR LA GENERACIÓN DE ACUERDOS CIUDADANOS PARA LA VINCULACIÓN DE LA CIUDADANÍA EN LOS PROGRAMAS ADELANTADOS POR EL IDRD Y ACUERDOS CON VENDEDORES INFORMALES Y ESTACIONARIOS; ASÍ COMO TAMBIÉN PARA EL FORTALECIMIENTO DE LA FORMALIDAD DE VENDEDORES INFORMALES A CÍRCULOS PRODUCTIVOS EN LA LOCALIDAD DE FONTIBÓN","Inversión","Un nuevo Contrato Social y ambiental para la Bogotá del Siglo XXI",45,{"$f":"IF(ISERROR(VLOOKUP(K380,[2]Proposito_programa!$C$2:$E$59,2,FALSE)),\" \",VLOOKUP(K380,[2]Proposito_programa!$C$2:$E$59,2,FALSE))","v":"Espacio público más seguro y construido colectivamente"},{"$f":"IF(ISERROR(VLOOKUP(K380,[2]Proposito_programa!$C$2:$E$59,3,FALSE)),\" \",VLOOKUP(K380,[2]Proposito_programa!$C$2:$E$59,3,FALSE))","v":"Propósito 3: Inspirar confianza y legitimidad para vivir sin miedo y ser epicentro de cultura ciudadana, paz y reconciliación"},1776,1,899999063,"UNIVERSIDAD NACIONAL DE COLOMBIA","Persona Jurídica","-","-",null,401800008,null,0,0,401800008," $                          -  ","2021-11-12","2021-11-26","2022-09-25","300 DÍAS",0,0,null,null,null,null,null,"X",null,null,0]
[30,2021,"FDLF-CI-030-2021","https://community.secop.gov.co/Public/Tendering/OpportunityDetail/Index?noticeUID=CO1.NTC.2389599&isFromPublicArea=True&isModal=true&asPopupView=true","Convenios de cooperacion","Contratación directa","Contratos interadministrativos","AUNAR ESFUERZOS TECNICOS ADMINISTRATIVOS Y FINANCIEROS TENDIENTES A LA REALIZACION DE ACTIVIDADES DE RESTAURACION ECOLOGICA Y MANTENIMIENTO A ARBORIZACION URBANA LLEVADOS A CABO EN LA LOCALIDAD DE FONTIBON, CON PARTICIPACION DE LOS JOVENES BENEFICIARIOS DEL PROGRAMA DE IDIPRON","Inversión","Un nuevo Contrato Social y ambiental para la Bogotá del Siglo XXI",28,{"$f":"IF(ISERROR(VLOOKUP(K381,[2]Proposito_programa!$C$2:$E$59,2,FALSE)),\" \",VLOOKUP(K381,[2]Proposito_programa!$C$2:$E$59,2,FALSE))","v":"Bogotá protectora de sus recursos naturales"},{"$f":"IF(ISERROR(VLOOKUP(K381,[2]Proposito_programa!$C$2:$E$59,3,FALSE)),\" \",VLOOKUP(K381,[2]Proposito_programa!$C$2:$E$59,3,FALSE))","v":"Propósito 2 : Cambiar Nuestros Hábitos de Vida para Reverdecer a Bogotá y Adaptarnos y Mitigar la Crisis Climática"},1767,1,899999333,"INSTITUTO DISTRITAL PARA LA PROTECCIÓN DE LA NIÑEZ Y LA JUVENTUD - IDIPRON","Persona Jurídica","-","-",null,221080000,null,0,0,221080000," $                          -  ","2021-11-12","2021-11-22","2022-05-21","180 DÍAS",0,0,null,null,null,null,null,"X",null,null,0]
[32,2021,"FDLF-CI-032-2021","https://community.secop.gov.co/Public/Tendering/OpportunityDetail/Index?noticeUID=CO1.NTC.2391015&isFromPublicArea=True&isModal=true&asPopupView=true","Contratos interadministrativos","Contratación directa","Contratos interadministrativos","CONTRATAR EL SERVICIO DE MENSAJERÍA Y CORREO CERTIFICADO, PARA EL DESARROLLO DE LAS ACTIVIDADES ADMINISTRATIVAS Y DE FUNCIONAMIENTO DEL FONDO DE DESARROLLO DE FONTIBÓN.","Funcionamiento","Un nuevo Contrato Social y ambiental para la Bogotá del Siglo XXI","No aplica",{"$f":"IF(ISERROR(VLOOKUP(K382,[2]Proposito_programa!$C$2:$E$59,2,FALSE)),\" \",VLOOKUP(K382,[2]Proposito_programa!$C$2:$E$59,2,FALSE))","v":" "},{"$f":"IF(ISERROR(VLOOKUP(K382,[2]Proposito_programa!$C$2:$E$59,3,FALSE)),\" \",VLOOKUP(K382,[2]Proposito_programa!$C$2:$E$59,3,FALSE))","v":" "},601,1,900062917,"SERVICIOS POSTALES NACIONALES S.A","Persona Jurídica","-","-",null,10975000,null,0,0,10975000,null,"2021-11-12","2021-12-10","2022-12-09","365 DÍAS",0,0,null,null,null,null,null,"X",null,null,0.72]
[66469,2021,"OC-66469","https://colombiacompra.gov.co/tienda-virtual-del-estado-colombiano/ordenes-compra/66469","Contratos de prestación de servicios","Contratación directa","Contratación de bienes y servicios en el sector Defensa y en el Departamento Administrativo de Seguridad, DAS","LA ADQUISICIÓN DEL SERVICIO INTEGRAL DE ASEO Y CAFETERÍA CONFORME AL ACUERDO MARCO DE PRECIOS No. CCE-972-AMP-2019. PARA LAS DIFERENTES DEPENDENCIAS DE LA ALCALDIA LOCAL DE FONTIBON, LAS INSPECCIONES DE POLICIA, LA CASA DEL CONSUMIDOR Y LA JUNTA ADMINISTRADORA LOCAL DE FONTIBON","Funcionamiento","Un nuevo Contrato Social y ambiental para la Bogotá del Siglo XXI","No aplica",{"$f":"IF(ISERROR(VLOOKUP(K383,[2]Proposito_programa!$C$2:$E$59,2,FALSE)),\" \",VLOOKUP(K383,[2]Proposito_programa!$C$2:$E$59,2,FALSE))","v":" "},{"$f":"IF(ISERROR(VLOOKUP(K383,[2]Proposito_programa!$C$2:$E$59,3,FALSE)),\" \",VLOOKUP(K383,[2]Proposito_programa!$C$2:$E$59,3,FALSE))","v":" "},502,1,860010451,"Casalimpia S.A.","Persona Jurídica","-","-",null,109973209,null,0,0,109973210,84375913,"2021-03-30","2021-03-30","2021-10-29",213,0,0,null,null,null,null,null,null,"X",null,0.77]
[68487,2021,"OC-68487","https://colombiacompra.gov.co/tienda-virtual-del-estado-colombiano/ordenes-compra/68487","Contratos de prestación de servicios","Contratación directa","Cuando no exista pluralidad de oferentes en el mercado","ADQUISICIÓN DE UN GRUPO DE LICENCIAS OFFICE 365 DE USO EMPRESARIAL CON SUSCRIPCIÓN A UN AÑO AL SERVICIO DEL FONDO DE DESARROLLO LOCAL Y LA JUNTA ADMINISTRADORA LOCAL DE FONTIBÓN A TRAVÉS DE LA PLATAFORMA DE LA TIENDA VIRTUAL DEL ESTADO COLOMBIANO EN LA CATEGORÍA DE SOFTWARE POR CATÁLOGO DEL PROCESO CCE-139-IAD-2020”.","Funcionamiento","Un nuevo Contrato Social y ambiental para la Bogotá del Siglo XXI","No aplica",{"$f":"IF(ISERROR(VLOOKUP(K384,[2]Proposito_programa!$C$2:$E$59,2,FALSE)),\" \",VLOOKUP(K384,[2]Proposito_programa!$C$2:$E$59,2,FALSE))","v":" "},{"$f":"IF(ISERROR(VLOOKUP(K384,[2]Proposito_programa!$C$2:$E$59,3,FALSE)),\" \",VLOOKUP(K384,[2]Proposito_programa!$C$2:$E$59,3,FALSE))","v":" "},304,1,901373456,"UT Soft IG 3","Persona Jurídica","-","-",null,96485879,null,1,9870972,106356850,96485879,"2021-05-04","2021-05-04","2022-05-09",369,0,0,null,null,null,null,null,"X",null,null,0.91]
[78069,2021,"OC-78069","https://colombiacompra.gov.co/tienda-virtual-del-estado-colombiano/ordenes-compra/78069","Suministro","Contratación directa","Cuando no exista pluralidad de oferentes en el mercado","SUMINISTRO DE COMBUSTIBLE PARA VEHÍCULOS LIVIANOS, PESADOS Y MAQUINARIA AMARILLA DE PROPIEDAD O TENENCIA DEL FONDO DE DESARROLLO LOCAL DE FONTIBÓN A MONTO AGOTABLE","Funcionamiento","Un nuevo Contrato Social y ambiental para la Bogotá del Siglo XXI","No aplica",{"$f":"IF(ISERROR(VLOOKUP(K385,[2]Proposito_programa!$C$2:$E$59,2,FALSE)),\" \",VLOOKUP(K385,[2]Proposito_programa!$C$2:$E$59,2,FALSE))","v":" "},{"$f":"IF(ISERROR(VLOOKUP(K385,[2]Proposito_programa!$C$2:$E$59,3,FALSE)),\" \",VLOOKUP(K385,[2]Proposito_programa!$C$2:$E$59,3,FALSE))","v":" "},203,1,830095213,"Organización Terpel S.A.\n","Persona Jurídica","-","-",null,25000000,null,0,0,25000000," $                          -  ","2021-10-21","2021-10-21","2022-10-21",365,0,0,null,null,null,null,null,"X",null,null,0]
[78805,2021,"OC-78805","https://colombiacompra.gov.co/tienda-virtual-del-estado-colombiano/ordenes-compra/78805","Contratos de prestación de servicios","Contratación directa","Cuando no exista pluralidad de oferentes en el mercado","LA ADQUISICIÓN DEL SERVICIO INTEGRAL DE ASEO Y CAFETERÍA CONFORME AL ACUERDO MARCO DE PRE-CIOS No. CCE-972-AMP-2019. PARA LAS DIFERENTES DEPENDENCIAS DE LA AL-CALDIA LOCAL DE FONTIBON, LAS INSPECCIONES DE POLICIA, LA CASA DEL CONSUMIDOR Y LA JUNTA ADMINISTRADORA LOCAL DE FONTIBON","Funcionamiento","Un nuevo Contrato Social y ambiental para la Bogotá del Siglo XXI","No aplica",{"$f":"IF(ISERROR(VLOOKUP(K386,[2]Proposito_programa!$C$2:$E$59,2,FALSE)),\" \",VLOOKUP(K386,[2]Proposito_programa!$C$2:$E$59,2,FALSE))","v":" "},{"$f":"IF(ISERROR(VLOOKUP(K386,[2]Proposito_programa!$C$2:$E$59,3,FALSE)),\" \",VLOOKUP(K386,[2]Proposito_programa!$C$2:$E$59,3,FALSE))","v":" "},502,1,900073254,"CENTRO ASEO MANTENIMIENTO PROFESIONAL S.A.S","Persona Jurídica","-","-",null,182134879,null,0,0,182134879," $                          -  ","2021-11-02","2021-11-02","2022-11-02",365,0,0,null,null,null,null,null,"X",null,null,0]
[80536,2021,"OC-80536","https://colombiacompra.gov.co/tienda-virtual-del-estado-colombiano/ordenes-compra/80536","Contratos de prestación de servicios","Contratación directa","Cuando no exista pluralidad de oferentes en el mercado","MANTENIMIENTO Y RECARGA DE EXTINTORES Y SUMINISTRO DE ELEMENTOS DE EMERGENCIA PARA LAS INSTALACIONES DE LA ALCALDIA LOCAL DE FONTIBÓN Y JUNTA ADMINISTRADORA LOCAL TENIENDO EN CUENTA EL ACUERDO MARCO CCENEG-041-01-2021","Funcionamiento","Un nuevo Contrato Social y ambiental para la Bogotá del Siglo XXI","No aplica",{"$f":"IF(ISERROR(VLOOKUP(K387,[2]Proposito_programa!$C$2:$E$59,2,FALSE)),\" \",VLOOKUP(K387,[2]Proposito_programa!$C$2:$E$59,2,FALSE))","v":" "},{"$f":"IF(ISERROR(VLOOKUP(K387,[2]Proposito_programa!$C$2:$E$59,3,FALSE)),\" \",VLOOKUP(K387,[2]Proposito_programa!$C$2:$E$59,3,FALSE))","v":" "},205,1,900353659,"JM GRUPO EMPRESARIAL S.A.S","Persona Jurídica","-","-",null,6319224,null,0,0,6319224," $                          -  ","2021-11-23","2021-11-23","2022-01-24",60,0,0,null,null,null,null,null,null,"X",null,0]
[80541,2021,"OC-80541","https://colombiacompra.gov.co/tienda-virtual-del-estado-colombiano/ordenes-compra/80541","Contratos de prestación de servicios","Contratación directa","Cuando no exista pluralidad de oferentes en el mercado","MANTENIMIENTO Y RECARGA DE EXTINTORES Y SUMINISTRO DE ELEMENTOS DE EMERGENCIA PARA LAS INSTALACIONES DE LA ALCALDIA LOCAL DE FONTIBÓN Y JUNTA ADMINISTRADORA LOCAL TENIENDO EN CUENTA EL ACUERDO MARCO CCENEG-041-01-2021","Funcionamiento","Un nuevo Contrato Social y ambiental para la Bogotá del Siglo XXI","No aplica",{"$f":"IF(ISERROR(VLOOKUP(K388,[2]Proposito_programa!$C$2:$E$59,2,FALSE)),\" \",VLOOKUP(K388,[2]Proposito_programa!$C$2:$E$59,2,FALSE))","v":" "},{"$f":"IF(ISERROR(VLOOKUP(K388,[2]Proposito_programa!$C$2:$E$59,3,FALSE)),\" \",VLOOKUP(K388,[2]Proposito_programa!$C$2:$E$59,3,FALSE))","v":" "},205,1,"900349363 - 2","INVERSION Y HOGAR SAS","Persona Jurídica","-","-",null,3525984,null,0,0,3525984," $                          -  ","2021-11-23","2021-11-23","2022-01-24",60,0,0,null,null,null,null,null,null,"X",null,0]
[83851,2021,"OC-83851","https://colombiacompra.gov.co/tienda-virtual-del-estado-colombiano/ordenes-compra/83851","Compraventa de bienes muebles","Contratación directa","Cuando no exista pluralidad de oferentes en el mercado","ADQUISICION DE UN DRONE Y UNA CAMARA VIDEO FOTOGRAFICA PARA EL FORTALECIMIENTOS DE LAS COMUNICACIONES EN EL FONDO DE DESARROLLO LOCAL DE FONTIBON","Funcionamiento","Un nuevo Contrato Social y ambiental para la Bogotá del Siglo XXI","No aplica",{"$f":"IF(ISERROR(VLOOKUP(K389,[2]Proposito_programa!$C$2:$E$59,2,FALSE)),\" \",VLOOKUP(K389,[2]Proposito_programa!$C$2:$E$59,2,FALSE))","v":" "},{"$f":"IF(ISERROR(VLOOKUP(K389,[2]Proposito_programa!$C$2:$E$59,3,FALSE)),\" \",VLOOKUP(K389,[2]Proposito_programa!$C$2:$E$59,3,FALSE))","v":" "},107,1,890900943,"COLOMBIANA DE COMERCIO S.A Y/O ALKOSTO S.A","Persona Jurídica","-","-",null,11343020,null,0,0,{"$f":"Y389+V389+W389","v":11343020}," $                          -  ","2021-12-29","2021-12-29","2022-02-28",60,0,0,null,null,null,null,null,"X",null,null,0]
[83879,2021,"OC-83879","https://colombiacompra.gov.co/tienda-virtual-del-estado-colombiano/ordenes-compra/83879","Compraventa de bienes muebles","Contratación directa","Cuando no exista pluralidad de oferentes en el mercado","ADQUISICION DE EQUIPOS DE COMPUTO Y EQUIPOS DE COMUNICACIÓN PARA EL FONDO DE DESARROLLO LOCAL DE FONTIBON","Funcionamiento","Un nuevo Contrato Social y ambiental para la Bogotá del Siglo XXI","No aplica",{"$f":"IF(ISERROR(VLOOKUP(K390,[2]Proposito_programa!$C$2:$E$59,2,FALSE)),\" \",VLOOKUP(K390,[2]Proposito_programa!$C$2:$E$59,2,FALSE))","v":" "},{"$f":"IF(ISERROR(VLOOKUP(K390,[2]Proposito_programa!$C$2:$E$59,3,FALSE)),\" \",VLOOKUP(K390,[2]Proposito_programa!$C$2:$E$59,3,FALSE))","v":" "},102,1,890900943,"COLOMBIANA DE COMERCIO S.A Y/O ALKOSTO S.A","Persona Jurídica","-","-",null,15300000,null,0,0,15300000," $                          -  ","2021-12-29","2021-12-29","2022-02-28",60,0,0,null,null,null,null,null,"X",null,null,0]
[83879,2021,"OC-83879","https://colombiacompra.gov.co/tienda-virtual-del-estado-colombiano/ordenes-compra/83879","Compraventa de bienes muebles","Contratación directa","Cuando no exista pluralidad de oferentes en el mercado","ADQUISICION DE EQUIPOS DE COMPUTO Y EQUIPOS DE COMUNICACIÓN PARA EL FONDO DE DESARROLLO LOCAL DE FONTIBON","Funcionamiento","Un nuevo Contrato Social y ambiental para la Bogotá del Siglo XXI","No aplica",{"$f":"IF(ISERROR(VLOOKUP(K391,[2]Proposito_programa!$C$2:$E$59,2,FALSE)),\" \",VLOOKUP(K391,[2]Proposito_programa!$C$2:$E$59,2,FALSE))","v":" "},{"$f":"IF(ISERROR(VLOOKUP(K391,[2]Proposito_programa!$C$2:$E$59,3,FALSE)),\" \",VLOOKUP(K391,[2]Proposito_programa!$C$2:$E$59,3,FALSE))","v":" "},107,1,890900943,"COLOMBIANA DE COMERCIO S.A Y/O ALKOSTO S.A","Persona Jurídica",null,null,null,8459000,null,0,0,8459000," $                          -  ","2021-12-29","2021-12-29","2022-02-28",60,0,0,null,null,null,null,null,"X",null,null,0]
[null,2021,null,null,"Otros gastos",null,null,"Resolución N° 3 de fecha 01 de febrero de 2021, Por medio de la cual se garantiza el pago de los costos operativos que se causen en el Desarrollo del convenio N° 4002 de 2011,celebrado entre la alcaldía Local de Fontibón y la Caja de Compensación Familiar Compensar, dentro del Proyecto N° 1752 de la localidad de Fontibón, Vigencia 2021, desde los meses de febrero de 2021 a Junio de 2021, Se expide CDP con memorando 20215920000613 recibido para tramite de fecha Feb 09/2021.Se expide CRP atendiendo solicitud 20215920000633.","Inversión","Un nuevo Contrato Social y ambiental para la Bogotá del Siglo XXI",1,{"$f":"IF(ISERROR(VLOOKUP(K392,[2]Proposito_programa!$C$2:$E$59,2,FALSE)),\" \",VLOOKUP(K392,[2]Proposito_programa!$C$2:$E$59,2,FALSE))","v":"Subsidios y transferencias para la equidad"},{"$f":"IF(ISERROR(VLOOKUP(K392,[2]Proposito_programa!$C$2:$E$59,3,FALSE)),\" \",VLOOKUP(K392,[2]Proposito_programa!$C$2:$E$59,3,FALSE))","v":"Propósito 1: Hacer un nuevo contrato social para incrementar la inclusión social, productiva y política"},1752,1,860066942,"CAJA DE COMPENSACION FAMILIAR COMPENSAR","Persona Jurídica",null,null,null,10045000,null,0,0,10045000,6993036,"2021-02-01","2021-02-01","2021-06-30",180,0,0,null,null,null,null,null,null,"X",null,0.7]
[null,2021,null,null,"Otros gastos",null,null,"Por medio de la cual se ordena el gasto y pago correspondientes al Proyecto N° 1752 \"Un nuevo contrato para garantizar el ingreso mínimo en Fontibón\", Componente: Entrega de subsidio económico C, Localidad de Fontibón vigencia 2021\" desde los meses de julio de 2021 a enero de 2022. Se expide CRP con memorando 20215900002103 recibido para tramite de fecha Jul 06/2021.","Inversión","Un nuevo Contrato Social y ambiental para la Bogotá del Siglo XXI",1,{"$f":"IF(ISERROR(VLOOKUP(K393,[2]Proposito_programa!$C$2:$E$59,2,FALSE)),\" \",VLOOKUP(K393,[2]Proposito_programa!$C$2:$E$59,2,FALSE))","v":"Subsidios y transferencias para la equidad"},{"$f":"IF(ISERROR(VLOOKUP(K393,[2]Proposito_programa!$C$2:$E$59,3,FALSE)),\" \",VLOOKUP(K393,[2]Proposito_programa!$C$2:$E$59,3,FALSE))","v":"Propósito 1: Hacer un nuevo contrato social para incrementar la inclusión social, productiva y política"},1752,1,860066942,"CAJA DE COMPENSACION FAMILIAR COMPENSAR","Persona Jurídica",null,null,null,886900000,null,0,0,886900000,759500000,"2021-07-06","2021-07-06","2021-12-31",180,0,0,null,null,null,null,null,null,"X",null,1]
[null,2021,null,null,"Otros gastos",null,null,"Por medio de la cual se ordena el gasto y pago correspondientes al Proyecto N° 1752 \"Un nuevo contrato para garantizar el ingreso mínimo en Fontibón\", Componente: Entrega de subsidio económico C, Localidad de Fontibón vigencia 2021\" desde los meses de julio de 2021 a enero de 2022. Se expide CRP con memorando 20215900002103 recibido para tramite de fecha Jul 06/2021.","Inversión","Un nuevo Contrato Social y ambiental para la Bogotá del Siglo XXI",1,{"$f":"IF(ISERROR(VLOOKUP(K394,[2]Proposito_programa!$C$2:$E$59,2,FALSE)),\" \",VLOOKUP(K394,[2]Proposito_programa!$C$2:$E$59,2,FALSE))","v":"Subsidios y transferencias para la equidad"},{"$f":"IF(ISERROR(VLOOKUP(K394,[2]Proposito_programa!$C$2:$E$59,3,FALSE)),\" \",VLOOKUP(K394,[2]Proposito_programa!$C$2:$E$59,3,FALSE))","v":"Propósito 1: Hacer un nuevo contrato social para incrementar la inclusión social, productiva y política"},1752,1,860066942,"CAJA DE COMPENSACION FAMILIAR COMPENSAR","Persona Jurídica",null,null,null,4877973,null,0,0,4877973,4877973,"2021-07-06","2021-07-06","2021-12-31",180,0,0,null,null,null,null,null,null,"X",null,1]
[null,2021,null,null,"Otros gastos",null,null,"Resolución N° 4 de fecha 01 de febrero de 2021, Por medio de la cual se garantiza el gasto y pago correspondiente al Proyecto N° 1752- \" Un nuevo contrato para garantizar el ingreso mínimo en Fontibón\" Componente: Entrega de subsidio Económico Tipo C, Localidad de Fontibón Vigencia 2021, desde los meses de febrero de 2021 a Junio de 2021, Se expide CDP con memorando 20215920000623 recibido para tramite de fecha Feb 09/2021.Se expide CRP con memorando 20215920000643.","Inversión","Un nuevo Contrato Social y ambiental para la Bogotá del Siglo XXI",1,{"$f":"IF(ISERROR(VLOOKUP(K395,[2]Proposito_programa!$C$2:$E$59,2,FALSE)),\" \",VLOOKUP(K395,[2]Proposito_programa!$C$2:$E$59,2,FALSE))","v":"Subsidios y transferencias para la equidad"},{"$f":"IF(ISERROR(VLOOKUP(K395,[2]Proposito_programa!$C$2:$E$59,3,FALSE)),\" \",VLOOKUP(K395,[2]Proposito_programa!$C$2:$E$59,3,FALSE))","v":"Propósito 1: Hacer un nuevo contrato social para incrementar la inclusión social, productiva y política"},1752,1,860066942,"CAJA DE COMPENSACION FAMILIAR COMPENSAR","Persona Jurídica",null,null,null,612500000,null,0,0,612500000,612500000,"2021-02-01","2021-02-01","2021-06-30",180,0,0,null,null,null,null,null,null,"X",null,1]
[null,2021,null,null,"Otros gastos",null,null,"Por medio de la cual se garantiza el pago de los costos operativos que se causen en el desarrollo del Convenio de Asociación N°4002 de 2011 prorrogado y celebrado entre la Secretaria Distrital de Integración social y la caja de compensación Familiar Compensar, dentro del proyecto 1752 \"Un nuevo contrato para garantizar el ingreso mínimo en Fontibón\" Componente: Entrega de subsidio económico tipo C, localidad de Fontibón, Vigencia 2021, desde los meses de julio 2021 a enero de 2022, se expide CRP con memorando 20215900002113 recibido para tramite de fecha Jul 06/2021.","Inversión","Un nuevo Contrato Social y ambiental para la Bogotá del Siglo XXI",1,{"$f":"IF(ISERROR(VLOOKUP(K396,[2]Proposito_programa!$C$2:$E$59,2,FALSE)),\" \",VLOOKUP(K396,[2]Proposito_programa!$C$2:$E$59,2,FALSE))","v":"Subsidios y transferencias para la equidad"},{"$f":"IF(ISERROR(VLOOKUP(K396,[2]Proposito_programa!$C$2:$E$59,3,FALSE)),\" \",VLOOKUP(K396,[2]Proposito_programa!$C$2:$E$59,3,FALSE))","v":"Propósito 1: Hacer un nuevo contrato social para incrementar la inclusión social, productiva y política"},1752,1,860066942,"CAJA DE COMPENSACION FAMILIAR COMPENSAR","Persona Jurídica",null,null,null,14842000,null,0,0,14842000,6793544,null,null,null,null,0,0,null,null,null,null,null,null,"X",null,0.46]
[null,2021,null,null,"Otros gastos",null,null,"Por medio del cual se destina y ordena el gasto anticipado de los aportes al sistema general de riesgos laborales de acuerdo con lo establecido en el articulo 13 del Decreto 723 de 2013, se expide CDP según memorando 20215900001083 recibido para tramite de fecha Abril 23 de 2021.","Inversión","Un nuevo Contrato Social y ambiental para la Bogotá del Siglo XXI",33,{"$f":"IF(ISERROR(VLOOKUP(K397,[2]Proposito_programa!$C$2:$E$59,2,FALSE)),\" \",VLOOKUP(K397,[2]Proposito_programa!$C$2:$E$59,2,FALSE))","v":"Más árboles y más y mejor espacio público"},{"$f":"IF(ISERROR(VLOOKUP(K397,[2]Proposito_programa!$C$2:$E$59,3,FALSE)),\" \",VLOOKUP(K397,[2]Proposito_programa!$C$2:$E$59,3,FALSE))","v":"Propósito 2 : Cambiar Nuestros Hábitos de Vida para Reverdecer a Bogotá y Adaptarnos y Mitigar la Crisis Climática"},1770,1,860011153,"POSITIVA COMPAÑIA DE SEGUROS SA","Persona Jurídica",null,null,null,1267900,null,0,0,1267900,600300,null,null,null,null,0,0,null,null,null,null,null,null,"X",null,0.47]
[null,2021,null,null,"Otros gastos",null,null,"Por medio del cual se destina y ordena el gasto anticipado de los aportes al sistema general de riesgos laborales de acuerdo a lo establecido en el articulo 13 del Decreto 723 de 2013, Se expide CDP atendiendo memorando 20215900000063 recibido para tramite de fecha Enero 22 de 2021.","Inversión","Un nuevo Contrato Social y ambiental para la Bogotá del Siglo XXI",43,{"$f":"IF(ISERROR(VLOOKUP(K398,[2]Proposito_programa!$C$2:$E$59,2,FALSE)),\" \",VLOOKUP(K398,[2]Proposito_programa!$C$2:$E$59,2,FALSE))","v":"Cultura ciudadana para la confianza, la convivencia y la participación desde la vida cotidiana"},{"$f":"IF(ISERROR(VLOOKUP(K398,[2]Proposito_programa!$C$2:$E$59,3,FALSE)),\" \",VLOOKUP(K398,[2]Proposito_programa!$C$2:$E$59,3,FALSE))","v":"Propósito 3: Inspirar confianza y legitimidad para vivir sin miedo y ser epicentro de cultura ciudadana, paz y reconciliación"},1775,1,860011153,"POSITIVA COMPAÑIA DE SEGUROS SA","Persona Jurídica",null,null,null,6269400,null,0,0,6269400,2358500,null,null,null,null,0,0,null,null,null,null,null,null,"X",null,0.61]
[null,2021,null,null,"Otros gastos",null,null,"Por medio del cual se destina y ordena el gasto anticipado de los aportes al sistema general de riesgos laborales de acuerdo con lo establecido en el articulo 13 del Decreto 723 de 2013, se expide CDP según memorando 20215900001083 recibido para tramite de fecha Abril 23 de 2021.","Inversión","Un nuevo Contrato Social y ambiental para la Bogotá del Siglo XXI",49,{"$f":"IF(ISERROR(VLOOKUP(K399,[2]Proposito_programa!$C$2:$E$59,2,FALSE)),\" \",VLOOKUP(K399,[2]Proposito_programa!$C$2:$E$59,2,FALSE))","v":"Movilidad segura, sostenible y accesible"},{"$f":"IF(ISERROR(VLOOKUP(K399,[2]Proposito_programa!$C$2:$E$59,3,FALSE)),\" \",VLOOKUP(K399,[2]Proposito_programa!$C$2:$E$59,3,FALSE))","v":"Propósito 4: Hacer de Bogotá Región un modelo de movilidad multimodal, incluyente y sostenible"},1780,1,860011153,"POSITIVA COMPAÑIA DE SEGUROS SA","Persona Jurídica",null,null,null,829700,null,0,0,829700,770300,null,null,null,null,0,0,null,null,null,null,null,null,"X",null,0.93]
[null,2021,null,null,"Otros gastos",null,null,"Por medio de la cual se destina y ordena el gasto anticipado de los aportes al sistema general de riesgos laborales de acuerdo con lo establecido en el articulo 13 del Decreto 723 de 2013, Se expide mediante memorando 20215900000603 recibido para tramite de fecha Mar 12/2021.","Inversión","Un nuevo Contrato Social y ambiental para la Bogotá del Siglo XXI",57,{"$f":"IF(ISERROR(VLOOKUP(K400,[2]Proposito_programa!$C$2:$E$59,2,FALSE)),\" \",VLOOKUP(K400,[2]Proposito_programa!$C$2:$E$59,2,FALSE))","v":"Gestión pública local"},{"$f":"IF(ISERROR(VLOOKUP(K400,[2]Proposito_programa!$C$2:$E$59,3,FALSE)),\" \",VLOOKUP(K400,[2]Proposito_programa!$C$2:$E$59,3,FALSE))","v":"Propósito 5: Construir Bogotá - Región con gobierno abierto, transparente y ciudadanía consciente"},1783,0,860011153,"POSITIVA COMPAÑIA DE SEGUROS SA","Persona Jurídica",null,null,null,7135600,null,0,0,7135600,4037100,null,null,null,null,0,0,null,null,null,null,null,null,"X",null,0.59]
[null,2021,null,null,"Otros gastos",null,null,"Por medio de la cual se destina y ordena el gasto anticipado de los aportes al sistema general de riesgos laborales de acuerdo con lo establecido en el articulo 13 del Decreto 723 de 2013, Se expide mediante memorando 20215900000603 recibido para tramite de fecha Mar 12/2021.","Inversión","Un nuevo Contrato Social y ambiental para la Bogotá del Siglo XXI",57,{"$f":"IF(ISERROR(VLOOKUP(K401,[2]Proposito_programa!$C$2:$E$59,2,FALSE)),\" \",VLOOKUP(K401,[2]Proposito_programa!$C$2:$E$59,2,FALSE))","v":"Gestión pública local"},{"$f":"IF(ISERROR(VLOOKUP(K401,[2]Proposito_programa!$C$2:$E$59,3,FALSE)),\" \",VLOOKUP(K401,[2]Proposito_programa!$C$2:$E$59,3,FALSE))","v":"Propósito 5: Construir Bogotá - Región con gobierno abierto, transparente y ciudadanía consciente"},1784,0,860011153,"POSITIVA COMPAÑIA DE SEGUROS SA","Persona Jurídica",null,null,null,15814900,null,0,0,15814900,8899900,null,null,null,null,0,0,null,null,null,null,null,null,"X",null,0.59]
[null,2021,null,null,"Otros gastos",null,null,"Por medio de la cual se destina y ordena el gasto anticipado de los aportes al sistema general de riesgos laborales de acuerdo con lo establecido en el articulo 13 del Decreto 723 de 2013, Se expide mediante memorando 20215900000603 recibido para tramite de fecha Mar 12/2021.","Inversión","Un nuevo Contrato Social y ambiental para la Bogotá del Siglo XXI",48,{"$f":"IF(ISERROR(VLOOKUP(K402,[2]Proposito_programa!$C$2:$E$59,2,FALSE)),\" \",VLOOKUP(K402,[2]Proposito_programa!$C$2:$E$59,2,FALSE))","v":"Plataforma institucional para la seguridad y justicia"},{"$f":"IF(ISERROR(VLOOKUP(K402,[2]Proposito_programa!$C$2:$E$59,3,FALSE)),\" \",VLOOKUP(K402,[2]Proposito_programa!$C$2:$E$59,3,FALSE))","v":"Propósito 3: Inspirar confianza y legitimidad para vivir sin miedo y ser epicentro de cultura ciudadana, paz y reconciliación"},2007,0,860011153,"POSITIVA COMPAÑIA DE SEGUROS SA","Persona Jurídica",null,null,null,614300,null,0,0,614300,566100,null,null,null,null,0,0,null,null,null,null,null,null,"X",null,0.92]
[null,2021,null,null,"Otros gastos",null,null,"Por el cual se autoriza la trasferencia de recursos del Fondo de Desarrollo Local de Fontibón, con destino al Sistema Distrital Bogotá Solidaria a través de la Dirección Distrital de Tesorería - Secretaria de Hacienda Distrital, Se expide CDP con memorando 20215900000293 recibido para tramite de fecha Feb 09/2021.Se expide CRP atendiendo memorando 20215900000303 recibido para tramite de fecha Feb 10/2021.","Inversión","Un nuevo Contrato Social y ambiental para la Bogotá del Siglo XXI",1,{"$f":"IF(ISERROR(VLOOKUP(K403,[2]Proposito_programa!$C$2:$E$59,2,FALSE)),\" \",VLOOKUP(K403,[2]Proposito_programa!$C$2:$E$59,2,FALSE))","v":"Subsidios y transferencias para la equidad"},{"$f":"IF(ISERROR(VLOOKUP(K403,[2]Proposito_programa!$C$2:$E$59,3,FALSE)),\" \",VLOOKUP(K403,[2]Proposito_programa!$C$2:$E$59,3,FALSE))","v":"Propósito 1: Hacer un nuevo contrato social para incrementar la inclusión social, productiva y política"},1752,1,899999061,"FONDO DE DESARROLLO LOCAL DE FONTIBON","Persona Jurídica",null,null,null,3016320000,null,0,0,3016320000,{"$f":"Z403+W403+X403","v":3016320000},null,null,null,null,0,0,null,null,null,null,null,null,"X",null,1]
[null,2021,null,null,"Otros gastos",null,null,"HONORARIOS EDILES","Funcionamiento","HONORARIOS EDILES","No aplica",{"$f":"IF(ISERROR(VLOOKUP(K404,[2]Proposito_programa!$C$2:$E$59,2,FALSE)),\" \",VLOOKUP(K404,[2]Proposito_programa!$C$2:$E$59,2,FALSE))","v":" "},null,102,null,null,"HONORARIOS EDILES",null,null,null,null,825753594,null,0,0,825753594,756908922,"2021-02-01","2021-02-01","2021-12-31",null,0,0,null,null,null,null,null,null,"x",null,1]
[null,2021,null,null,"Otros gastos",null,null,"PAGO DE SERVICIOS PÚBLICOS - Acueducto y alcantarillado","Funcionamiento","Acueducto y alcantarillado","No aplica",{"$f":"IF(ISERROR(VLOOKUP(K405,[2]Proposito_programa!$C$2:$E$59,2,FALSE)),\" \",VLOOKUP(K405,[2]Proposito_programa!$C$2:$E$59,2,FALSE))","v":" "},null,102,null,null,"Acueducto y alcantarillado",null,null,null,null,53360000,null,0,0,53360000,25538187,"2021-02-01","2021-02-01","2021-12-31",null,0,0,null,null,null,null,null,null,"x",null,1]
[null,2021,null,null,"Otros gastos",null,null,"PAGO DE SERVICIOS PÚBLICOS - Energía","Funcionamiento","Energía","No aplica",{"$f":"IF(ISERROR(VLOOKUP(K406,[2]Proposito_programa!$C$2:$E$59,2,FALSE)),\" \",VLOOKUP(K406,[2]Proposito_programa!$C$2:$E$59,2,FALSE))","v":" "},null,101,null,null,"Energía",null,null,null,null,76424720,null,0,0,76424720,{"$f":"Z406+W406+X406","v":76424720},"2021-02-01","2021-02-01","2021-12-31",null,0,0,null,null,null,null,null,null,"x",null,1]
[null,2021,null,null,"Otros gastos",null,null,"PAGO DE SERVICIOS PÚBLICOS - Aseo","Funcionamiento","Aseo","No aplica",{"$f":"IF(ISERROR(VLOOKUP(K407,[2]Proposito_programa!$C$2:$E$59,2,FALSE)),\" \",VLOOKUP(K407,[2]Proposito_programa!$C$2:$E$59,2,FALSE))","v":" "},null,103,null,null,"Aseo",null,null,null,null,8999660,null,0,0,8999660,{"$f":"Z407+W407+X407","v":8999660},"2021-02-01","2021-02-01","2021-12-31",null,0,0,null,null,null,null,null,null,"x",null,1]
[null,2021,null,null,"Otros gastos",null,null,"PAGO DE SERVICIOS PÚBLICOS - Gas","Funcionamiento","Gas","No aplica",{"$f":"IF(ISERROR(VLOOKUP(K408,[2]Proposito_programa!$C$2:$E$59,2,FALSE)),\" \",VLOOKUP(K408,[2]Proposito_programa!$C$2:$E$59,2,FALSE))","v":" "},null,104,null,null,"Gas",null,null,null,null,1333490,null,0,0,1333490,{"$f":"Z408+W408+X408","v":1333490},"2021-02-01","2021-02-01","2021-12-31",null,0,0,null,null,null,null,null,null,"x",null,1]
[null,2021,null,null,"Otros gastos",null,null,"PAGO DE SERVICIOS PÚBLICOS - Servicios de telefonía fija","Funcionamiento","Servicios de telefonía fija","No aplica",{"$f":"IF(ISERROR(VLOOKUP(K409,[2]Proposito_programa!$C$2:$E$59,2,FALSE)),\" \",VLOOKUP(K409,[2]Proposito_programa!$C$2:$E$59,2,FALSE))","v":" "},null,401,null,null,"Servicios de telefonía fija",null,null,null,null,15558770,null,0,0,15558770,{"$f":"Z409+W409+X409","v":15558770},"2021-02-01","2021-02-01","2021-12-31",null,0,0,null,null,null,null,null,null,"x",null,1]
[null,2021,null,null,"Otros gastos",null,null,"SERVICIOS DE SEGUROS DE SALUD EDILES","Funcionamiento","Servicios de seguros de Salud ediles","No aplica",{"$f":"IF(ISERROR(VLOOKUP(K410,[2]Proposito_programa!$C$2:$E$59,2,FALSE)),\" \",VLOOKUP(K410,[2]Proposito_programa!$C$2:$E$59,2,FALSE))","v":" "},null,106,null,null,"Servicios de seguros de Salud ediles",null,null,null,null,103223600,null,0,0,103223600,94617800,"2021-02-01","2021-02-01","2021-12-31",null,0,0,null,null,null,null,null,null,"x",null,1]
[229,2020,"FDLF-IPMC-13-2020","https://community.secop.gov.co/Public/Tendering/OpportunityDetail/Index?noticeUID=CO1.NTC.1575357&isFromPublicArea=True&isModal=False","Suministro","Contratación mínima cuantia",null,"ADICION CPS 229-2020 CUYO OBJETO ES SUMINISTRO DE LOS ELEMENTOS DE FERRETERÍA NECESARIOS PARA REALIZAR EL MANTENIMIENTO, REPARACIONES O MEJORAS DE TIPO LOCATIVO DE LOS BIENES INMUEBLES Y MUEBLES A CARGO DEL FONDO DE DESARROLLO LOCAL DE FONTIBÓN","Funcionamiento","Productos metálicos elaborados (excepto maquinaria y equipo)","No aplica",{"$f":"IF(ISERROR(VLOOKUP(K411,[2]Proposito_programa!$C$2:$E$59,2,FALSE)),\" \",VLOOKUP(K411,[2]Proposito_programa!$C$2:$E$59,2,FALSE))","v":" "},{"$f":"IF(ISERROR(VLOOKUP(K411,[2]Proposito_programa!$C$2:$E$59,3,FALSE)),\" \",VLOOKUP(K411,[2]Proposito_programa!$C$2:$E$59,3,FALSE))","v":" "},302,2,900960810,"DIEGO CASTRO INDUSTRIA Y CONSTRUCCION S A S","Persona Jurídica","-","-",null,12250000,null,0,0,12250000,null,"2021-02-01","2021-02-01","2021-12-31",null,0,0,null,null,null,null,null,null,"x",null,1]
[177,2020,"FDLF-LP-007-2020","https://community.secop.gov.co/Public/Tendering/OpportunityDetail/Index?noticeUID=CO1.NTC.1437921&isFromPublicArea=True&isModal=False","Contratos de prestación de servicios","Licitación pública",null,"ADICION CPS 177-2020 CUYO OBJETO ES PRESTAR EL SERVICIO DE VIGILANCIA Y SEGURIDAD PRIVADA LAS 24 HORAS Y LOS 7 DIAS DE LA SEMANA, CON APOYO TÉCNOLOGICO PARA LOS PREDIOS DE PROPIEDAD Y/ O TENENCIA QUE SE ENCUENTREN A NOMBRE DEL FONDO DE DESARROLLO LOCAL DE FONTIBÓN, ASÍ COMO VELAR POR LA SEGURIDAD DE LAS PERSONAS Y LA CUSTODIA DE LOS BIENES MUEBLES Y ENSERES QUE SE ENCUENTREN DENTRO DE DICHOS PREDIOS","Funcionamiento","Servicios de protección (guardas de seguridad)","No aplica",{"$f":"IF(ISERROR(VLOOKUP(K412,[2]Proposito_programa!$C$2:$E$59,2,FALSE)),\" \",VLOOKUP(K412,[2]Proposito_programa!$C$2:$E$59,2,FALSE))","v":" "},{"$f":"IF(ISERROR(VLOOKUP(K412,[2]Proposito_programa!$C$2:$E$59,3,FALSE)),\" \",VLOOKUP(K412,[2]Proposito_programa!$C$2:$E$59,3,FALSE))","v":" "},501,36,"901.419.268-5","UNION TEMPORAL SEGURIDAD 2020","Persona Jurídica","-","-",null,344214430,null,0,0,344214430,243252769,"2021-02-01","2021-02-01","2021-12-31",null,0,0,null,null,null,null,null,null,"x",null,1]
[141,2020,"FDLF-CD-141-2020","https://community.secop.gov.co/Public/Tendering/OpportunityDetail/Index?noticeUID=CO1.NTC.1404376&isFromPublicArea=True&isModal=False","Arrendamiento de bienes inmuebles","Contratación directa","Prestación de servicios profesionales y de apoyo a la gestión, o para la ejecución de trabajos artísticos que sólo puedan encomendarse a determinadas personas naturales;","ADICION CPS 141-2020 CUYO OBJETO ES ARRENDAMIENTO BODEGA Y PARQUEADERO PARA LOS DIFERENTES ELEMENTOS Y VEHICULOS, MAQUINARIA PESADA DEL FONDO DE DESARROLLO LOCAL DE FONTIBON.","Funcionamiento","Servicios de alquiler o arrendamiento con o sin opción de compra relativos a bienes inmuebles no residenciales propios o arrendados","No aplica",{"$f":"IF(ISERROR(VLOOKUP(K413,[2]Proposito_programa!$C$2:$E$59,2,FALSE)),\" \",VLOOKUP(K413,[2]Proposito_programa!$C$2:$E$59,2,FALSE))","v":" "},{"$f":"IF(ISERROR(VLOOKUP(K413,[2]Proposito_programa!$C$2:$E$59,3,FALSE)),\" \",VLOOKUP(K413,[2]Proposito_programa!$C$2:$E$59,3,FALSE))","v":" "},201,1,900200519,"INVERSIONES CAOVA SAS","Persona Jurídica","-","-",null,28350000,null,0,0,28350000,{"$f":"Z413+W413+X413","v":28350000},"2021-02-01","2021-02-01","2021-12-31",null,0,0,null,null,null,null,null,null,"x",null,1]
[43175,2019,"OC-43175","https://colombiacompra.gov.co/tienda-virtual-del-estado-colombiano/ordenes-compra/43175","Suministro","Contratación directa","Cuando no exista pluralidad de oferentes en el mercado","ADICION OC-43175 CUYO OBJETO ES Suministro de combustible por medio de chip electrónico para el parque automotor de la Alcaldía Local de Fontibón, acorde a lo estipulado en la cláusula 2 del Acuerdo Marco de Precios para el suministro de combustible","Funcionamiento","Productos de hornos de coque, de refinación de petróleo y combustible","No aplica",{"$f":"IF(ISERROR(VLOOKUP(K414,[2]Proposito_programa!$C$2:$E$59,2,FALSE)),\" \",VLOOKUP(K414,[2]Proposito_programa!$C$2:$E$59,2,FALSE))","v":" "},{"$f":"IF(ISERROR(VLOOKUP(K414,[2]Proposito_programa!$C$2:$E$59,3,FALSE)),\" \",VLOOKUP(K414,[2]Proposito_programa!$C$2:$E$59,3,FALSE))","v":" "},203,1,null,"Organización Terpel S.A.\n","Persona Jurídica","-","-",null,4000000,null,0,0,4000000,1023020,"2021-02-01","2021-02-01","2021-12-31",null,0,0,null,null,null,null,null,null,"x",null,1]
[160,2020,"FDLF-SAMC-6-2020","https://community.secop.gov.co/Public/Tendering/OpportunityDetail/Index?noticeUID=CO1.NTC.1428320&isFromPublicArea=True&isModal=False","Contrato de seguros","Selección abreviada",null,"ADICION CPS 160-2020 CUYO OBJETO ES CONTRATAR LOS SEGUROS QUE AMPAREN LOS INTERESES PATRIMONIALES, SÍ COMO LOS BIENES QUE ESTÉN BAJO SU RESPONSABILIDAD, CUSTODIA, CUIDAD Y CONTROL, O POR LOS QUE PUEDA SER LEGALMENTE RESPONSABLE DEL FONDO DE DESARROLLO LOCAL DE FONTIBON, ASÍ COMO LA EXPEDICIÓN DE CUALQUIER OTRA POLIZA DE SEGUROS QUE REQUIERA LA ENTIDAD EN EL DESARROLLO DE SU ACTIVIDAD","Funcionamiento","Servicios de seguros de vehículos automotores","No aplica",{"$f":"IF(ISERROR(VLOOKUP(K415,[2]Proposito_programa!$C$2:$E$59,2,FALSE)),\" \",VLOOKUP(K415,[2]Proposito_programa!$C$2:$E$59,2,FALSE))","v":" "},{"$f":"IF(ISERROR(VLOOKUP(K415,[2]Proposito_programa!$C$2:$E$59,3,FALSE)),\" \",VLOOKUP(K415,[2]Proposito_programa!$C$2:$E$59,3,FALSE))","v":" "},107,1,860002400,"LA PREVISORA S.A. COMPAÑÍA DE SEGUROS","Persona Jurídica","-","-",null,5050671,null,0,0,5050671,{"$f":"Z415+W415+X415","v":5050671},"2021-02-01","2021-02-01","2021-12-31",null,0,0,null,null,null,null,null,null,"x",null,1]
[160,2020,"FDLF-SAMC-6-2020","https://community.secop.gov.co/Public/Tendering/OpportunityDetail/Index?noticeUID=CO1.NTC.1428320&isFromPublicArea=True&isModal=False","Contrato de seguros","Selección abreviada",null,"ADICION CPS 160-2020 CUYO OBJETO ES CONTRATAR LOS SEGUROS QUE AMPAREN LOS INTERESES PATRIMONIALES, SÍ COMO LOS BIENES QUE ESTÉN BAJO SU RESPONSABILIDAD, CUSTODIA, CUIDAD Y CONTROL, O POR LOS QUE PUEDA SER LEGALMENTE RESPONSABLE DEL FONDO DE DESARROLLO LOCAL DE FONTIBON, ASÍ COMO LA EXPEDICIÓN DE CUALQUIER OTRA POLIZA DE SEGUROS QUE REQUIERA LA ENTIDAD EN EL DESARROLLO DE SU ACTIVIDAD","Funcionamiento","Servicios de seguros contra incendio, terremoto o sustracción","No aplica",{"$f":"IF(ISERROR(VLOOKUP(K416,[2]Proposito_programa!$C$2:$E$59,2,FALSE)),\" \",VLOOKUP(K416,[2]Proposito_programa!$C$2:$E$59,2,FALSE))","v":" "},{"$f":"IF(ISERROR(VLOOKUP(K416,[2]Proposito_programa!$C$2:$E$59,3,FALSE)),\" \",VLOOKUP(K416,[2]Proposito_programa!$C$2:$E$59,3,FALSE))","v":" "},108,1,860002400,"LA PREVISORA S.A. COMPAÑÍA DE SEGUROS","Persona Jurídica",null,null,null,37441898,null,0,0,37441898,{"$f":"(Z416+W416+X416)-184351","v":37257547},"2021-02-01","2021-02-01","2021-12-31",null,0,0,null,null,null,null,null,null,"x",null,1]
[160,2020,"FDLF-SAMC-6-2020","https://community.secop.gov.co/Public/Tendering/OpportunityDetail/Index?noticeUID=CO1.NTC.1428320&isFromPublicArea=True&isModal=False","Contrato de seguros","Selección abreviada",null,"ADICION CPS 160-2020 CUYO OBJETO ES CONTRATAR LOS SEGUROS QUE AMPAREN LOS INTERESES PATRIMONIALES, SÍ COMO LOS BIENES QUE ESTÉN BAJO SU RESPONSABILIDAD, CUSTODIA, CUIDAD Y CONTROL, O POR LOS QUE PUEDA SER LEGALMENTE RESPONSABLE DEL FONDO DE DESARROLLO LOCAL DE FONTIBON, ASÍ COMO LA EXPEDICIÓN DE CUALQUIER OTRA POLIZA DE SEGUROS QUE REQUIERA LA ENTIDAD EN EL DESARROLLO DE SU ACTIVIDAD","Funcionamiento","Servicios de seguros generales de responsabilidad civil","No aplica",{"$f":"IF(ISERROR(VLOOKUP(K417,[2]Proposito_programa!$C$2:$E$59,2,FALSE)),\" \",VLOOKUP(K417,[2]Proposito_programa!$C$2:$E$59,2,FALSE))","v":" "},{"$f":"IF(ISERROR(VLOOKUP(K417,[2]Proposito_programa!$C$2:$E$59,3,FALSE)),\" \",VLOOKUP(K417,[2]Proposito_programa!$C$2:$E$59,3,FALSE))","v":" "},109,1,860002400,"LA PREVISORA S.A. COMPAÑÍA DE SEGUROS","Persona Jurídica",null,null,null,3834082,null,0,0,3834082,{"$f":"Z417+W417+X417","v":3834082},"2021-02-01","2021-02-01","2021-12-31",null,0,0,null,null,null,null,null,null,"x",null,1]
[160,2020,"FDLF-SAMC-6-2020","https://community.secop.gov.co/Public/Tendering/OpportunityDetail/Index?noticeUID=CO1.NTC.1428320&isFromPublicArea=True&isModal=False","Contrato de seguros","Selección abreviada",null,"ADICION CPS 160-2020 CUYO OBJETO ES CONTRATAR LOS SEGUROS QUE AMPAREN LOS INTERESES PATRIMONIALES, SÍ COMO LOS BIENES QUE ESTÉN BAJO SU RESPONSABILIDAD, CUSTODIA, CUIDAD Y CONTROL, O POR LOS QUE PUEDA SER LEGALMENTE RESPONSABLE DEL FONDO DE DESARROLLO LOCAL DE FONTIBON, ASÍ COMO LA EXPEDICIÓN DE CUALQUIER OTRA POLIZA DE SEGUROS QUE REQUIERA LA ENTIDAD EN EL DESARROLLO DE SU ACTIVIDAD","Funcionamiento","Servicios de seguro obligatorio de accidentes de tránsito (SOAT)","No aplica",{"$f":"IF(ISERROR(VLOOKUP(K418,[2]Proposito_programa!$C$2:$E$59,2,FALSE)),\" \",VLOOKUP(K418,[2]Proposito_programa!$C$2:$E$59,2,FALSE))","v":" "},{"$f":"IF(ISERROR(VLOOKUP(K418,[2]Proposito_programa!$C$2:$E$59,3,FALSE)),\" \",VLOOKUP(K418,[2]Proposito_programa!$C$2:$E$59,3,FALSE))","v":" "},110,1,860002400,"LA PREVISORA S.A. COMPAÑÍA DE SEGUROS","Persona Jurídica",null,null,null,4939350,null,0,0,4939350,{"$f":"Z418+W418+X418","v":4939350},"2021-02-01","2021-02-01","2021-12-31",null,0,0,null,null,null,null,null,null,"x",null,1]
[160,2020,"FDLF-SAMC-6-2020","https://community.secop.gov.co/Public/Tendering/OpportunityDetail/Index?noticeUID=CO1.NTC.1428320&isFromPublicArea=True&isModal=False","Contrato de seguros","Selección abreviada",null,"ADICION CPS 160-2020 CUYO OBJETO ES CONTRATAR LOS SEGUROS QUE AMPAREN LOS INTERESES PATRIMONIALES, SÍ COMO LOS BIENES QUE ESTÉN BAJO SU RESPONSABILIDAD, CUSTODIA, CUIDAD Y CONTROL, O POR LOS QUE PUEDA SER LEGALMENTE RESPONSABLE DEL FONDO DE DESARROLLO LOCAL DE FONTIBON, ASÍ COMO LA EXPEDICIÓN DE CUALQUIER OTRA POLIZA DE SEGUROS QUE REQUIERA LA ENTIDAD EN EL DESARROLLO DE SU ACTIVIDAD","Funcionamiento","Otros servicios de seguros distintos de los seguros de vida n.c.p.","No aplica",{"$f":"IF(ISERROR(VLOOKUP(K419,[2]Proposito_programa!$C$2:$E$59,2,FALSE)),\" \",VLOOKUP(K419,[2]Proposito_programa!$C$2:$E$59,2,FALSE))","v":" "},{"$f":"IF(ISERROR(VLOOKUP(K419,[2]Proposito_programa!$C$2:$E$59,3,FALSE)),\" \",VLOOKUP(K419,[2]Proposito_programa!$C$2:$E$59,3,FALSE))","v":" "},112,1,860002400,"LA PREVISORA S.A. COMPAÑÍA DE SEGUROS","Persona Jurídica",null,null,null,3253493,null,0,0,3253493,{"$f":"Z419+W419+X419","v":3253493},"2021-02-01","2021-02-01","2021-12-31",null,0,0,null,null,null,null,null,null,"x",null,1]
[null,2021,null,null,"Otros gastos",null,null,"Obligaciones por Pagar Vigencia Anterior","Funcionamiento",null,"No aplica",{"$f":"IF(ISERROR(VLOOKUP(K420,[2]Proposito_programa!$C$2:$E$59,2,FALSE)),\" \",VLOOKUP(K420,[2]Proposito_programa!$C$2:$E$59,2,FALSE))","v":" "},null,"13-10-89-001",null,null,",",null,null,null,null,1026410620,null,0,0,1026410620,947360710,"2021-02-01","2021-02-01","2021-12-31",null,0,0,null,null,null,null,null,null,"x",null,1]
[null,2021,null,null,"Otros gastos",null,null,"Obligaciones por Pagar Otras Vigencias","Funcionamiento",null,"No aplica",{"$f":"IF(ISERROR(VLOOKUP(K421,[2]Proposito_programa!$C$2:$E$59,2,FALSE)),\" \",VLOOKUP(K421,[2]Proposito_programa!$C$2:$E$59,2,FALSE))","v":" "},null,"13-10-89-002 ",null,null,",",null,null,null,null,295760545,null,0,0,295760545,119542626,"2021-02-01","2021-02-01","2021-12-31",null,0,0,null,null,null,null,null,null,"x",null,1]
[null,2021,null,null,"Otros gastos",null,null,"Por el cual se autoriza la trasferencia de recursos del Fondo de Desarrollo Local de Fontibón, con destino al Sistema Distrital Bogotá Solidaria a través de la Dirección Distrital de Tesorería - Secretaria de Hacienda Distrital, Se expide CDP con memorando 20215900000293 recibido para tramite de fecha Feb 09/2021.Se expide CRP atendiendo memorando 20215900000303 recibido para tramite de fecha Feb 10/2021.","Inversión","Un nuevo Contrato Social y ambiental para la Bogotá del Siglo XXI",1,{"$f":"IF(ISERROR(VLOOKUP(K422,[2]Proposito_programa!$C$2:$E$59,2,FALSE)),\" \",VLOOKUP(K422,[2]Proposito_programa!$C$2:$E$59,2,FALSE))","v":"Subsidios y transferencias para la equidad"},{"$f":"IF(ISERROR(VLOOKUP(K422,[2]Proposito_programa!$C$2:$E$59,3,FALSE)),\" \",VLOOKUP(K422,[2]Proposito_programa!$C$2:$E$59,3,FALSE))","v":"Propósito 1: Hacer un nuevo contrato social para incrementar la inclusión social, productiva y política"},1752,1,899999061,"FONDO DE DESARROLLO LOCAL DE FONTIBON","Persona Jurídica",null,null,null,657157980,null,0,0,657157980,{"$f":"Z422+W422+X422","v":657157980},null,null,null,null,0,0,null,null,null,null,null,null,"X",null,1]
[null,2021,null,null,"Otros gastos",null,null,"Por el cual se autoriza la trasferencia de recursos del Fondo de Desarrollo Local de Fontibón, con destino al Sistema Distrital Bogotá Solidaria a través de la Dirección Distrital de Tesorería - Secretaria de Hacienda Distrital, Se expide CDP con memorando 20215900000293 recibido para tramite de fecha Feb 09/2021.Se expide CRP atendiendo memorando 20215900000303 recibido para tramite de fecha Feb 10/2021.","Inversión","Un nuevo Contrato Social y ambiental para la Bogotá del Siglo XXI",1,{"$f":"IF(ISERROR(VLOOKUP(K423,[2]Proposito_programa!$C$2:$E$59,2,FALSE)),\" \",VLOOKUP(K423,[2]Proposito_programa!$C$2:$E$59,2,FALSE))","v":"Subsidios y transferencias para la equidad"},{"$f":"IF(ISERROR(VLOOKUP(K423,[2]Proposito_programa!$C$2:$E$59,3,FALSE)),\" \",VLOOKUP(K423,[2]Proposito_programa!$C$2:$E$59,3,FALSE))","v":"Propósito 1: Hacer un nuevo contrato social para incrementar la inclusión social, productiva y política"},1752,1,899999061,"FONDO DE DESARROLLO LOCAL DE FONTIBON","Persona Jurídica",null,null,null,291247670,null,0,0,291247670,{"$f":"Z423+W423+X423","v":291247670},null,null,null,null,0,0,null,null,null,null,null,null,"X",null,1]
["Total",null,null,null,null,null,null,null,null,null,null,null,null,null,null,null,null,null,null,null,null,{"$f":"SUM(V14:V423)","v":31261540720},{"$f":"SUM(W14:W390)","v":0},0,0,{"$f":"SUM(Z14:Z423)","v":32119942665},{"$f":"SUM(AA14:AA423)","v":17603512337},"2021-02-01","2021-02-01","2021-12-31",null,0,0,null,null,null,null,null,null,"x",null,1]
[]
[null,null,null,null,null,null,null,null,null,null,null,null,null,null,null,null,null,null,null,null,null,null,null,null,null,{"$f":"SUBTOTAL(9,Z14:Z423)","v":32119942665},{"$f":"SUBTOTAL(9,AA14:AA423)","v":17603512337}]

{"sheet":"BOG-DATA","index":2,"n_rows":159,"n_cols":8,"rows_kept":159,"cut":false,"hidden":false,"merged":[[117,4,117,5],[117,6,117,7],[119,4,119,5],[119,6,119,7],[111,4,111,5],[111,6,111,7],[113,4,113,5],[113,6,113,7],[115,4,115,5],[115,6,115,7],[105,4,105,5],[105,6,105,7],[107,4,107,5],[107,6,107,7],[109,4,109,5],[109,6,109,7],[99,4,99,5],[99,6,99,7],[101,4,101,5],[101,6,101,7],[103,4,103,5],[103,6,103,7],[93,4,93,5],[93,6,93,7],[95,4,95,5],[95,6,95,7],[97,4,97,5],[97,6,97,7],[87,4,87,5],[87,6,87,7],[89,4,89,5],[89,6,89,7],[91,4,91,5],[91,6,91,7],[81,4,81,5],[81,6,81,7],[83,4,83,5],[83,6,83,7],[85,4,85,5],[85,6,85,7],[75,4,75,5],[75,6,75,7],[77,4,77,5],[77,6,77,7],[79,4,79,5],[79,6,79,7],[69,4,69,5],[69,6,69,7],[71,4,71,5],[71,6,71,7],[73,4,73,5],[73,6,73,7],[63,4,63,5],[63,6,63,7],[65,4,65,5],[65,6,65,7],[67,4,67,5],[67,6,67,7],[57,4,57,5],[57,6,57,7],[59,4,59,5],[59,6,59,7],[61,4,61,5],[61,6,61,7],[51,4,51,5],[51,6,51,7],[53,4,53,5],[53,6,53,7],[55,4,55,5],[55,6,55,7],[45,4,45,5],[45,6,45,7],[47,4,47,5],[47,6,47,7],[49,4,49,5],[49,6,49,7],[39,4,39,5],[39,6,39,7],[41,4,41,5],[41,6,41,7],[43,4,43,5],[43,6,43,7],[33,4,33,5],[33,6,33,7],[35,4,35,5],[35,6,35,7],[37,4,37,5],[37,6,37,7],[27,4,27,5],[27,6,27,7],[29,4,29,5],[29,6,29,7],[31,4,31,5],[31,6,31,7],[21,4,21,5],[21,6,21,7],[23,4,23,5],[23,6,23,7],[25,4,25,5],[25,6,25,7],[15,4,15,5],[15,6,15,7],[17,4,17,5],[17,6,17,7],[19,4,19,5],[19,6,19,7],[9,4,9,5],[9,6,9,7],[11,4,11,5],[11,6,11,7],[13,4,13,5],[13,6,13,7],[0,3,0,7],[3,4,3,5],[3,6,3,7],[5,4,5,5],[5,6,5,7],[7,4,7,5],[7,6,7,7]]}
[null,null,null,"INFORME BOG DATA VS INFORME ENVIADO POR ALCALDIA LOCAL DE FONTIBON"]
[null,null,null,9,"VALOR FINAL BOGDATA","VALOR FINAL INFORMADOS","ACUMULADO GIROS BOG DATA","GIROS INFORMADOS"]
[null,null,null,"FUNCIONAMIENTO",4628488866,4628488866,2601357609,2601357609]
[null,null,null,"DIFERENCIAS",{"$f":"F3-E3","v":0},null,{"$f":"H3-G3","v":0}]
[null,null,null,"INVERSION",27491453799,27491453799,15002154728,15002154728]
[null,null,null,"DIFERENCIAS",{"$f":"F5-E5","v":0},null,{"$f":"H5-G5","v":0}]
[null,null,null,"PROPÓSITO 01:Hacer un nuevo contrato social con igualdad de oportunidades para la inclusión social, productiva y política",15812870960,15154028464,10440233506,9459382952]
[null,null,null,"DIFERENCIAS",{"$f":"F7-E7","v":-658842496},null,{"$f":"H7-G7","v":-980850554}]
[null,null,null,"PROGRAMA 01:Subsidios y transferencias para la equidad",5700483318,4752077668,5525421572,4648438]
[null,null,"NO corre la formula en 422 y 423","DIFERENCIAS",{"$f":"F9-E9","v":-948405650},null,{"$f":"H9-G9","v":-5520773134}]
[null,null,null,1752,5700483318,5700483318,5525421572,5596844165]
[null,null,null,"DIFERENCIAS",{"$f":"F11-E11","v":0},null,{"$f":"H11-G11","v":71422593}]
[null,null,null,"PROGRAMA 6:Sistema Distrital del Cuidado",3385753951,4777601000,1468589006,2106733034]
[null,null,null,"DIFERENCIAS",{"$f":"F13-E13","v":1391847049},null,{"$f":"H13-G13","v":638144028}]
[null,null,null,1761,1555190194,2606923821,1278265273,1916409301]
[null,null,null,"DIFERENCIAS",{"$f":"F15-E15","v":1051733627},null,{"$f":"H15-G15","v":638144028}]
[null,null,null,1762,712799657,712799657,108062800,108062800]
[null,null,null,"DIFERENCIAS",{"$f":"F17-E17","v":0},null,{"$f":"H17-G17","v":0}]
[null,null,null,1763,210492000,210492000,0,0]
[null,null,null,"DIFERENCIAS",{"$f":"F19-E19","v":0},null,{"$f":"H19-G19","v":0}]
[null,null,null,1764,907272100,907272100,82260933,82260933]
[null,null,null,"DIFERENCIAS ",{"$f":"F21-E21","v":0},null,{"$f":"H21-G21","v":0}]
[null,null,null,"Programa 8: Prevención y atención de maternidad temprana",203417000,24985000,20487700,20487700]
[null,null,null,"DIFERENCIAS",{"$f":"F23-E23","v":-178432000},null,0]
[null,null,null,1765,203417000,203417000,20487700,20487700]
[null,null,null,"DIFERENCIAS ",{"$f":"F25-E25","v":0},null,{"$f":"H25-G25","v":0}]
[null,null,null,"Programa 12: Educación inicial: Bases sólidas para la vida",813052403,813052403,21197400,21197400]
[null,null,null,"DIFERENCIAS",{"$f":"F27-E27","v":0},null,0]
[null,null,null,1753,813052403,813052403,21197400,21197400]
[null,null,null,"DIFERENCIAS ",{"$f":"F29-E29","v":0},null,{"$f":"H29-G29","v":0}]
[null,null,null,"Programa 14: Formación integral: mas y mejor tiempo en los colegios",315273000,315273000,0,0]
[null,null,null,"DIFERENCIAS",{"$f":"F31-E31","v":0},null,{"$f":"H31-G31","v":0}]
[null,null,null,1754,315273000,315273000,0,0]
[null,null,null,"DIFERENCIAS ",{"$f":"F33-E33","v":0},null,{"$f":"H33-G33","v":0}]
[null,null,null,"Programa 17: Jóvenes con capacidades: Proyecto de vida para la ciudadanía, la innovación y el trabajo del siglo XXI",1897145451,1897145451,1875860418,1875860418]
[null,null,null,"DIFERENCIAS ",{"$f":"F35-E35","v":0},null,{"$f":"H35-G35","v":0}]
[null,null,null,1755,1897145451,1897145451,1875860418,1875860418]
[null,null,null,"DIFERENCIAS ",{"$f":"F37-E37","v":0},null,{"$f":"H37-G37","v":0}]
[null,null,null,"Programa 20: Bogotá, referente en cultura, deporte, recreación y actividad física, con parques para el desarrollo y la salud",1110002850,1110002850,651015076,660268551]
[null,null,null,"DIFERENCIAS ",{"$f":"F39-E39","v":0},null,{"$f":"H39-G39","v":9253475}]
[null,null,null,1757,1110002850,1110002850,651015076,660268551]
[null,null,null,"DIFERENCIAS",{"$f":"F41-E41","v":0},null,{"$f":"H41-G41","v":9253475}]
[null,null,null,"Programa 21: Creación y vida cotidiana: Apropiación ciudadana del arte, la cultura y el patrimonio, para la democracia cultural",1838252655,979069559,641599667,94416667]
[null,null,null,"DIFERENCIAS ",{"$f":"F43-E43","v":-859183096},null,{"$f":"H43-G43","v":-547183000}]
[null,null,null,1758,1838252655,1054312989,641599667,94416667]
[null,null,null,"DIFERENCIAS",{"$f":"F45-E45","v":-783939666},null,{"$f":"H45-G45","v":-547183000}]
[null,null,null,"Programa 24: Bogotá región emprendedora e innovadora",549490332,484821533,236062667,31980667]
[null,null,null,"DIFERENCIAS ",{"$f":"F47-E47","v":-64668799},null,{"$f":"H47-G47","v":-204082000}]
[null,null,null,1759,345408332,345408332,31980667,31980667]
[null,null,null,"DIFERENCIAS ",{"$f":"F49-E49","v":0},null,{"$f":"H49-G49","v":0}]
[null,null,null,1760,204082000,204082000,204082000,0]
[null,null,null,"DIFERENCIAS ",{"$f":"F51-E51","v":0},null,{"$f":"H51-G51","v":-204082000}]
[null,null,null,"PROPÓSITO 02:Cambiar nuestros hábitos de vida para reverdecer a Bogotá y adaptarnos y mitigar la crisis climática",2818957772,2458464571,211962034,211962034]
[null,null,null,"DIFERENCIAS ",{"$f":"F53-E53","v":-360493201},null,{"$f":"H53-G53","v":0}]
[null,null,null,"PROGRAMA 27:Cambio cultural para la gestión de la crisis climática",853549474,853549474,38833333,38833333]
[null,null,null,"DIFERENCIAS ",{"$f":"F55-E55","v":0},null,{"$f":"H55-G55","v":0}]
[null,null,null,1766,853549474,853549474,38833333,38833333]
[null,null,null,"DIFERENCIAS",{"$f":"F57-E57","v":0},null,{"$f":"H57-G57","v":0}]
[null,null,null,"PROGRAMA 28: Bogotá protectora de sus recursos naturales",221080000,221080000,0,0]
[null,null,null,"DIFERENCIAS ",{"$f":"F59-E59","v":0},null,{"$f":"H59-G59","v":0}]
[null,null,null,1767,221080000,221080000,0,0]
[null,null,null,"DIFERENCIAS ",{"$f":"F61-E61","v":0},null,{"$f":"H61-G61","v":0}]
[null,null,null,"PROGRAMA 30:Eficiencia en la atención de emergencias",206158082,206158082,44893333,44893333]
[null,null,null,"DIFERENCIAS ",{"$f":"F63-E63","v":0},null,{"$f":"H63-G63","v":0}]
[null,null,null,1768,206158082,206158082,44893333,44893333]
[null,null,null,"DIFERENCIAS ",{"$f":"F65-E65","v":0},null,{"$f":"H65-G65","v":0}]
[null,null,null,"PROGRAMA 33:Más árboles y más y mejor espacio público",994599353,855186152,118241368,118241368]
[null,null,null,"DIFERENCIAS ",{"$f":"F67-E67","v":-139413201},null,0]
[null,null,null,1769,239961934,239961934,71354401,71354401]
[null,null,null,"DIFERENCIAS ",{"$f":"F69-E69","v":0},null,{"$f":"H69-G69","v":0}]
[null,null,null,1770,754637419,754637419,46886967,46886967]
[null,null,null,"DIFERENCIAS ",{"$f":"F71-E71","v":0},null,{"$f":"H71-G71","v":0}]
[null,null,null,"PROGRAMA 34:Bogotá protectora de los animales",216328633,216328633,0,0]
[null,null,null,"DIFERENCIAS ",{"$f":"F73-E73","v":0},null,{"$f":"H73-G73","v":0}]
[null,null,null,1771,216328633,216328633,0,0]
[null,null,null,"DIFERENCIAS ",{"$f":"F75-E75","v":0},null,{"$f":"H75-G75","v":0}]
[null,null,null,"PROGRAMA 38:Ecoeficiencia, reciclaje, manejo de residuos e inclusión de la población recicladora",327242230,327242230,9994000,9994000]
[null,null,null,"DIFERENCIAS ",{"$f":"+E77-F77","v":0},null,{"$f":"+G77-H77","v":0}]
[null,null,null,1772,327242230,327242230,9994000,9994000]
[null,null,null,"DIFERENCIAS ",{"$f":"+E79-F79","v":0},null,{"$f":"+G79-H79","v":0}]
[null,null,null,"PROPÓSITO 03:Inspirar confianza y legitimidad para vivir sin miedo y ser epicentro de cultura ciudadana, paz y reconciliación",1694633563,"NO HAY REPORTE DE ESTE PROGRAMA",350681137,"NO HAY REPORTE DE ESTE PROGRAMA"]
[null,null,null,"DIFERENCIAS ",{"$f":"F81-E81","v":{"$error":"#VALUE!"}},null,{"$f":"H81-G81","v":{"$error":"#VALUE!"}}]
[null,null,null,"PROGRAMA 39:Bogotá territorio de paz y atención integral a las víctimas del conflicto armado",323989871,"NO HAY REPORTE DE ESTE PROGRAMA",18376633,"NO HAY REPORTE DE ESTE PROGRAMA"]
[null,null,null,"DIFERENCIAS ",{"$f":"F83-E83","v":{"$error":"#VALUE!"}},null,{"$f":"H83-G83","v":{"$error":"#VALUE!"}}]
[null,null,null,1773,323989871,323989871,18376633,18376633]
[null,null,null,"DIFERENCIAS ",{"$f":"F85-E85","v":0},null,{"$f":"H85-G85","v":0}]
[null,null,null,"PROGRAMA 40:Más mujeres viven una vida libre de violencias, se sienten seguras y acceden con confianza al sistema de justicia",381933999,322222038,76571813,322222038]
[null,null,null,"DIFERENCIAS ",{"$f":"F87-E87","v":-59711961},null,{"$f":"H87-G87","v":245650225}]
[null,null,null,1774,381933999,322222038,76571813,322222038]
[null,null,null,"DIFERENCIAS ",{"$f":"F89-E89","v":-59711961},null,{"$f":"H89-G89","v":245650225}]
[null,null,null,"PROGRAMA 43: Cultura ciudadana para la confianza, la convivencia y la participación desde la vida cotidiana",409490018,409490018,191626591,191626591]
[null,null,null,"DIFERENCIAS ",{"$f":"F91-E91","v":0},null,{"$f":"H91-G91","v":0}]
[null,null,null,1775,409490018,409490018,191626591,191626591]
[null,null,null,"DIFERENCIAS ",{"$f":"F93-E93","v":0},null,{"$f":"H93-G93","v":0}]
[null,null,null,"PROGRAMA 45:Espacio público más seguro y construido colectivamente",438170008,438170008,5880000,5880000]
[null,null,null,"DIFERENCIAS ",{"$f":"F95-E95","v":0},null,{"$f":"H95-G95","v":0}]
[null,null,null,1776,438170008,438170008,5880000,5880000]
[null,null,null,"DIFERENCIAS ",{"$f":"F97-E97","v":0},null,{"$f":"H97-G97","v":0}]
[null,null,null,"PROGRAMA 48:Plataforma institucional para la seguridad y justicia",141049667,141049667,58226100,79392767]
[null,null,null,"DIFERENCIAS ",{"$f":"F99-E99","v":0},null,{"$f":"H99-G99","v":21166667}]
[null,null,null,2007,141049667,141049667,58226100,79392767]
[null,null,null,"DIFERENCIAS ",{"$f":"F101-E101","v":0},null,{"$f":"H101-G101","v":21166667}]
[null,null,null,"PROPÓSITO 04:Hacer de Bogotá Región un modelo de movilidad multimodal, incluyente y sostenible",1471131029,1471131029,77541966,77541966]
[null,null,null,"DIFERENCIAS ",{"$f":"F103-E103","v":0},null,{"$f":"H103-G103","v":0}]
[null,null,null,"PROGRAMA 49: Movilidad segura, sostenible y accesible",1471131029,1471131029,77541966,77541966]
[null,null,null,"DIFERENCIAS ",{"$f":"F105-E105","v":0},null,{"$f":"H105-G105","v":0}]
[null,null,null,1780,1471131029,1471131029,77541966,77541966]
[null,null,null,"DIFERENCIAS ",{"$f":"F107-E107","v":0},null,{"$f":"H107-G107","v":0}]
[null,null,null,"PROPÓSITO 5:Construir Bogotá Región con gobierno abierto, transparente y ciudadanía consciente",5693860475,"NO HAY REPORTE DE ESTE PROPOSITO",3921736085,"NO HAY REPORTE DE ESTE PROPOSITO"]
[null,null,null,"DIFERENCIAS ",{"$f":"F109-E109","v":{"$error":"#VALUE!"}},null,{"$f":"H109-G109","v":{"$error":"#VALUE!"}}]
[null,null,null,"PROGRAMA 55:Fortalecimiento de Cultura Ciudadana y su institucionalidad",1094701379,1094701379,278534736,278534736]
[null,null,null,"DIFERENCIAS ",{"$f":"F111-E111","v":0},null,{"$f":"H111-G111","v":0}]
[null,null,null,1782,1094701379,1094701379,278534736,278534736]
[null,null,null,"DIFERENCIAS ",{"$f":"F113-E113","v":0},null,{"$f":"H113-G113","v":0}]
[null,null,null,"PROGRAMA 57:Gestión Pública Local",4599159096,"NO HAY REPORTE DE ESTE PROGRAMA",3643201349,"NO HAY REPORTE DE ESTE PROGRAMA"]
[null,null,null,"DIFERENCIAS ",{"$f":"F115-E115","v":{"$error":"#VALUE!"}},null,{"$f":"H115-G115","v":{"$error":"#VALUE!"}}]
[null,null,null,1783,3243563160,3243563160,2628021452,2637314786]
[null,null,null,"DIFERENCIAS ",{"$f":"F117-E117","v":0},null,{"$f":"H117-G117","v":9293334}]
[null,null,null,1784,1355595936,1355595936,1015179897,1017164800]
[null,null,null,"DIFERENCIAS ",{"$f":"F119-E119","v":0},null,{"$f":"H119-G119","v":1984903}]
[]
[]
[null,null,null,"no se conoce a que proyecto estan asociados los sigueintes contratos"]
[]
[null,null,null,148]
[null,null,null,202]
[null,null,null,217]
[null,null,null,225]
[null,null,null,265]
[null,null,null,284]
[null,null,null,300]
[null,null,null,303]
[null,null,null,312]
[null,null,null,315]
[null,null,null,326]
[null,null,null,329]
[null,null,null,332]
[null,null,null,333]
[null,null,null,347]
[null,null,null,23]
[null,null,null,28]
[null,null,null,32]
[null,null,null,66469]
[null,null,null,68487]
[null,null,null,78069]
[null,null,null,78805]
[null,null,null,80536]
[null,null,null,80541]
[null,null,null,83851]
[null,null,null,83879]
[null,null,null,229]
[null,null,null,177]
[null,null,null,141]
[null,null,null,43175]
[null,null,null,160]
[null,null,null,160]
[null,null,null,160]
[null,null,null,160]
[null,null,null,160]

{"sheet":"2. PAA","index":3,"n_rows":13,"n_cols":7,"rows_kept":13,"cut":false,"hidden":false,"merged":[[9,1,9,6],[6,2,6,3],[6,5,6,6],[2,1,2,7],[3,1,3,7],[4,1,4,7],[5,2,5,3],[5,5,5,6]]}
[]
[]
[null,"PLAN ANUAL DE ADQUISIONES"]
[null,2021]
[]
[null,"Entidad","FONDO DE DESARROLLO LOCAL DE FONTIBON",null,"Sector","Gobierno"]
[null,"Responsable diligenciamiento","JUAN DAVID RAMIREZ MONTOYA",null,"Número contacto y correo electrónico","juan.montoya@gobiernobogota.gov.co 3023320691"]
[]
[]
[null,"A continuación registre la información del Plan Anual de Adquisiciones vigencia 2021,  diligencie el presupuesto total,  el presupuesto programado y contratado del 1 de septiembre al 31 de diciembre de 2021, igualmente la fecha de la primera y ultima públicación del PAA en SECOP, y el número de modificaciones realizadas."]
[]
[null,"Presupuesto Total PAA","Presupuesto programado\nSeptiembre 1 a 31 de diciembre de 2021","Presupuesto contratado\nSeptiembre 1 a 31 de diciembre de 2021","Fecha Primera Publicación\nD/M/A","Última fecha de modificación\nD/M/A","Número modificaciones"]
[null,28755621895,"$ 12.526.927.783","$ 12.526.927.783","2021-01-28","2021-12-28",57]

{"sheet":"3. CONSOLIDADO","index":4,"n_rows":56,"n_cols":20,"rows_kept":56,"cut":false,"hidden":false,"merged":[[16,2,16,16],[17,17,17,19],[19,2,21,2],[19,3,21,3],[11,9,11,10],[17,2,17,16],[11,15,11,16],[19,4,19,17],[19,18,20,19],[20,4,20,5],[20,6,20,7],[20,8,20,9],[20,10,20,11],[20,12,20,13],[20,14,20,15],[20,16,20,17],[11,21,11,22],[1,4,1,18],[2,4,2,18],[7,2,8,16],[10,2,12,2],[10,3,12,3],[10,4,10,8],[10,9,10,16],[11,4,11,5],[11,6,11,8],[11,19,11,20],[11,11,11,12],[11,13,11,14],[11,17,11,18],[9,2,9,16],[4,2,5,16],[26,2,26,11],[56,2,58,5],[28,2,30,2],[29,3,29,4],[29,5,29,6],[29,7,29,8],[28,3,28,8]]}
[]
[null,null,null,null,"GESTIÓN CONTRACTUAL "]
[null,null,null,null,"Período de Evaluación: Septiembre 1 a 31 de diciembre de 2021"]
[]
[null,null,"La información consolidada que registra en esta hoja debe coincidir con la información que reporta en las hojas 1 \"INFORMACION ACUMULADA\" y 2 \"INFORMACION II CUATRIMESTRE\". En relación con las adiciones a contratos de años anteriores con cargo al periodo a reportar deben registrarse en filas independientes en los numerales 1 (información general, naturaleza jurídica) y 2 (modalidad). Ej. vigencia =2019; No. Contratos Adicionados:3; Número de adiciones: 4"]
[]
[]
[null,null,"1. Diligenciar en Información General el total de contratos que la entidad suscribió del 1 de septiembre al 31 de diciembre de 2021 y el valor total de ellos, igual el número de contratos que presentaron adiciones, el número de adiciones y el valor total de ellas. Respecto a la Naturaleza jurídica del contratista, diligenciar el número total de contratos suscritos y su valor por: personas naturales, jurídicas, consorcios y uniones temporales"]
[]
[]
[null,null,"Entidad","Vigencia","Información General",null,null,null,null,"Naturaleza jurídica del contratista"]
[null,null,null,null,"Contratos Suscritos",null,"Adiciones",null,null,"Contratos suscritos con personas naturales",null,"Contratos suscritos con personas jurídicas",null,"Contratos suscritos con uniones temporales",null,"Contratos suscritos con consorcios"]
[null,null,null,null,"Número Contratos","Valor Total","Número Contratos Adicionados","Número de Adiciones","Valor Total","Número Contratos y/o adiciones","Valor Total","Número Contratos y/o adiciones","Valor Total","Número Contratos y/o adiciones","Valor Total","Número Contratos y/o adiciones","Valor Total"]
[null,null,"FONTIBON",2021,135,12526927783,26,26,92475502,"73 CPS - 26 ADICIONES",887702714,62,11639225069,4,774234276,1,194649376]
[]
[]
[]
[null,null,"2. Registrar el número y valor total de los contratos y/o adiciones que se suscribieron del 1 de septiembre al 31 de diciembre de 2021 por cada modalidad. Igualmente en la tipología de contratos de prestación de servicios profesionales y de apoyo a la gestión."]
[]
[null,null,"Entidad","Vigencia","Modalidad",null,null,null,null,null,null,null,null,null,null,null,null,null,"Contratos realizados mediante la tipología de contratos de prestación de servicios profesionales y de apoyo a la gestión"]
[null,null,null,null,"Concurso de méritos",null,"Contratación directa",null,"Contratación mínima cuantia",null,"Selección abreviada",null,"Licitación pública",null,"Régimen privado",null,"Régimen especial"]
[null,null,null,null,"Número Contratos","Valor Total","Número Contratos","Valor Total","Número Contratos","Valor Total","Número Contratos","Valor Total","Número Contratos","Valor Total","Número Contratos","Valor Total","Número Contratos","Valor Total","Número Contratos","Valor Total"]
[null,null,"FONTIBON",2021,2,212178845,87,3303871261,16,589827652,24,4734051625,6,3686998400,0,0,0,0,73,887702714]
[]
[]
[]
[null,null,"3. Detalle cada uno de los procesos de selección adelantados en el cuatrimestre por la entidad de acuerdo a cada modalidad de selección (licitación pública, selección abreviada o concurso de méritos), y diligencie el número de proponentes que se presentaron en cada uno de ellos"]
[]
[null,null,"Entidad","Proponentes (que se presentaron a los proceso de selección)"]
[null,null,null,"Concurso de méritos",null,"Selección abreviada",null,"Licitación pública"]
[null,null,null,"Número del proceso contractual en SECOP","Número de proponentes","Número del proceso contractual en SECOP","Número de proponentes","Número del proceso contractual en SECOP","Número de proponentes"]
[null,null,null,"FDLF CMA 014 2021",16,"FDLF-SAMC-1-2021",1,"FDLF-LP-2-2021",30]
[null,null,null,"FDLF CMA 031 2021",7,"FDLF-SAMC-033-2021",7,"FDLF-LP-017-2021",11]
[null,null,null,"FLDF-CMA-1-2021",1,"FDLF-SAMC-019-2021",3,"FDLF-LP-008-2021",44]
[null,null,null,null,null,"FDLF SAMC 020 2021",7,"FDLF-LP-009-2021",17]
[null,null,null,null,null,"FDLF -SAMC 021-2021",3,"FDLF LP 016 2021",4]
[null,null,null,null,null,"FDLF SAMC 035 2021",1,"FDLF-LP-010-2021",4]
[null,null,null,null,null,"FDLF-SASI-015-2021",6]
[null,null,null,null,null,"FDLF-SASI-012-2021",10]
[null,null,null,null,null,"FDLF-SASI-011-2021",10]
[null,null,null,null,null,"FDLF-SAMC-013-2021",2]
[null,null,null,null,null,"FDLF SAMC 040 2021",5]
[null,null,null,null,null,"FDLF SAMC 041 2021",2]
[null,null,null,null,null,"FDLF-SASI-038-2021",4]
[null,null,null,null,null,"FDLF-SASI-038-2021",4]
[null,null,null,null,null,"FDLF-SASI-038-2021",4]
[null,null,null,null,null,"FDLF-SASI-039-2021",6]
[null,null,null,null,null,"FDLF-SASI-039-2021",6]
[null,null,null,null,null,"FDLF SASI 042 2021",6]
[null,null,null,null,null,"FDLF SASI 042 2021",6]
[null,null,null,null,null,"FDLF-SASI-036-2021",9]
[null,null,null,null,null,"FDLF-SAMC-044-2021",2]
[null,null,null,null,null,"FDLF-SAMC-034-2021",4]
[null,null,null,null,null,"FDLF-SAMC-037-2021",1]
[null,null,null,null,null,"FDLF-SAMC-045-2021",8]
[null,null,null,null,null,"FDLF-SASI-043-2021",2]

{"sheet":"4. INSTRUCTIVO","index":5,"n_rows":105,"n_cols":4,"rows_kept":105,"cut":false,"hidden":false,"merged":[[76,1,77,1],[76,2,77,2],[71,1,71,3],[103,1,103,3],[85,1,85,3],[86,1,87,1],[86,2,87,2],[100,1,100,3],[94,1,94,3],[72,1,74,1],[72,2,74,2],[79,2,82,2],[79,1,82,1],[57,1,60,1],[59,2,60,2],[63,1,68,1],[8,1,8,3],[12,1,12,3],[23,1,23,3],[52,1,54,1],[52,2,54,2],[33,2,34,2],[29,2,30,2],[27,1,28,1],[24,1,25,1],[24,2,25,2],[29,1,51,1],[10,1,10,3],[1,1,1,3],[2,1,2,3],[9,1,9,3],[3,1,3,3],[4,1,4,3],[5,1,5,3],[7,1,7,3],[6,1,6,3]]}
[]
[null,"INSTRUCTIVO FORMATO"]
[null,"Recomendamos leer cuidadosamente y poner en práctica las instrucciones que se explican en este instructivo. De la calidad de la información que se registre, depende en gran medida la calidad del informe de rendición de cuentas de la Gestión Contractual que presenta el Alcalde Mayor, consolidado por la Veeduría Distrital.\nEn este formato se deberán relacionar:\nHoja 1. \"INFORMACION ACUMULADA\", diligenciar en esta hoja la totalidad de la información contractual desde el 1 de enero al 31 de diciembre de 2021.\nHoja 2. “PLAN ANUAL DE ADQUISICIONES – PAA”, se pide información sobre el Plan Anual de Adquisiciones y sus modificaciones, por lo cual se deberá precisar el presupuesto total del plan; el programado del 1 de septiembre al 31 de diciembre de 2021; el efectivamente contratado en este período; la primera fecha de publicación del PAA; la última fecha de modificación y el número total de modificaciones realizadas durante este mismo período. \nHoja 3. “CONSOLIDADO”, se pide totalizar la información reportada en la hoja 1, sólo respecto a los contratos y adiciones suscritas entre el 1 de septiembre y el 31 de diciembre de 2021, por lo cual debe coincidir. Es así que en el numeral 1, se debe diligenciar el total de contratos suscritos por la entidad entre el 1 de septiembre y el 31 de diciembre de 2021, periodo de evaluación y su valor; el número total de contratos adicionados, el número total de adiciones y su valor; el número total de contratos celebrados con personas naturales, jurídicas, uniones temporales y consorcios, y su valor; en el numeral 2, se debe registrar en el periodo mencionado, el número total de contratos celebrados según la modalidad de selección y el valor total por cada modalidad; igualmente, es necesario precisar que se deberán relacionar los contratos celebrados mediante la tipología de prestación de servicios profesionales y de apoyo a la gestión y el valor total de ellos. En el numeral 3, se deberá indicar en las modalidades de licitación pública, concurso de méritos y selección abreviada, el número de procesos de selección en los que se presentaron 1 o más proponentes.\nHoja 4.“INSTRUCTIVO”, se dan las instrucciones para el diligenciamiento de la información, explicando paso a paso cada uno de los datos de la base y la manera de diligenciarla para efectos de que la información reportada sea veraz y no presente inconsistencias."]
[null,"La base en Excel a diligenciar NO debe modificarse, debe utilizar versión Excel 2010 o posteriores, la versión 2007 no habilita los macros. El formato está controlado y algunas celdas tienen opciones de selección y solo se debe escoger una de ellas.  El nombre de las hojas no se debe modificar o renombrar debido a que tiene macros. No incluya columnas con otro tipo de información que la Veeduría Distrital no está solicitando o que cambie el formato de celda establecido. Debe diliigencar la totalidad de las celdas, no combinarlas, registrar la información contractual en filas independientes. Las celdas donde se requieren relacionar valores, deben diligenciarse sin puntos, tildes, comas, ni caracteres especiales."]
[null,"Para insertar una o varias filas, en el encabezado del formato, se encuentra un botón denominado \"Insertar Filas\" en el cual se debe hacer click  y digite el número de filas a insertar. Si usted no sigue este procedimiento las filas que inserte no tomarán el formato de las filas anteriores. Se recomienda que antes de iniciar el registro de información inserte las filas que requiera, sin embargo, en cualquier momento que necesite puede hacer este paso"]
[null,"Si requiere insertar una o varias filas realícelo después de la fila A14 para que tomen el formato de las filas anteriores."]
[null,"Si necesita pegar información debe hacerlo por secciones debido a que hay columnas formuladas que están protegidas que no permiten realizar esta opción. Utilice la opción de pegado especial valores para no borrar las listas desplegables ni los formatos de las columnas. Si al pegar quedan textos en rojo,  verifique y ajuste la información, el dato que adiciono no se encuentra en la lista desplegable o no corresponde con el criterio definido en el columna."]
[null,"En primer lugar, diligencie toda la información correspondiente a los contratos suscritos con cargo la vigencia 2021."]
[null,"Una vez incluidos todos los contratos  de la vigencia 2021, a continuación diligencie el formato completo con la información correspondiente a las adiciones efectuadas con cargo a la vigencia 2021 de contratos suscritos en vigencias anteriores. La información general del contrato como: modalidad de selección, tipología contractual, objeto, entre otros, debe corresponder a la información del contrato adicionado o modificado. Respecto al valor, sólo se diligencia el valor en la columna adición, es decir, la columna de valor inicial debe quedar en blanco. No olvide registrar el número de adiciones realizadas en la columna correspondiente."]
[null,"La información que se registre en esta base de datos debe coincidir con los reportes en BOGDATA  y adicionalmente con SECOP.  Es así que la sumatoria del valor final de los contratos y adiciones, por eje/pilar/propósito, programa y proyecto registrada por la Entidad, debe coincidir con la ejecución presupuestal de la entidad, reporte de BOGDATA con corte a 31 de diciembre de 2021, es decir, se debe verificar su coincidencia por rubro con el total del compromiso acumulado; igualmente respecto al valor acumulado de los giros."]
[null,"En caso de haber realizado apropiaciones presupuestales en la vigencia a través de resoluciones, caja menor, honorarios ediles, servicios públicos, debe relacionar dicha información en una sola fila al final de la base, indicando de que se trata la apropiación y número de proyecto si hay lugar a ello. En el tipo de contrato se registra con la opción \"Otros gastos\"."]
[]
[null,"ENCABEZADO DEL FORMATO"]
[null,1,"Entidad","Indique el nombre completo de la Entidad."]
[null,2,"Sector","Seleccione el sector al cual pertenece la Entidad."]
[null,3,"Presupuesto Disponible Inversión Directa","Indique el valor total del presupuesto disponible de inversión directa, de acuerdo con el Informe de ejecución presupuestal de la entidad (BOGDATA), a 31 de diciembre de 2021."]
[null,4,"Presupuesto Comprometido de Inversión Directa ","Escriba el valor total del presupuesto comprometido de inversión directa, de acuerdo con el Informe de ejecución presupuestal de la entidad (BOGDATA), a 31 de diciembre de 2021."]
[null,5,"Presupuesto Disponible Funcionamiento","Indique el valor total del presupuesto de funcionamiento disponible, de acuerdo con el con el Informe de ejecución presupuestal de la entidad (BOGDATA), a 31 de diciembre de 2021."]
[null,6,"Presupuesto Comprometido funcionamiento ","Escriba el monto del presupuesto de funcionamiento, comprometido mediante contratos, de acuerdo con el Informe de ejecución presupuestal de la entidad (BOGDATA), a 31 de diciembre de 2021."]
[null,7,"Presupuesto Disponible Operación","Coloque el monto del presupuesto de operación disponible, de acuerdo con el Informe de ejecución presupuestal de la entidad (BOGDATA), a 31 de diciembre de 2021. Los gastos de operación corresponden solamente a aquellas entidades de régimen de contratación  privado."]
[null,8,"Presupuesto Comprometido operación mediante contratos","Escriba el monto del presupuesto de operación comprometido mediante contratos a 31 de diciembre de 2021."]
[null,9,"Nombre de quien diligencia el formato","Indique el nombre completo, cargo, número de teléfono con extensión y correo electrónico del profesional que diligencia el formato y que posteriormente realizará los ajustes y aclaraciones a que haya lugar por solicitud de la Veeduría Distrital."]
[]
[null,"1- INFORMACIÓN GENERAL"]
[null,1,"Número de Contrato","En estricto orden consecutivo registre el número del contrato, sin incluir los contratos que fueron anulados, ni comodatos."]
[null,null,null,"Una vez terminado el registro de los contratos celebrados con cargo a la vigencia 2021, en las siguientes filas registre la información correspondiente a las adiciones efectuadas con cargo a la vigencia 2021 de contratos suscritos en vigencias anteriores, especificando el año de suscripción en la columna dos."]
[null,2,"Año","Registre el año de celebración del contrato."]
[null,3,"Número de proceso en el SECOP","Relacione el número de proceso de selección con el cual se encuentra publicado el contrato en el SECOP, mas no el link o enlace. Ejemplo IDU-CMA-DTDP-240-2021"]
[null,null,"Link proceso SECOP","Registre el enlace del proceso en SECOP. Ejemplo  https://community.secop.gov.co/Public/xxxxxx"]
[null,4,"Tipo de Contrato","En esta columna seleccione de la lista, el tipo de contrato que corresponde al contrato suscrito. El formato no permite incluir tipo de contratos diferentes a los señaladas en la lista desplegable.  Se debe escoger de las tipologías contractuales que se relacionan a continuación:  "]
[null,null,null,"Para las adiciones a contratos suscritos en la vigencia 2021 y adiciones a contratos sucritos de años anteriores se debe diligenciar la tipología del contrato adicionado o modificado"]
[null,null,"Obra ","Son contratos de obra los que celebren las entidades estatales para la construcción, mantenimiento, instalación y, en general, para la realización de cualquier otro trabajo material sobre bienes inmuebles, cualquiera que sea la modalidad de ejecución y pago. Numeral 1 del artículo 32 de la Ley 80 de 1993"]
[null,null,"Consultoría","Aquellos que celebran las entidades estatales, referidos a los estudios necesarios para la ejecución de proyectos de inversión, de diagnósticos, prefactibilidad o factibilidad para programas o proyectos específicos, así como  las asesorías técnicas de coordinación, control y supervisión. Numeral 2 del artículo 32 de la Ley 80 de 1993"]
[null,null,"Interventoría","Son también  contratos de consultoría los que tienen por objeto la Interventoría, asesoría, gerencia de obras o de proyectos, dirección, programación y la ejecución de diseños, planos, anteproyectos y proyectos. Numeral 2 del artículo 32 de la Ley 80 de 1993"]
[null,null,null,"El contrato de Interventoría tiene por objeto la  supervisión, seguimiento y vigilancia a la ejecución material de un contrato principal"]
[null,null,"Contrato de Prestación de servicios","Son contratos de prestación de servicios los que celebren las entidades estatales para desarrollar actividades relacionadas con la administración o funcionamiento de la entidad. Numeral 3 del artículo 32 de la Ley 80 de 1993"]
[null,null,"Contrato de Prestación de servicios profesionales y de apoyo a la gestión","Corresponden a aquellos de naturaleza intelectual diferentes a los de consultoría que se derivan del cumplimiento de las funciones de la entidad estatal; así como los relacionados con actividades operativas, logísticas, o asistenciales. Art. 2.2.1.2.1.4.9. del Decreto 1082 de 2015"]
[null,null,"Compraventa de bienes muebles","Son aquellos contratos donde se transfiere el dominio de un bien mueble (aquellos susceptibles de ser trasladadas de un lugar a otro sin alterar ni su forma ni su esencia, tal es el caso del mobiliario y equipo de oficina, maquinaria, automóviles, etc.), cuya ejecución se agota de manera instantánea. Artículo 660, Código Civil"]
[null,null,"Compraventa de bienes inmuebles","Son aquellos contratos donde se transfiere el dominio de un bien inmueble (todos aquellos bienes considerados bienes raíces, por tener de común la circunstancia de estar íntimamente ligados al suelo, unidos de modo inseparable, física o jurídicamente, al terreno). Artículo 656, Código Civil"]
[null,null,"Arrendamiento de bienes muebles","Es un contrato que tiene por objeto, conceder el uso y goce de un bien mueble a cambio de un precio determinado. Artículo 1974, Código Civil"]
[null,null,"Arrendamiento de bienes inmuebles","Es un contrato que tiene por objeto, conceder el uso y goce de un bien inmueble a cambio de un precio determinado. Artículo 2.2.1.2.1.4.11 del Decreto 1082 de 2015"]
[null,null,"Seguros","El seguro es un contrato, en virtud del cual una persona jurídica llamada asegurador, asume, a cambio de una prima, un riesgo que le es trasladado por una persona natural o jurídica llamado tomador y en el cual éste tiene un interés asegurable, con el fin de indemnizarlo, en el evento de que ocurra la realización del riesgo amparado, de conformidad con el Título V, del Libro Cuarto del Código de Comercio"]
[null,null,"Suministro","El suministro es el contrato por el cual una parte se obliga, a cambio de una contraprestación, a cumplir en favor de otra, en forma independiente, prestaciones periódicas o continuadas de cosas o servicios. Artículo 968, Código de Comercio"]
[null,null,"Empréstitos","Son contratos de empréstito los que tienen por objeto proveer a la entidad estatal contratante de recursos en moneda nacional o extranjera con plazo para su pago. Artículo 7, Decreto 2681 de 1993"]
[null,null,"Fiducia mercantil o encargo fiduciario","Son contratos que tienen por objeto la administración o el manejo de los recursos vinculados a los contratos que tales entidades celebren. Numeral 5 del artículo 32 de la Ley 80 de 1993"]
[null,null,"Concesión","Este contrato tiene por objeto otorgar a una persona llamada concesionario la prestación, operación, explotación, organización o gestión, total o parcial, de un servicio público, o la construcción, explotación o conservación total o parcial, de una obra o bien destinados al servicio o uso público, así como todas aquellas actividades necesarias para la adecuada prestación o funcionamiento de la obra o servicio por cuenta y riesgo del concesionario, y bajo la vigilancia y control de la entidad concedente, a cambio de una remuneración que puede consistir en derechos, tarifas, tasas, valorización, o en la participación que se le otorgue en la explotación del bien, obra o servicio, o en una suma periódica, única o porcentual, y en general, en cualquier otra modalidad de contraprestación que las partes acuerden. Numeral 4 del artículo 32 de la Ley 80 de 1993"]
[null,null,"Convenios de cooperación","Son aquellos mediante los cuales se formaliza la asistencia, ayuda, auxilio, soporte o colaboración entre entidades de una misma nación, de distintos países o por parte de organizaciones internacionales de naturaleza pública o privada a favor de entidades públicas. Artículo 20 de la Ley 1150 de 2007"]
[null,null,"Convenios/Contratos interadministrativos","El convenio interadministrativo es el negocio jurídico en el cual están presentes dos entidades públicas en desarrollo de relaciones interadministrativas cuyo objeto es coordinar, cooperar, colaborar o distribuir competencias en la realización de funciones administrativas de interés común a los sujetos negociales. Artículo 95 de la Ley 489 de 1998"]
[null,null,"Convenios de Apoyo y/o Convenios de Asociación","Los contratos que en desarrollo de lo dispuesto en el segundo inciso del artículo 355 de la Constitución Política celebren la Nación, los Departamentos, Distritos y Municipios con entidades privadas sin ánimo de lucro y de reconocida idoneidad, con el propósito de impulsar programas y actividades de interés público. Reglamentado mediante Decreto 92 de 2017"]
[null,null,"Asociaciones Público Privadas","Los contratos con personas naturales o jurídicas que se celebran en desarrollo de lo dispuesto en la Ley 1508 de 2012"]
[null,null,"Otros","Los demás tipos de contratos que no se encuentren definidos en las anteriores tipologías"]
[null,null,"Otros gastos","Incluye los gastos no contractuales, estos se registran al final de la base, no cuentan con número de contrato, tipo, proceso o modalidad.  Estos gastos en los que no media un acuerdo de voluntades, en caso de ser del rubro de inversiòn, se deben discriminar por programa y proyecto. En el caso de ser del rubro de funcionamiento no requieren ser discriminados sino totalizados en una sola fila."]
[null,5,"Modalidad de Selección","Al ubicarse en la celda, se despliega una lista de modalidades de selección, de las cuales debe seleccionar la indicada"]
[null,null,null,"Para las adiciones a contratos suscritos en vigencias anteriores se debe diligenciar la modalidad de selección del contrato adicionado o modificado"]
[null,null,null,"La modalidad régimen especial se refiere a todos los contratos realizados en cumplimiento del Decreto 92 de 2017, convenios de asociación con ESAL. Régimen privado es para todas aquellas entidades que no se rigen por el Estatuto General de Contratación Pública (Ley 80 de 1993 y normas complementarias), caso en el que todos sus contratos deben ser identificados con esta modalidad"]
[null,6,"Procedimiento o causal","Esta columna solo se habilita y debe ser diligenciada, para las modalidades de selección abreviada y contratación directa. Al ubicarse en la celda, se despliega una lista de procedimientos o causales, de las cuales debe seleccionar la indicada. El formato no permite incluir procedimientos o causales diferentes a las señaladas en la lista desplegable.  "]
[null,7,"Objeto","Registre el objeto del contrato"]
[null,8,"Afectación ","Registre la afectación según la clasificación de cuentas del presupuesto de gastos. Funcionamiento, Inversión y Operación, esta última aplica únicamente para entidades de régimen privado. La celda solamente permite registrar estas tres opciones."]
[null,null,"Planes de Desarrollo Distrital","Seleccionar el PDD de acuerdo con los diferentes contratos suscritos, automáticamente en la columna K se activan  los números de programa de acuerdo al PDD."]
[null,null,"Número Programa","Si en la columna anterior “Afectación”,  indicó funcionamiento u operación deje en blanco el número de programa, es decir esta columna solamente aplica para gastos de Inversión."]
[null,null,null,"Identifíquelo de acuerdo con el código presupuestal del Plan de Desarrollo  \"Un Nuevo Contrato Social y Ambiental para la Bogotá del Siglo XXI\". Si un mismo contrato afecta más de un código presupuestal discrimine el contrato por cada código que afecte en filas separadas. Si se registra el número del programa, automáticamente en la columna L y M se despliega el nombre del programa y el  propósito según corresponda. "]
[null,9,"Número Proyecto","Indique el código presupuestal con el que se identifica el proyecto. Si un mismo contrato afecta más de un proyecto, discriminar el contrato por cada proyecto que afecte en filas separadas."]
[null,10,"Número de proponentes","Diligencie el número de proponentes que participaron en el proceso de selección adelantado que dio como resultado el contrato que se está diligenciando"]
[null,11,"Número de Identificación del contratista","Indicar el número de identificación del contratista persona natural o jurídica o contratistas plurales (uniones temporales y consorcios) con quien se suscribió el contrato, sin comas, tildes, puntos ni caracteres especiales, y si es NIT sin dígito de verificación"]
[null,null,"Nombre del Contratista","Indicar el nombre del contratista, persona natural o jurídica  o contratistas plurales (uniones temporales y consorcios) en mayúscula sostenida, sin comas, tildes, puntos ni caracteres especiales. Si se trata de personas jurídicas, diligenciar razón social y tipo societario, sin comas, tildes, puntos ni caracteres especiales. Si se trata de personas naturales diligenciar primero los nombres seguidos de los apellidos en la misma columna (nombre 1, nombre 2, apellido 1 y apellido 2)"]
[null,null,"Naturaleza Jurídica","Seleccione la naturaleza jurídica que corresponde al contratista, según las opciones"]
[null,null,"Número  de Identificación de los integrantes del Consorcio o U.T.\n(NIT sin digito de verificación)","Diligenciar este numeral sólo en los casos en que el contratista sea un Consorcio o Union Temporal, relacione en filas independientes (si son varios integrantes puede insertar filas adicionales), cada uno de los números de identificación de los integrantes de los consorcios o uniones temporales sin comas, tildes, puntos ni caracteres especiales, y si es NIT sin dígito de verificación. "]
[null,null,"Nombre del Integrante del Consorcio o U.T.","Diligenciar este numeral sólo en los casos en que el contratista sea un Consorcio o Union Temporal, relacione en filas independientes cada uno de los nombres de los integrantes de los consorcios o uniones temporales, si es persona jurídica la Razón social, es decir el nombre legal de la Empresa; si es persona natural relacione los nombres seguidos de los apellidos en mayúscula sostenida, sin comas, tildes, puntos ni caracteres especiales. Igualmente en el nombre relacione el Tipo societario de cada uno de ellos, entre los cuales se encuentra Sociedades por Acciones Simplificadas (SAS), Sociedad de Responsabilidad Limitada (LTDA), Sociedad en Comandita simple (SCS), Sociedad en Comandita por Acciones (SCA), Sociedad Colectiva, a manera de ejemplo: SOCIEDAD 1 LTDA"]
[null,null,"% Participación","Registre el porcentaje de participación de cada integrante del consorcio o unión temporal, registre sólo números, sin caracteres especiales"]
[]
[]
[null,"2- INFORMACIÓN FINANCIERA"]
[null,12,"Valor Inicial ","Registre el valor inicial del contrato con cargo al segundo cuatrimestre de la vigencia 2021. Esta columna sólo debe contener información numérica"]
[null,null,null,"En el caso de adiciones a contratos de años anteriores, no diligencie esta columna, registrar el valor en la columna 15 \"Valor Total Adiciones\".\nEn caso de adiciones a contratos suscritos en el primer cuatrimestre del 2021, no diligencie esta columna, registrar el valor en la columna 15 \"Valor Total Adiciones\""]
[null,null,null,"Excluya las reservas de apropiación y cuentas por pagar"]
[null,13,"Valor total reducciones (En valor negativo)","Registre el valor de la reducción del contrato en caso de haberse realizado, en negativo, durante la vigencia 2021"]
[null,14,"Número de adiciones ","Diligencie esta columna solo en el caso de adiciones al valor inicial que aumenten el valor del contrato con cargo a la vigencia."]
[null,null,null,"Registre en esta celda el número de adiciones que se realizaron al contrato"]
[null,15,"Valor total de adiciones","Registre el valor total de las adiciones que se realizaron al contrato,  el formato de celda no permite guiones, comas o texto. Esta columna solo debe contener información numérica."]
[null,16,"Valor Final","Esta columna se encuentra formulada por favor no modifique ni quite la fórmula; la fórmula suma las columnas valor inicial, valor de reducciones y valor de adiciones"]
[null,null,null,"La sumatoria de la columna 16 (valor final) para los contratos de Inversión Directa, de funcionamiento y/o operación, cuando aplique, deberán coincidir con el valor del rubro registrado en el encabezado 4, Presupuesto comprometido de inversión según BOGDATA, con el encabezado 6, Presupuesto Comprometido Funcionamiento según BOGDATA y con el encabezado 8, Presupuesto Comprometido Operación mediante contratos, respectivamente. A la vez, estos valores deben coincidir con los informes de ejecución presupuestal del BOGDATA.  "]
[null,null,null,"Si los valores no coinciden debe especificarse al final del formato en qué está representada la diferencia Otros gastos(discriminando los conceptos por Programa y Proyecto de inversión, si es el caso), con sus respectivos valores."]
[null,null,null,"Las bases donde dichos valores no coincidan serán devueltas por la Veeduría Distrital a cada entidad para los respectivos ajustes."]
[null,17,"Giros","Registre el valor total de los giros que se realizaron al contrato,  el formato de celda no permite guiones, comas o texto. Esta columna solo debe contener información numérica."]
[]
[null,"3- PLAZOS"]
[null,18,"Fecha de suscripción","Relacionar la fecha en que se suscribió el contrato original. La celda solo admite el formato Día/Mes/Año, por ejemplo: 17/02/2021"]
[null,null,null,"Para las adiciones a contratos de años anteriores se debe registrar en esta columna la fecha de suscripción de la adición en la vigencia 2021"]
[null,19,"Fecha de inicio","Indicar la fecha de inicio del contrato. Para las adiciones a contratos de años anteriores se debe diligenciar la fecha de inicio de la adición en la vigencia 2021. La celda solo admite el formato Día/Mes/Año así  13/03/2021."]
[null,20,"Fecha de terminación","Indicar la fecha efectiva de terminación del contrato. La celda solo admite el formato Día/Mes/Año así  15/02/2021."]
[null,21,"Plazo en días","Esta columna contiene el plazo inicial del contrato con el número total de días a ejecutar (sólo número de días, no mes, no texto). "]
[null,22,"Número de prórrogas","Registre en esta celda el número de prórrogas que se realizaron al contrato en la vigencia 2021."]
[null,23,"Prórroga en días","En caso de presentarse este evento, indicar en días, el tiempo por el cual se prorrogó el contrato a partir de la fecha inicial de terminación (sólo número de días, no mes, no texto)."]
[]
[null,"4- CESIÓN"]
[null,24,"Número  de Identificación del cesionario\n(NIT con digito de verificación)","Indicar el número de identificación del cesionario persona natural o jurídica con quien se suscribió la cesión, con digito de verificación (DV), el formato de celda no permite guiones o comas, solo números. Si hay más de una cesión adicione una fila y registre número de contrato, año, número proceso contractual SECOP y demás información que corresponda."]
[null,25,"Nombre cesionario","Indicar el nombre del cesionario, persona natural o jurídica."]
[null,26,"Fecha cesión","Relacionar la fecha en que se suscribió la cesión del contrato. La celda solo admite el formato Día/Mes/Año así  17/02/2021."]
[null,27,"Valor cesión","Registre el valor correspondiente a la cesión con cargo a la vigencia 2021, el formato de celda no permite guiones, comas o texto. Esta columna solo debe contener información numérica."]
[]
[null,"5- ESTADO A 31 DE DICIEMBRE DE 2021"]
[null,28,"Estado","Marque con una X en la respectiva columna si el contrato se encuentra a 31 de diciembre de 2021 Celebrado o por Iniciar, En Ejecución, Terminado o Liquidado."]
[]
[null,"5- PORCENTAJE DE AVANCE Y/O CUMPLIMIENTO"]
[null,29,"% Avance y/o cumplimiento","Indica el porcentaje de avance o de cumplimiento en términos presupuestales a 31 de diciembre de 2021, es decir lo efectivamente pagado al contratista. Si no se ha iniciado la ejecución, el % de avance es 0%. La celda se encuentra formulada y protegida. Es la relación entre el valor de los giros y el valor final del contrato. Si el porcentaje de avance no coincide, se debe revisar los valores que se registraron en estas columnas.  Este porcentaje no debe ser superior al 100%"]

{"sheet":"Proposito_programa","index":6,"n_rows":59,"n_cols":5,"rows_kept":59,"cut":false,"hidden":false,"merged":[]}
[]
[null,"PDD","No. Programa","Programa","Propósito"]
["Acuerdo 761 2020","Un Nuevo Contrato Social y Ambiental para la Bogotá del Siglo XXI",1,"Subsidios y transferencias para la equidad","Propósito 1: Hacer un nuevo contrato social para incrementar la inclusión social, productiva y política"]
["Pag. 51","Un Nuevo Contrato Social y Ambiental para la Bogotá del Siglo XXI",{"$f":"+C3+1","v":2},"Igualdad de oportunidades y desarrollo de capacidades para las mujeres","Propósito 1: Hacer un nuevo contrato social para incrementar la inclusión social, productiva y política"]
[null,"Un Nuevo Contrato Social y Ambiental para la Bogotá del Siglo XXI",{"$f":"+C4+1","v":3},"Movilidad social integral","Propósito 1: Hacer un nuevo contrato social para incrementar la inclusión social, productiva y política"]
[null,"Un Nuevo Contrato Social y Ambiental para la Bogotá del Siglo XXI",4,"Prevención de la exclusión por razones étnicas, religiosas, sociales, políticas y de orientación sexual","Propósito 1: Hacer un nuevo contrato social para incrementar la inclusión social, productiva y política"]
[null,"Un Nuevo Contrato Social y Ambiental para la Bogotá del Siglo XXI",5,"Promoción de la igualdad, el desarrollo de capacidades y el reconocimiento de las mujeres","Propósito 1: Hacer un nuevo contrato social para incrementar la inclusión social, productiva y política"]
[null,"Un Nuevo Contrato Social y Ambiental para la Bogotá del Siglo XXI",6,"Sistema Distrital de Cuidado","Propósito 1: Hacer un nuevo contrato social para incrementar la inclusión social, productiva y política"]
[null,"Un Nuevo Contrato Social y Ambiental para la Bogotá del Siglo XXI",7,"Mejora de la gestión de instituciones de salud","Propósito 1: Hacer un nuevo contrato social para incrementar la inclusión social, productiva y política"]
[null,"Un Nuevo Contrato Social y Ambiental para la Bogotá del Siglo XXI",8,"Prevención y atención de maternidad temprana","Propósito 1: Hacer un nuevo contrato social para incrementar la inclusión social, productiva y política"]
[null,"Un Nuevo Contrato Social y Ambiental para la Bogotá del Siglo XXI",9,"Prevención y cambios para mejorar la salud de la población","Propósito 1: Hacer un nuevo contrato social para incrementar la inclusión social, productiva y política"]
[null,"Un Nuevo Contrato Social y Ambiental para la Bogotá del Siglo XXI",10,"Salud para la vida y el bienestar","Propósito 1: Hacer un nuevo contrato social para incrementar la inclusión social, productiva y política"]
[null,"Un Nuevo Contrato Social y Ambiental para la Bogotá del Siglo XXI",11,"Salud y bienestar para niñas y niños","Propósito 1: Hacer un nuevo contrato social para incrementar la inclusión social, productiva y política"]
[null,"Un Nuevo Contrato Social y Ambiental para la Bogotá del Siglo XXI",12,"Educación inicial: Bases sólidas para la vida.","Propósito 1: Hacer un nuevo contrato social para incrementar la inclusión social, productiva y política"]
[null,"Un Nuevo Contrato Social y Ambiental para la Bogotá del Siglo XXI",13,"Educación para todos y todas: acceso y permanencia con equidad y énfasis en educación rural","Propósito 1: Hacer un nuevo contrato social para incrementar la inclusión social, productiva y política"]
[null,"Un Nuevo Contrato Social y Ambiental para la Bogotá del Siglo XXI",14,"Formación integral: más y mejor tiempo en los colegios","Propósito 1: Hacer un nuevo contrato social para incrementar la inclusión social, productiva y política"]
[null,"Un Nuevo Contrato Social y Ambiental para la Bogotá del Siglo XXI",15,"Plan Distrital de Lectura, Escritura y Oralidad: \"Leer para la vida\"","Propósito 1: Hacer un nuevo contrato social para incrementar la inclusión social, productiva y política"]
[null,"Un Nuevo Contrato Social y Ambiental para la Bogotá del Siglo XXI",16,"Transformación pedagógica y mejoramiento de la gestión educativa. Es con los maestros y maestras.","Propósito 1: Hacer un nuevo contrato social para incrementar la inclusión social, productiva y política"]
[null,"Un Nuevo Contrato Social y Ambiental para la Bogotá del Siglo XXI",17,"Jóvenes con capacidades: Proyecto de vida para la ciudadanía, la innovación y el trabajo del siglo XXI","Propósito 1: Hacer un nuevo contrato social para incrementar la inclusión social, productiva y política"]
[null,"Un Nuevo Contrato Social y Ambiental para la Bogotá del Siglo XXI",18,"Cierre de brechas para la inclusión productiva urbano rural","Propósito 1: Hacer un nuevo contrato social para incrementar la inclusión social, productiva y política"]
[null,"Un Nuevo Contrato Social y Ambiental para la Bogotá del Siglo XXI",19,"Vivienda y entornos dignos en el territorio urbano y rural","Propósito 1: Hacer un nuevo contrato social para incrementar la inclusión social, productiva y política"]
[null,"Un Nuevo Contrato Social y Ambiental para la Bogotá del Siglo XXI",20,"Bogotá, referente en cultura, deporte, recreación y actividad física, con parques para el desarrollo y la salud","Propósito 1: Hacer un nuevo contrato social para incrementar la inclusión social, productiva y política"]
[null,"Un Nuevo Contrato Social y Ambiental para la Bogotá del Siglo XXI",21,"Creación y vida cotidiana: Apropiación ciudadana del arte, la cultura y el patrimonio, para la democracia cultural","Propósito 1: Hacer un nuevo contrato social para incrementar la inclusión social, productiva y política"]
[null,"Un Nuevo Contrato Social y Ambiental para la Bogotá del Siglo XXI",22,"Transformación cultural para la conciencia ambiental y el cuidado de la fauna doméstica","Propósito 1: Hacer un nuevo contrato social para incrementar la inclusión social, productiva y política"]
[null,"Un Nuevo Contrato Social y Ambiental para la Bogotá del Siglo XXI",23,"Bogotá rural","Propósito 1: Hacer un nuevo contrato social para incrementar la inclusión social, productiva y política"]
[null,"Un Nuevo Contrato Social y Ambiental para la Bogotá del Siglo XXI",24,"Bogotá región emprendedora e innovadora","Propósito 1: Hacer un nuevo contrato social para incrementar la inclusión social, productiva y política"]
[null,"Un Nuevo Contrato Social y Ambiental para la Bogotá del Siglo XXI",25,"Bogotá región productiva y competitiva","Propósito 1: Hacer un nuevo contrato social para incrementar la inclusión social, productiva y política"]
[null,"Un Nuevo Contrato Social y Ambiental para la Bogotá del Siglo XXI",26,"Bogotá - región, el mejor destino para visitar","Propósito 1: Hacer un nuevo contrato social para incrementar la inclusión social, productiva y política"]
[null,"Un Nuevo Contrato Social y Ambiental para la Bogotá del Siglo XXI",27,"Cambio cultural para la gestión de la crisis climática","Propósito 2 : Cambiar Nuestros Hábitos de Vida para Reverdecer a Bogotá y Adaptarnos y Mitigar la Crisis Climática"]
[null,"Un Nuevo Contrato Social y Ambiental para la Bogotá del Siglo XXI",{"$f":"+C29+1","v":28},"Bogotá protectora de sus recursos naturales","Propósito 2 : Cambiar Nuestros Hábitos de Vida para Reverdecer a Bogotá y Adaptarnos y Mitigar la Crisis Climática"]
[null,"Un Nuevo Contrato Social y Ambiental para la Bogotá del Siglo XXI",{"$f":"+C30+1","v":29},"Asentamientos y entornos protectores","Propósito 2 : Cambiar Nuestros Hábitos de Vida para Reverdecer a Bogotá y Adaptarnos y Mitigar la Crisis Climática"]
[null,"Un Nuevo Contrato Social y Ambiental para la Bogotá del Siglo XXI",30,"Eficiencia en la atención de emergencias","Propósito 2 : Cambiar Nuestros Hábitos de Vida para Reverdecer a Bogotá y Adaptarnos y Mitigar la Crisis Climática"]
[null,"Un Nuevo Contrato Social y Ambiental para la Bogotá del Siglo XXI",31," Protección y valoración del patrimonio tangible e intangible en Bogotá y la región","Propósito 2 : Cambiar Nuestros Hábitos de Vida para Reverdecer a Bogotá y Adaptarnos y Mitigar la Crisis Climática"]
[null,"Un Nuevo Contrato Social y Ambiental para la Bogotá del Siglo XXI",32,"Revitalización urbana para la competitividad","Propósito 2 : Cambiar Nuestros Hábitos de Vida para Reverdecer a Bogotá y Adaptarnos y Mitigar la Crisis Climática"]
[null,"Un Nuevo Contrato Social y Ambiental para la Bogotá del Siglo XXI",33,"Más árboles y más y mejor espacio público","Propósito 2 : Cambiar Nuestros Hábitos de Vida para Reverdecer a Bogotá y Adaptarnos y Mitigar la Crisis Climática"]
[null,"Un Nuevo Contrato Social y Ambiental para la Bogotá del Siglo XXI",34,"Bogotá protectora de los animales","Propósito 2 : Cambiar Nuestros Hábitos de Vida para Reverdecer a Bogotá y Adaptarnos y Mitigar la Crisis Climática"]
[null,"Un Nuevo Contrato Social y Ambiental para la Bogotá del Siglo XXI",35,"Manejo y prevención de contaminación","Propósito 2 : Cambiar Nuestros Hábitos de Vida para Reverdecer a Bogotá y Adaptarnos y Mitigar la Crisis Climática"]
[null,"Un Nuevo Contrato Social y Ambiental para la Bogotá del Siglo XXI",36,"Manejo y saneamiento de los cuerpos de agua","Propósito 2 : Cambiar Nuestros Hábitos de Vida para Reverdecer a Bogotá y Adaptarnos y Mitigar la Crisis Climática"]
[null,"Un Nuevo Contrato Social y Ambiental para la Bogotá del Siglo XXI",37,"Provisión y mejoramiento de servicios públicos","Propósito 2 : Cambiar Nuestros Hábitos de Vida para Reverdecer a Bogotá y Adaptarnos y Mitigar la Crisis Climática"]
[null,"Un Nuevo Contrato Social y Ambiental para la Bogotá del Siglo XXI",38,"Ecoeficiencia, reciclaje, manejo de residuos e inclusión de la población recicladora","Propósito 2 : Cambiar Nuestros Hábitos de Vida para Reverdecer a Bogotá y Adaptarnos y Mitigar la Crisis Climática"]
[null,"Un Nuevo Contrato Social y Ambiental para la Bogotá del Siglo XXI",39,"Bogotá territorio de paz y atención integral a las víctimas del conflicto armado","Propósito 3: Inspirar confianza y legitimidad para vivir sin miedo y ser epicentro de cultura ciudadana, paz y reconciliación"]
[null,"Un Nuevo Contrato Social y Ambiental para la Bogotá del Siglo XXI",{"$f":"+C41+1","v":40},"Más mujeres viven una vida libre de violencias, se sienten seguras y acceden con confianza al sistema de justicia","Propósito 3: Inspirar confianza y legitimidad para vivir sin miedo y ser epicentro de cultura ciudadana, paz y reconciliación"]
[null,"Un Nuevo Contrato Social y Ambiental para la Bogotá del Siglo XXI",{"$f":"+C42+1","v":41},"Sin machismo ni violencias contra las mujeres, las niñas y los niños","Propósito 3: Inspirar confianza y legitimidad para vivir sin miedo y ser epicentro de cultura ciudadana, paz y reconciliación"]
[null,"Un Nuevo Contrato Social y Ambiental para la Bogotá del Siglo XXI",42,"Conciencia y cultura ciudadana para la seguridad, la convivencia y la construcción de confianza","Propósito 3: Inspirar confianza y legitimidad para vivir sin miedo y ser epicentro de cultura ciudadana, paz y reconciliación"]
[null,"Un Nuevo Contrato Social y Ambiental para la Bogotá del Siglo XXI",43,"Cultura ciudadana para la confianza, la convivencia y la participación desde la vida cotidiana","Propósito 3: Inspirar confianza y legitimidad para vivir sin miedo y ser epicentro de cultura ciudadana, paz y reconciliación"]
[null,"Un Nuevo Contrato Social y Ambiental para la Bogotá del Siglo XXI",44,"Autoconciencia, respeto y cuidado en el espacio público","Propósito 3: Inspirar confianza y legitimidad para vivir sin miedo y ser epicentro de cultura ciudadana, paz y reconciliación"]
[null,"Un Nuevo Contrato Social y Ambiental para la Bogotá del Siglo XXI",45,"Espacio público más seguro y construido colectivamente","Propósito 3: Inspirar confianza y legitimidad para vivir sin miedo y ser epicentro de cultura ciudadana, paz y reconciliación"]
[null,"Un Nuevo Contrato Social y Ambiental para la Bogotá del Siglo XXI",46,"Atención a jóvenes y adultos infractores con impacto en su proyecto de vida","Propósito 3: Inspirar confianza y legitimidad para vivir sin miedo y ser epicentro de cultura ciudadana, paz y reconciliación"]
[null,"Un Nuevo Contrato Social y Ambiental para la Bogotá del Siglo XXI",47,"Calidad de Vida y Derechos de la Población privada de la libertad","Propósito 3: Inspirar confianza y legitimidad para vivir sin miedo y ser epicentro de cultura ciudadana, paz y reconciliación"]
[null,"Un Nuevo Contrato Social y Ambiental para la Bogotá del Siglo XXI",48,"Plataforma institucional para la seguridad y justicia","Propósito 3: Inspirar confianza y legitimidad para vivir sin miedo y ser epicentro de cultura ciudadana, paz y reconciliación"]
[null,"Un Nuevo Contrato Social y Ambiental para la Bogotá del Siglo XXI",49,"Movilidad segura, sostenible y accesible","Propósito 4: Hacer de Bogotá Región un modelo de movilidad multimodal, incluyente y sostenible"]
[null,"Un Nuevo Contrato Social y Ambiental para la Bogotá del Siglo XXI",{"$f":"+C51+1","v":50},"Red de metros","Propósito 4: Hacer de Bogotá Región un modelo de movilidad multimodal, incluyente y sostenible"]
[null,"Un Nuevo Contrato Social y Ambiental para la Bogotá del Siglo XXI",51,"Gobierno Abierto","Propósito 5: Construir Bogotá - Región con gobierno abierto, transparente y ciudadanía consciente"]
[null,"Un Nuevo Contrato Social y Ambiental para la Bogotá del Siglo XXI",{"$f":"+C53+1","v":52},"Integración regional, distrital y local","Propósito 5: Construir Bogotá - Región con gobierno abierto, transparente y ciudadanía consciente"]
[null,"Un Nuevo Contrato Social y Ambiental para la Bogotá del Siglo XXI",{"$f":"+C54+1","v":53},"Información para la toma de decisiones","Propósito 5: Construir Bogotá - Región con gobierno abierto, transparente y ciudadanía consciente"]
[null,"Un Nuevo Contrato Social y Ambiental para la Bogotá del Siglo XXI",54,"Transformación digital y gestión de TIC para un territorio inteligente","Propósito 5: Construir Bogotá - Región con gobierno abierto, transparente y ciudadanía consciente"]
[null,"Un Nuevo Contrato Social y Ambiental para la Bogotá del Siglo XXI",55,"Fortalecimiento de cultura ciudadana y su institucionalidad","Propósito 5: Construir Bogotá - Región con gobierno abierto, transparente y ciudadanía consciente"]
[null,"Un Nuevo Contrato Social y Ambiental para la Bogotá del Siglo XXI",56,"Gestión pública efectiva","Propósito 5: Construir Bogotá - Región con gobierno abierto, transparente y ciudadanía consciente"]
[null,"Un Nuevo Contrato Social y Ambiental para la Bogotá del Siglo XXI",57,"Gestión pública local","Propósito 5: Construir Bogotá - Región con gobierno abierto, transparente y ciudadanía consciente"]

{"sheet":"Tipo","index":7,"n_rows":40,"n_cols":5,"rows_kept":40,"cut":false,"hidden":true,"merged":[]}
[null,"Tipo","Modalidad de Selección","afectacion","Naturaleza Jurídica"]
[1,"Obra pública","Concurso de méritos","Funcionamiento","Persona Natural"]
[2,"Consultoría","Contratación directa","Inversión","Persona Jurídica"]
[3,"Interventoría","Contratación mínima cuantia","Operación","Unión Temporal"]
[4,"Contratos de prestación de servicios","Selección abreviada",null,"Consorcio"]
[5,"Contratos de prestación de servicios profesionales y de apoyo a la gestión","Licitación pública"]
[6,"Compraventa de bienes muebles","Régimen privado"]
[7,"Compraventa de bienes inmuebles","Régimen especial"]
[8,"Arrendamiento de bienes muebles"]
[9,"Arrendamiento de bienes inmuebles"]
[10,"Seguros","Selección abreviada"]
[11,"Suministro","Subasta inversa "]
[12,"Empréstitos","Bolsas de productos"]
[13,"Fiducia mercantil o encargo fiduciario","Acuerdo marco de precios "]
[14,"Concesión ","Selección abreviada por menor cuantía "]
[15,"Convenios de cooperacion"]
[16,"Contratos interadministrativos","contratacion directa"]
[17,"Convenios de apoyo y/o convenios de asociación ","Urgencia manifiesta"]
[18,"Asociaciones público privadas","Contratación de empréstitos"]
[19,"Otros","Contratos interadministrativos"]
[20,"Otros gastos","Contratación de bienes y servicios en el sector Defensa y en el Departamento Administrativo de Seguridad, DAS"]
[null,"SECTOR","Contratos para el desarrollo de actividades científicas y tecnológicas"]
[1,"Gestión Pública","Contratos de encargo fiduciario que celebren las entidades territoriales cuando inician el Acuerdo de Reestructuración de Pasivos"]
[{"$f":"+A23+1","v":2},"Gobierno","Cuando no exista pluralidad de oferentes en el mercado"]
[{"$f":"+A24+1","v":3},"Hacienda","Prestación de servicios profesionales y de apoyo a la gestión, o para la ejecución de trabajos artísticos que sólo puedan encomendarse a determinadas personas naturales;"]
[4,"Planeación","El arrendamiento o adquisición de inmuebles"]
[5,"Desarrollo Económico, Industria y Turismo","Contratación de bienes y servicios de la Dirección Nacional de Inteligencia (DNI)"]
[6,"Educación"]
[7,"Salud"]
[8,"Integración Social","Decreto 92 de 2017"]
[9,"Cultura, Recreación y Deporte","No aplica"]
[10,"Ambiente"]
[11,"Movilidad","SECOP I"]
[12,"Hábitat","SECOP II"]
[13,"Mujeres"]
[14,"Seguridad, Convivencia y Justicia","Bogotá Mejor para Todos"]
[15,"Gestión Juridíca","Un Nuevo Contrato Social y Ambiental para la Bogotá del Siglo XXI"]
[16,"descentralizado territorialmente"]
[]
[null,"16 - AL"]

{"sheet":"Eje_Pilar_Prop1","index":8,"n_rows":104,"n_cols":5,"rows_kept":104,"cut":false,"hidden":true,"merged":[]}
[]
[null,"PDD","No. Programa","Programa","Pilar /Eje / propósito"]
[null,"Bogotá Mejor para Todos",1,"Prevención y atención de la maternidad y la paternidad tempranas","Pilar 1 Igualdad de Calidad de Vida"]
[null,"Bogotá Mejor para Todos",2,"Desarrollo integral desde la gestación hasta la adolescencia","Pilar 1 Igualdad de Calidad de Vida"]
[null,"Bogotá Mejor para Todos",3,"Igualdad y autonomía para una Bogotá incluyente","Pilar 1 Igualdad de Calidad de Vida"]
[null,"Bogotá Mejor para Todos",4,"Familias protegidas y adaptadas al cambio climático","Pilar 1 Igualdad de Calidad de Vida"]
[null,"Bogotá Mejor para Todos",5,"Desarrollo integral para la felicidad y el ejercicio de la ciudadanía","Pilar 1 Igualdad de Calidad de Vida"]
[null,"Bogotá Mejor para Todos",6,"Calidad educativa para todos","Pilar 1 Igualdad de Calidad de Vida"]
[null,"Bogotá Mejor para Todos",7,"Inclusión educativa para la equidad","Pilar 1 Igualdad de Calidad de Vida"]
[null,"Bogotá Mejor para Todos",8,"Acceso con calidad a la educación superior","Pilar 1 Igualdad de Calidad de Vida"]
[null,"Bogotá Mejor para Todos",9,"Atención integral y eficiente en salud","Pilar 1 Igualdad de Calidad de Vida"]
[null,"Bogotá Mejor para Todos",10,"Modernización de la infraestructura física y tecnológica en salud","Pilar 1 Igualdad de Calidad de Vida"]
[null,"Bogotá Mejor para Todos",11,"Mejores oportunidades para el desarrollo a través de la cultura, la recreación y el deporte","Pilar 1 Igualdad de Calidad de Vida"]
[null,"Bogotá Mejor para Todos",12,"Mujeres protagonistas, activas y empoderadas en el cierre de brechas de género","Pilar 1 Igualdad de Calidad de Vida"]
[null,"Bogotá Mejor para Todos",13,"Infraestructura para el desarrollo del hábitat","Pilar 2 Democracía Urbana"]
[null,"Bogotá Mejor para Todos",14,"Intervenciones integrales del hábitat","Pilar 2 Democracía Urbana"]
[null,"Bogotá Mejor para Todos",15,"Recuperación, incorporación, vida urbana y control de la ilegalidad","Pilar 2 Democracía Urbana"]
[null,"Bogotá Mejor para Todos",16,"Integración social para una ciudad de oportunidades","Pilar 2 Democracía Urbana"]
[null,"Bogotá Mejor para Todos",17,"Espacio público, derecho de todos","Pilar 2 Democracía Urbana"]
[null,"Bogotá Mejor para Todos",18,"Mejor movilidad para todos","Pilar 2 Democracía Urbana"]
[null,"Bogotá Mejor para Todos",19,"Seguridad y convivencia para todos","Pilar 3 Construcción de Comunidad y Cultura Ciudadana"]
[null,"Bogotá Mejor para Todos",20,"Fortalecimiento del Sistema de Protección Integral a Mujeres Víctimas de Violencia - SOFIA","Pilar 3 Construcción de Comunidad y Cultura Ciudadana"]
[null,"Bogotá Mejor para Todos",21,"Justicia para todos: consolidación del Sistema Distrital de Justicia","Pilar 3 Construcción de Comunidad y Cultura Ciudadana"]
[null,"Bogotá Mejor para Todos",22,"Bogotá vive los derechos humanos","Pilar 3 Construcción de Comunidad y Cultura Ciudadana"]
[null,"Bogotá Mejor para Todos",23,"Bogotá mejor para las víctimas, la paz y la reconciliación","Pilar 3 Construcción de Comunidad y Cultura Ciudadana"]
[null,"Bogotá Mejor para Todos",24,"Equipo por la educación para el reencuentro, la reconciliación y la paz","Pilar 3 Construcción de Comunidad y Cultura Ciudadana"]
[null,"Bogotá Mejor para Todos",25,"Cambio cultural y construcción del tejido social para la vida","Pilar 3 Construcción de Comunidad y Cultura Ciudadana"]
[null,"Bogotá Mejor para Todos",26,"Información relevante e integral para la planeación territorial","Eje Transversal 1 Nuevo Ordenamiento Territorial"]
[null,"Bogotá Mejor para Todos",27,"Proyectos urbanos integrales con visión de ciudad","Eje Transversal 1 Nuevo Ordenamiento Territorial"]
[null,"Bogotá Mejor para Todos",28,"Suelo para reducir el déficit habitacional de suelo urbanizable, vivienda y soportes urbanos","Eje Transversal 1 Nuevo Ordenamiento Territorial"]
[null,"Bogotá Mejor para Todos",29,"Articulación regional y planeación integral del transporte","Eje Transversal 1 Nuevo Ordenamiento Territorial"]
[null,"Bogotá Mejor para Todos",30,"Financiación para el Desarrollo Territorial","Eje Transversal 1 Nuevo Ordenamiento Territorial"]
[null,"Bogotá Mejor para Todos",31,"Fundamentar el desarrollo económico en la generación y uso del conocimiento para mejorar la competitividad de la Ciudad Región","Eje Transversal 2 Desarrollo Económico basado en el conocimiento"]
[null,"Bogotá Mejor para Todos",32,"Generar alternativas de ingreso y empleo de mejor calidad","Eje Transversal 2 Desarrollo Económico basado en el conocimiento"]
[null,"Bogotá Mejor para Todos",33,"Elevar la eficiencia de los mercados de la ciudad","Eje Transversal 2 Desarrollo Económico basado en el conocimiento"]
[null,"Bogotá Mejor para Todos",34,"Mejorar y fortalecer el recaudo tributario de la ciudad e impulsar el uso de mecanismos de vinculación de capital privado","Eje Transversal 2 Desarrollo Económico basado en el conocimiento"]
[null,"Bogotá Mejor para Todos",35,"Bogotá, ciudad inteligente","Eje Transversal 2 Desarrollo Económico basado en el conocimiento"]
[null,"Bogotá Mejor para Todos",36,"Bogotá, una ciudad digital","Eje Transversal 2 Desarrollo Económico basado en el conocimiento"]
[null,"Bogotá Mejor para Todos",37,"Consolidar el turismo como factor de desarrollo, confianza y felicidad para Bogotá Región","Eje Transversal 2 Desarrollo Económico basado en el conocimiento"]
[null,"Bogotá Mejor para Todos",38,"Recuperación y manejo de la Estructura Ecológica Principal","Eje Transversal 3 Sostenibilidad Ambiental basada en la eficiencia energética"]
[null,"Bogotá Mejor para Todos",39,"Ambiente sano para la equidad y disfrute del ciudadano","Eje Transversal 3 Sostenibilidad Ambiental basada en la eficiencia energética"]
[null,"Bogotá Mejor para Todos",40,"Gestión de la huella ambiental urbana","Eje Transversal 3 Sostenibilidad Ambiental basada en la eficiencia energética"]
[null,"Bogotá Mejor para Todos",41,"Desarrollo rural sostenible","Eje Transversal 3 Sostenibilidad Ambiental basada en la eficiencia energética"]
[null,"Bogotá Mejor para Todos",42,"Transparencia, gestión pública y servicio a la ciudadanía","Eje Transversal 4 Gobierno Legitimo, Fortalecimiento Local y Eficiencia"]
[null,"Bogotá Mejor para Todos",43,"Modernización institucional","Eje Transversal 4 Gobierno Legitimo, Fortalecimiento Local y Eficiencia"]
[null,"Bogotá Mejor para Todos",44,"Gobierno y ciudadanía digital","Eje Transversal 4 Gobierno Legitimo, Fortalecimiento Local y Eficiencia"]
[null,"Bogotá Mejor para Todos",45,"Gobernanza e influencia local, regional e internacional","Eje Transversal 4 Gobierno Legitimo, Fortalecimiento Local y Eficiencia"]
["Acuerdo 761 2020","Un Nuevo Contrato Social y Ambiental para la Bogotá del Siglo XXI","1.","Subsidios y transferencias para la equidad","Propósito 1: Hacer un nuevo contrato social para incrementar la inclusión social, productiva y política"]
["Pag. 51","Un Nuevo Contrato Social y Ambiental para la Bogotá del Siglo XXI","2.","Igualdad de oportunidades y desarrollo de capacidades para las mujeres","Propósito 1: Hacer un nuevo contrato social para incrementar la inclusión social, productiva y política"]
[null,"Un Nuevo Contrato Social y Ambiental para la Bogotá del Siglo XXI","3.","Movilidad social integral","Propósito 1: Hacer un nuevo contrato social para incrementar la inclusión social, productiva y política"]
[null,"Un Nuevo Contrato Social y Ambiental para la Bogotá del Siglo XXI","4.","Prevención de la exclusión por razones étnicas, religiosas, sociales, políticas y de orientación sexual","Propósito 1: Hacer un nuevo contrato social para incrementar la inclusión social, productiva y política"]
[null,"Un Nuevo Contrato Social y Ambiental para la Bogotá del Siglo XXI","5.","Promoción de la igualdad, el desarrollo de capacidades y el reconocimiento de las mujeres","Propósito 1: Hacer un nuevo contrato social para incrementar la inclusión social, productiva y política"]
[null,"Un Nuevo Contrato Social y Ambiental para la Bogotá del Siglo XXI","6.","Sistema Distrital de Cuidado","Propósito 1: Hacer un nuevo contrato social para incrementar la inclusión social, productiva y política"]
[null,"Un Nuevo Contrato Social y Ambiental para la Bogotá del Siglo XXI","7.","Mejora de la gestión de instituciones de salud","Propósito 1: Hacer un nuevo contrato social para incrementar la inclusión social, productiva y política"]
[null,"Un Nuevo Contrato Social y Ambiental para la Bogotá del Siglo XXI","8.","Prevención y atención de maternidad temprana","Propósito 1: Hacer un nuevo contrato social para incrementar la inclusión social, productiva y política"]
[null,"Un Nuevo Contrato Social y Ambiental para la Bogotá del Siglo XXI","9.","Prevención y cambios para mejorar la salud de la población","Propósito 1: Hacer un nuevo contrato social para incrementar la inclusión social, productiva y política"]
[null,"Un Nuevo Contrato Social y Ambiental para la Bogotá del Siglo XXI","10.","Salud para la vida y el bienestar","Propósito 1: Hacer un nuevo contrato social para incrementar la inclusión social, productiva y política"]
[null,"Un Nuevo Contrato Social y Ambiental para la Bogotá del Siglo XXI","11.","Salud y bienestar para niñas y niños","Propósito 1: Hacer un nuevo contrato social para incrementar la inclusión social, productiva y política"]
[null,"Un Nuevo Contrato Social y Ambiental para la Bogotá del Siglo XXI","12.","Educación inicial: Bases sólidas para la vida.","Propósito 1: Hacer un nuevo contrato social para incrementar la inclusión social, productiva y política"]
[null,"Un Nuevo Contrato Social y Ambiental para la Bogotá del Siglo XXI","13.","Educación para todos y todas: acceso y permanencia con equidad y énfasis en educación rural","Propósito 1: Hacer un nuevo contrato social para incrementar la inclusión social, productiva y política"]
[null,"Un Nuevo Contrato Social y Ambiental para la Bogotá del Siglo XXI","14.","Formación integral: más y mejor tiempo en los colegios","Propósito 1: Hacer un nuevo contrato social para incrementar la inclusión social, productiva y política"]
[null,"Un Nuevo Contrato Social y Ambiental para la Bogotá del Siglo XXI","15.","Plan Distrital de Lectura, Escritura y Oralidad: \"Leer para la vida\"","Propósito 1: Hacer un nuevo contrato social para incrementar la inclusión social, productiva y política"]
[null,"Un Nuevo Contrato Social y Ambiental para la Bogotá del Siglo XXI","16.","Transformación pedagógica y mejoramiento de la gestión educativa. Es con los maestros y maestras.","Propósito 1: Hacer un nuevo contrato social para incrementar la inclusión social, productiva y política"]
[null,"Un Nuevo Contrato Social y Ambiental para la Bogotá del Siglo XXI","17.","Jóvenes con capacidades: Proyecto de vida para la ciudadanía, la innovación y el trabajo del siglo XXI","Propósito 1: Hacer un nuevo contrato social para incrementar la inclusión social, productiva y política"]
[null,"Un Nuevo Contrato Social y Ambiental para la Bogotá del Siglo XXI","18.","Cierre de brechas para la inclusión productiva urbano rural","Propósito 1: Hacer un nuevo contrato social para incrementar la inclusión social, productiva y política"]
[null,"Un Nuevo Contrato Social y Ambiental para la Bogotá del Siglo XXI","19.","Vivienda y entornos dignos en el territorio urbano y rural","Propósito 1: Hacer un nuevo contrato social para incrementar la inclusión social, productiva y política"]
[null,"Un Nuevo Contrato Social y Ambiental para la Bogotá del Siglo XXI","20.","Bogotá, referente en cultura, deporte, recreación y actividad física, con parques para el desarrollo y la salud","Propósito 1: Hacer un nuevo contrato social para incrementar la inclusión social, productiva y política"]
[null,"Un Nuevo Contrato Social y Ambiental para la Bogotá del Siglo XXI","21.","Creación y vida cotidiana: Apropiación ciudadana del arte, la cultura y el patrimonio, para la democracia cultural","Propósito 1: Hacer un nuevo contrato social para incrementar la inclusión social, productiva y política"]
[null,"Un Nuevo Contrato Social y Ambiental para la Bogotá del Siglo XXI","22.","Transformación cultural para la conciencia ambiental y el cuidado de la fauna doméstica","Propósito 1: Hacer un nuevo contrato social para incrementar la inclusión social, productiva y política"]
[null,"Un Nuevo Contrato Social y Ambiental para la Bogotá del Siglo XXI","23.","Bogotá rural","Propósito 1: Hacer un nuevo contrato social para incrementar la inclusión social, productiva y política"]
[null,"Un Nuevo Contrato Social y Ambiental para la Bogotá del Siglo XXI","24.","Bogotá región emprendedora e innovadora","Propósito 1: Hacer un nuevo contrato social para incrementar la inclusión social, productiva y política"]
[null,"Un Nuevo Contrato Social y Ambiental para la Bogotá del Siglo XXI","25.","Bogotá región productiva y competitiva","Propósito 1: Hacer un nuevo contrato social para incrementar la inclusión social, productiva y política"]
[null,"Un Nuevo Contrato Social y Ambiental para la Bogotá del Siglo XXI","26.","Bogotá - región, el mejor destino para visitar","Propósito 1: Hacer un nuevo contrato social para incrementar la inclusión social, productiva y política"]
[null,"Un Nuevo Contrato Social y Ambiental para la Bogotá del Siglo XXI","27.","Cambio cultural para la gestión de la crisis climática","Propósito 2 : Cambiar Nuestros Hábitos de Vida para Reverdecer a Bogotá y Adaptarnos y Mitigar la Crisis Climática"]
[null,"Un Nuevo Contrato Social y Ambiental para la Bogotá del Siglo XXI","28.","Bogotá protectora de sus recursos naturales","Propósito 2 : Cambiar Nuestros Hábitos de Vida para Reverdecer a Bogotá y Adaptarnos y Mitigar la Crisis Climática"]
[null,"Un Nuevo Contrato Social y Ambiental para la Bogotá del Siglo XXI","29.","Asentamientos y entornos protectores","Propósito 2 : Cambiar Nuestros Hábitos de Vida para Reverdecer a Bogotá y Adaptarnos y Mitigar la Crisis Climática"]
[null,"Un Nuevo Contrato Social y Ambiental para la Bogotá del Siglo XXI","30.","Eficiencia en la atención de emergencias","Propósito 2 : Cambiar Nuestros Hábitos de Vida para Reverdecer a Bogotá y Adaptarnos y Mitigar la Crisis Climática"]
[null,"Un Nuevo Contrato Social y Ambiental para la Bogotá del Siglo XXI","31."," Protección y valoración del patrimonio tangible e intangible en Bogotá y la región","Propósito 2 : Cambiar Nuestros Hábitos de Vida para Reverdecer a Bogotá y Adaptarnos y Mitigar la Crisis Climática"]
[null,"Un Nuevo Contrato Social y Ambiental para la Bogotá del Siglo XXI","32.","Revitalización urbana para la competitividad","Propósito 2 : Cambiar Nuestros Hábitos de Vida para Reverdecer a Bogotá y Adaptarnos y Mitigar la Crisis Climática"]
[null,"Un Nuevo Contrato Social y Ambiental para la Bogotá del Siglo XXI","33.","Más árboles y más y mejor espacio público","Propósito 2 : Cambiar Nuestros Hábitos de Vida para Reverdecer a Bogotá y Adaptarnos y Mitigar la Crisis Climática"]
[null,"Un Nuevo Contrato Social y Ambiental para la Bogotá del Siglo XXI","34.","Bogotá protectora de los animales","Propósito 2 : Cambiar Nuestros Hábitos de Vida para Reverdecer a Bogotá y Adaptarnos y Mitigar la Crisis Climática"]
[null,"Un Nuevo Contrato Social y Ambiental para la Bogotá del Siglo XXI","35.","Manejo y prevención de contaminación","Propósito 2 : Cambiar Nuestros Hábitos de Vida para Reverdecer a Bogotá y Adaptarnos y Mitigar la Crisis Climática"]
[null,"Un Nuevo Contrato Social y Ambiental para la Bogotá del Siglo XXI","36.","Manejo y saneamiento de los cuerpos de agua","Propósito 2 : Cambiar Nuestros Hábitos de Vida para Reverdecer a Bogotá y Adaptarnos y Mitigar la Crisis Climática"]
[null,"Un Nuevo Contrato Social y Ambiental para la Bogotá del Siglo XXI","37.","Provisión y mejoramiento de servicios públicos","Propósito 2 : Cambiar Nuestros Hábitos de Vida para Reverdecer a Bogotá y Adaptarnos y Mitigar la Crisis Climática"]
[null,"Un Nuevo Contrato Social y Ambiental para la Bogotá del Siglo XXI","38.","Ecoeficiencia, reciclaje, manejo de residuos e inclusión de la población recicladora","Propósito 2 : Cambiar Nuestros Hábitos de Vida para Reverdecer a Bogotá y Adaptarnos y Mitigar la Crisis Climática"]
[null,"Un Nuevo Contrato Social y Ambiental para la Bogotá del Siglo XXI","39.","Bogotá territorio de paz y atención integral a las víctimas del conflicto armado","Propósito 3: Inspirar confianza y legitimidad para vivir sin miedo y ser epicentro de cultura ciudadana, paz y reconciliación"]
[null,"Un Nuevo Contrato Social y Ambiental para la Bogotá del Siglo XXI","40.","Más mujeres viven una vida libre de violencias, se sienten seguras y acceden con confianza al sistema de justicia","Propósito 3: Inspirar confianza y legitimidad para vivir sin miedo y ser epicentro de cultura ciudadana, paz y reconciliación"]
[null,"Un Nuevo Contrato Social y Ambiental para la Bogotá del Siglo XXI","41.","Sin machismo ni violencias contra las mujeres, las niñas y los niños","Propósito 3: Inspirar confianza y legitimidad para vivir sin miedo y ser epicentro de cultura ciudadana, paz y reconciliación"]
[null,"Un Nuevo Contrato Social y Ambiental para la Bogotá del Siglo XXI","42.","Conciencia y cultura ciudadana para la seguridad, la convivencia y la construcción de confianza","Propósito 3: Inspirar confianza y legitimidad para vivir sin miedo y ser epicentro de cultura ciudadana, paz y reconciliación"]
[null,"Un Nuevo Contrato Social y Ambiental para la Bogotá del Siglo XXI","43.","Cultura ciudadana para la confianza, la convivencia y la participación desde la vida cotidiana","Propósito 3: Inspirar confianza y legitimidad para vivir sin miedo y ser epicentro de cultura ciudadana, paz y reconciliación"]
[null,"Un Nuevo Contrato Social y Ambiental para la Bogotá del Siglo XXI","44.","Autoconciencia, respeto y cuidado en el espacio público","Propósito 3: Inspirar confianza y legitimidad para vivir sin miedo y ser epicentro de cultura ciudadana, paz y reconciliación"]
[null,"Un Nuevo Contrato Social y Ambiental para la Bogotá del Siglo XXI","45.","Espacio público más seguro y construido colectivamente","Propósito 3: Inspirar confianza y legitimidad para vivir sin miedo y ser epicentro de cultura ciudadana, paz y reconciliación"]
[null,"Un Nuevo Contrato Social y Ambiental para la Bogotá del Siglo XXI","46.","Atención a jóvenes y adultos infractores con impacto en su proyecto de vida","Propósito 3: Inspirar confianza y legitimidad para vivir sin miedo y ser epicentro de cultura ciudadana, paz y reconciliación"]
[null,"Un Nuevo Contrato Social y Ambiental para la Bogotá del Siglo XXI","47.","Calidad de Vida y Derechos de la Población privada de la libertad","Propósito 3: Inspirar confianza y legitimidad para vivir sin miedo y ser epicentro de cultura ciudadana, paz y reconciliación"]
[null,"Un Nuevo Contrato Social y Ambiental para la Bogotá del Siglo XXI","48.","Plataforma institucional para la seguridad y justicia","Propósito 3: Inspirar confianza y legitimidad para vivir sin miedo y ser epicentro de cultura ciudadana, paz y reconciliación"]
[null,"Un Nuevo Contrato Social y Ambiental para la Bogotá del Siglo XXI","49.","Movilidad segura, sostenible y accesible","Propósito 4: Hacer de Bogotá Región un modelo de movilidad multimodal, incluyente y sostenible"]
[null,"Un Nuevo Contrato Social y Ambiental para la Bogotá del Siglo XXI","50.","Red de metros","Propósito 4: Hacer de Bogotá Región un modelo de movilidad multimodal, incluyente y sostenible"]
[null,"Un Nuevo Contrato Social y Ambiental para la Bogotá del Siglo XXI","51.","Gobierno Abierto","Propósito 5: Construir Bogotá - Región con gobierno abierto, transparente y ciudadanía consciente"]
[null,"Un Nuevo Contrato Social y Ambiental para la Bogotá del Siglo XXI","52.","Integración regional, distrital y local","Propósito 5: Construir Bogotá - Región con gobierno abierto, transparente y ciudadanía consciente"]
[null,"Un Nuevo Contrato Social y Ambiental para la Bogotá del Siglo XXI","53.","Información para la toma de decisiones","Propósito 5: Construir Bogotá - Región con gobierno abierto, transparente y ciudadanía consciente"]
[null,"Un Nuevo Contrato Social y Ambiental para la Bogotá del Siglo XXI","54.","Transformación digital y gestión de TIC para un territorio inteligente","Propósito 5: Construir Bogotá - Región con gobierno abierto, transparente y ciudadanía consciente"]
[null,"Un Nuevo Contrato Social y Ambiental para la Bogotá del Siglo XXI","55.","Fortalecimiento de cultura ciudadana y su institucionalidad","Propósito 5: Construir Bogotá - Región con gobierno abierto, transparente y ciudadanía consciente"]
[null,"Un Nuevo Contrato Social y Ambiental para la Bogotá del Siglo XXI","56.","Gestión pública efectiva","Propósito 5: Construir Bogotá - Región con gobierno abierto, transparente y ciudadanía consciente"]
[null,"Un Nuevo Contrato Social y Ambiental para la Bogotá del Siglo XXI","57.","Gestión pública local","Propósito 5: Construir Bogotá - Región con gobierno abierto, transparente y ciudadanía consciente"]