{"text_format":"1","workbook":"xlsx","n_sheets":11,"sheets":["FUNCIONAMIENTO","Ctos suscrito x Trimestre","INVERSION","1. INFORMACION ACUMULADA","CORRECIONES A REALIZAR 1","2. PAA","3. CONSOLIDADO","4. INSTRUCTIVO","Proposito_programa","Tipo","Eje_Pilar_Prop1"],"not_rendered":{"charts":0,"images":1,"macros":1,"external_links":8,"defined_names":69,"comments":1,"pivot_tables":9},"unopened":[],"bounds":{"document_bytes":16777216,"sheet_cells":100000,"rows_first":2000,"rows_last":500,"rows_between":2000,"halvings":0,"cell_chars":16384,"cell_head_chars":4096},"cells_cut":0,"cells_raw":0,"read":"whole","date_system":"1900"}

{"sheet":"FUNCIONAMIENTO","index":0,"n_rows":38,"n_cols":21,"rows_kept":38,"cut":false,"hidden":false,"merged":[[0,1,0,4],[0,14,0,18],[27,1,27,4],[28,14,28,18]]}
[null,"FUNCIONAMIENTO TIPO DE CONTRATO AÑO 2021 SE SUMO EL NUMERO DE CONTRATOS",null,null,null,null,null,null,null,null,null,null,null,null,"FUNCIONAMIENTO POR MODALIDAD DE CONTRATO 2021"]
[]
["Año",2021,null,null,null,null,null,null,null,null,null,null,null,null,"Año",2021]
["Afectación","Funcionamiento",null,null,null,null,null,null,null,null,null,null,null,null,"Afectación","Funcionamiento"]
[]
[null,null,"Valores",null,null,null,null,null,null,null,null,null,null,null,null,"Valores"]
["Tipo de contrato ","Propósito","Suma de Valor Final ","Suma de Valor Final 2","Suma de Giros (Valor en pesos)","Suma de Giros (Valor en pesos)2","Suma de Cuenta contratos","Suma de Cuenta contratos2",null,null,null,null,null,null,"Modalidad de Selección","Suma de Valor Final ","Suma de Valor Final 2","Suma de Giros (Valor en pesos)","Suma de Giros (Valor en pesos)2","Suma de Cuenta contratos","Suma de Cuenta contratos2"]
["Compraventa de bienes muebles"," ",46178107,4.0401209237639409E-2,25050045,4.6914478937166354E-2,8,0.30769230769230771,null,null,null,null,null,null,"Concurso de méritos",0,0,0,0,1,3.8461538461538464E-2]
["Contratos de prestación de servicios"," ",835090465,0.73062034805416753,413268769,0.77398220077605329,6,0.23076923076923078,null,null,null,null,null,null,"Contratación directa",39538873,3.4592545794340408E-2,19508504,3.6536114007125559E-2,6,0.23076923076923078]
["Contratos interadministrativos"," ",30538873,2.6718449025090976E-2,16522502,3.0943839504810829E-2,5,0.19230769230769232,null,null,null,null,null,null,"Contratación mínima cuantia",161359611,0.1411734657402717,60670012,0.11362462622688423,6,0.23076923076923078]
["Seguros"," ",130281318,0.11398307835081757,60670012,0.11362462622688423,3,0.11538461538461539,null,null,null,null,null,null,"Régimen especial",648482057,0.56735671888221417,343556142,0.64342229275808227,2,7.6923076923076927E-2]
["Suministro"," ",100899476,8.8276915332284531E-2,18439929,3.4534854555085356E-2,4,0.15384615384615385,null,null,null,null,null,null,"Selección abreviada",293607698,0.25687726958317375,110216599,0.20641696700790799,11,0.42307692307692307]
["Total general",null,1142988239,1,533951257,1,26,1,null,null,null,null,null,null,"Total general",1142988239,1,533951257,1,26,1]
[]
[]
[]
[]
[]
[]
[]
[]
[]
[]
[]
[]
[]
[]
[null,"FUNCIONAMIENTO TIPO DE CONTRATO AÑO ANTERIORES SE SUMO EL NUMERO DE ADICIONES"]
[null,null,null,null,null,null,null,null,null,null,null,null,null,null,"FUNCIONAMIENTO POR MODALIDAD DE CONTRATO AÑOS ANTERIORES SE SUMO EL NUMERO DE ADICIONES"]
["Año","(Varios elementos)"]
["Afectación","Funcionamiento",null,null,null,null,null,null,null,null,null,null,null,null,"Año","(Varios elementos)"]
[null,null,null,null,null,null,null,null,null,null,null,null,null,null,"Afectación","Funcionamiento"]
[null,null,"Valores"]
["Tipo de contrato ","Propósito","Suma de Valor Final ","Suma de Valor Final 2","Suma de Giros (Valor en pesos)","Suma de Giros (Valor en pesos)2","Suma de Número de adiciones","Suma de Número de adiciones2",null,null,null,null,null,null,null,"Valores"]
["Contratos de prestación de servicios"," ",139452974,0.69087541237991623,109802298,0.6894357497127851,2,0.25,null,null,null,null,null,null,"Modalidad de Selección","Suma de Valor Final ","Suma de Valor Final 2","Suma de Giros (Valor en pesos)","Suma de Giros (Valor en pesos)2","Suma de Número de adiciones","Suma de Número de adiciones2"]
["Seguros"," ",49231521,0.24390191472693515,49231520,0.30911893939323543,4,0.5,null,null,null,null,null,null,"Régimen especial",119452974,0.59179177256024251,109802298,0.6894357497127851,1,0.125]
["Suministro"," ",13165175,6.5222672893148648E-2,230186,1.4453108939795334E-3,2,0.25,null,null,null,null,null,null,"Selección abreviada",82396696,0.40820822743975754,49461706,0.3105642502872149,7,0.875]
["Total general",null,201849670,1,159264004,1,8,1,null,null,null,null,null,null,"Total general",201849670,1,159264004,1,8,1]

{"sheet":"Ctos suscrito x Trimestre","index":1,"n_rows":119,"n_cols":5,"rows_kept":119,"cut":false,"hidden":false,"merged":[[1,4,3,11],[4,4,4,6]]}
[]
[null,"Contratos Suscritos en la vigencia 2021  (Inversion)",null,null,"Se toman solo los contratos de la vigencia por cuanto en las adiciones años anteriores algunas Entidades registraron la fecha en que se suscribio el contrato y no la adición."]
[null,"Afectación","Inversión"]
[null,"Tipo de contrato ","(Varios elementos)","No incluir \"otros gastos\""]
[null,"Año","(Todas)"]
[]
[null,"Suma de Cuenta contratos"]
[null,"Fecha de suscripción (DD/MM/AAAA)","Total"]
[null,44242,4]
[null,44459,1]
[null,44245,12]
[null,44225,4]
[null,44271,5]
[null,44236,13]
[null,44252,4]
[null,44230,8]
[null,44239,15]
[null,44420,2]
[null,44462,1]
[null,44292,2]
[null,44253,23]
[null,44238,12]
[null,44547,1]
[null,44228,7]
[null,44293,2]
[null,44390,4]
[null,44412,1]
[null,44504,1]
[null,44408,1]
[null,44438,2]
[null,44512,2]
[null,44449,1]
[null,44285,1]
[null,44418,4]
[null,44393,2]
[null,44455,2]
[null,44435,1]
[null,44468,3]
[null,44340,1]
[null,44204,1]
[null,44539,3]
[null,44375,1]
[null,44377,1]
[null,44498,1]
[null,44421,2]
[null,44229,5]
[null,44237,5]
[null,44249,4]
[null,44531,1]
[null,44256,3]
[null,44560,5]
[null,44392,1]
[null,44559,5]
[null,44404,2]
[null,44221,8]
[null,44329,2]
[null,44403,1]
[null,44363,2]
[null,44427,2]
[null,44419,9]
[null,44231,3]
[null,44279,4]
[null,44218,1]
[null,44260,1]
[null,44286,2]
[null,44251,8]
[null,44232,8]
[null,44265,5]
[null,44263,3]
[null,44246,5]
[null,44406,2]
[null,44474,2]
[null,44431,3]
[null,44264,3]
[null,44291,1]
[null,44483,1]
[null,44517,1]
[null,44524,1]
[null,44447,2]
[null,44425,1]
[null,44235,2]
[null,44400,1]
[null,44243,3]
[null,44557,1]
[null,44456,1]
[null,44223,3]
[null,44272,5]
[null,44244,5]
[null,44328,2]
[null,44439,1]
[null,44434,1]
[null,44224,1]
[null,44442,1]
[null,44337,2]
[null,44355,1]
[null,44481,2]
[null,44543,1]
[null,44452,1]
[null,44274,1]
[null,44266,3]
[null,44448,1]
[null,44336,1]
[null,44551,1]
[null,44485,1]
[null,44358,1]
[null,44257,1]
[null,44250,3]
[null,44440,1]
[null,44532,1]
[null,44558,1]
[null,44405,1]
[null,44441,1]
[null,44306,1]
[null,44259,1]
[null,44426,1]
[null,44282,1]
[null,44460,1]
[null,44335,1]
[null,"Total general",321]

{"sheet":"INVERSION","index":2,"n_rows":124,"n_cols":82,"rows_kept":124,"cut":false,"hidden":false,"merged":[[0,1,0,4],[0,73,0,77],[110,1,110,4],[111,73,111,77]]}
[null,"INVERSION TIPO DE CONTRATO AÑO 2021 SE SUMO EL NUMERO DE CONTRATOS",null,null,null,null,null,null,null,null,null,null,null,null,null,null,null,null,null,null,null,null,null,null,null,null,null,null,null,null,null,null,null,null,null,null,null,null,null,null,null,null,null,null,null,null,null,null,null,null,null,null,null,null,null,null,null,null,null,null,null,null,null,null,null,null,null,null,null,null,null,null,null,"INVERSION POR MODALIDAD DE CONTRATO 2021"]
[]
["Año",2021,null,null,null,null,null,null,null,null,null,null,null,null,null,null,null,null,null,null,null,null,null,null,null,null,null,null,null,null,null,null,null,null,null,null,null,null,null,null,null,null,null,null,null,null,null,null,null,null,null,null,null,null,null,null,null,null,null,null,null,null,null,null,null,null,null,null,null,null,null,null,null,"Año",2021]
["Afectación","Inversión",null,null,null,null,null,null,null,null,null,null,null,null,null,null,null,null,null,null,null,null,null,null,null,null,null,null,null,null,null,null,null,null,null,null,null,null,null,null,null,null,null,null,null,null,null,null,null,null,null,null,null,null,null,null,null,null,null,null,null,null,null,null,null,null,null,null,null,null,null,null,null,"Afectación","Inversión"]
[]
[null,null,null,"Valores",null,null,null,null,null,null,null,null,null,null,null,null,null,null,null,null,null,null,null,null,null,null,null,null,null,null,null,null,null,null,null,null,null,null,null,null,null,null,null,null,null,null,null,null,null,null,null,null,null,null,null,null,null,null,null,null,null,null,null,null,null,null,null,null,null,null,null,null,null,null,null,null,"Valores"]
["Tipo de contrato ","Propósito","Equivalencia número de programa","Suma de Valor Final ","Suma de Valor Final 2","Suma de Giros (Valor en pesos)","Suma de Giros (Valor en pesos)2","Suma de Cuenta contratos","Suma de Cuenta contratos2",null,null,null,null,null,null,null,null,null,null,null,null,null,null,null,null,null,null,null,null,null,null,null,null,null,null,null,null,null,null,null,null,null,null,null,null,null,null,null,null,null,null,null,null,null,null,null,null,null,null,null,null,null,null,null,null,null,null,null,null,null,null,null,null,"Modalidad de Selección","Propósito","Equivalencia número de programa","Suma de Valor Final ","Suma de Valor Final 2","Suma de Giros (Valor en pesos)","Suma de Giros (Valor en pesos)2","Suma de Cuenta contratos","Suma de Cuenta contratos2"]
["Compraventa de bienes muebles","Propósito 1: Hacer un nuevo contrato social para incrementar la inclusión social, productiva y política","Sistema Distrital de Cuidado",345218700,1.0052340201534633E-2,0,0,1,3.1746031746031746E-3,null,null,null,null,null,null,null,null,null,null,null,null,null,null,null,null,null,null,null,null,null,null,null,null,null,null,null,null,null,null,null,null,null,null,null,null,null,null,null,null,null,null,null,null,null,null,null,null,null,null,null,null,null,null,null,null,null,null,null,null,null,null,null,null,"Concurso de méritos","Propósito 2 : Cambiar Nuestros Hábitos de Vida para Reverdecer a Bogotá y Adaptarnos y Mitigar la Crisis Climática","Eficiencia en la atención de emergencias",212977824,6.2016499750174817E-3,0,0,1,3.1746031746031746E-3]
[null,null,"Formación integral: más y mejor tiempo en los colegios",666799000,1.9416359525260631E-2,0,0,1,3.1746031746031746E-3,null,null,null,null,null,null,null,null,null,null,null,null,null,null,null,null,null,null,null,null,null,null,null,null,null,null,null,null,null,null,null,null,null,null,null,null,null,null,null,null,null,null,null,null,null,null,null,null,null,null,null,null,null,null,null,null,null,null,null,null,null,null,null,null,null,null,"Más árboles y más y mejor espacio público",118565081,3.4524680448495696E-3,0,0,1,3.1746031746031746E-3]
[null,"Propósito 5: Construir Bogotá - Región con gobierno abierto, transparente y ciudadanía consciente","Gestión pública local",105194893,3.0631447598291582E-3,105194892,5.9993657196802412E-3,2,6.3492063492063492E-3,null,null,null,null,null,null,null,null,null,null,null,null,null,null,null,null,null,null,null,null,null,null,null,null,null,null,null,null,null,null,null,null,null,null,null,null,null,null,null,null,null,null,null,null,null,null,null,null,null,null,null,null,null,null,null,null,null,null,null,null,null,null,null,null,null,"Propósito 5: Construir Bogotá - Región con gobierno abierto, transparente y ciudadanía consciente","Fortalecimiento de cultura ciudadana y su institucionalidad",81969580,2.3868524629080327E-3,0,0,1,3.1746031746031746E-3]
[null,null,"Fortalecimiento de cultura ciudadana y su institucionalidad",164854935,4.8003711575354373E-3,119437360,6.8116273481521146E-3,3,9.5238095238095247E-3,null,null,null,null,null,null,null,null,null,null,null,null,null,null,null,null,null,null,null,null,null,null,null,null,null,null,null,null,null,null,null,null,null,null,null,null,null,null,null,null,null,null,null,null,null,null,null,null,null,null,null,null,null,null,null,null,null,null,null,null,null,null,null,null,"Contratación directa","Propósito 1: Hacer un nuevo contrato social para incrementar la inclusión social, productiva y política","Bogotá región emprendedora e innovadora",1245360000,3.6263337974979833E-2,474280000,2.7048643897366661E-2,2,6.3492063492063492E-3]
[null,"Propósito 2 : Cambiar Nuestros Hábitos de Vida para Reverdecer a Bogotá y Adaptarnos y Mitigar la Crisis Climática","Eficiencia en la atención de emergencias",70454639,2.0515516685634637E-3,0,0,1,3.1746031746031746E-3,null,null,null,null,null,null,null,null,null,null,null,null,null,null,null,null,null,null,null,null,null,null,null,null,null,null,null,null,null,null,null,null,null,null,null,null,null,null,null,null,null,null,null,null,null,null,null,null,null,null,null,null,null,null,null,null,null,null,null,null,null,null,null,null,null,null,"Bogotá, referente en cultura, deporte, recreación y actividad física, con parques para el desarrollo y la salud",227201686,6.6158311876913052E-3,181761349,1.0366024296630643E-2,1,3.1746031746031746E-3]
["Contratos de prestación de servicios","Propósito 1: Hacer un nuevo contrato social para incrementar la inclusión social, productiva y política","Creación y vida cotidiana: Apropiación ciudadana del arte, la cultura y el patrimonio, para la democracia cultural",397207207,1.1566181018772704E-2,0,0,1,3.1746031746031746E-3,null,null,null,null,null,null,null,null,null,null,null,null,null,null,null,null,null,null,null,null,null,null,null,null,null,null,null,null,null,null,null,null,null,null,null,null,null,null,null,null,null,null,null,null,null,null,null,null,null,null,null,null,null,null,null,null,null,null,null,null,null,null,null,null,null,null,"Creación y vida cotidiana: Apropiación ciudadana del arte, la cultura y el patrimonio, para la democracia cultural",1053466000,3.0675622794332648E-2,1053466000,6.0080177726202381E-2,0,0]
[null,null,"Sistema Distrital de Cuidado",1356565863,3.9501514722882693E-2,38931053,2.2202753418792865E-3,4,1.2698412698412698E-2,null,null,null,null,null,null,null,null,null,null,null,null,null,null,null,null,null,null,null,null,null,null,null,null,null,null,null,null,null,null,null,null,null,null,null,null,null,null,null,null,null,null,null,null,null,null,null,null,null,null,null,null,null,null,null,null,null,null,null,null,null,null,null,null,null,null,"Jóvenes con capacidades: Proyecto de vida para la ciudadanía, la innovación y el trabajo del siglo XXI",2531277000,7.3707645467409447E-2,2531277000,0.14436115834231802,1,3.1746031746031746E-3]
[null,null,"Prevención y atención de maternidad temprana",221560645,6.4515710730949491E-3,44312129,2.527163274131682E-3,1,3.1746031746031746E-3,null,null,null,null,null,null,null,null,null,null,null,null,null,null,null,null,null,null,null,null,null,null,null,null,null,null,null,null,null,null,null,null,null,null,null,null,null,null,null,null,null,null,null,null,null,null,null,null,null,null,null,null,null,null,null,null,null,null,null,null,null,null,null,null,null,null,"Sistema Distrital de Cuidado",1029536265,2.9978818602808346E-2,0,0,2,6.3492063492063492E-3]
[null,null,"Bogotá, referente en cultura, deporte, recreación y actividad física, con parques para el desarrollo y la salud",87262085,2.5409636416429131E-3,0,0,1,3.1746031746031746E-3,null,null,null,null,null,null,null,null,null,null,null,null,null,null,null,null,null,null,null,null,null,null,null,null,null,null,null,null,null,null,null,null,null,null,null,null,null,null,null,null,null,null,null,null,null,null,null,null,null,null,null,null,null,null,null,null,null,null,null,null,null,null,null,null,null,null,"Subsidios y transferencias para la equidad",1151496221,3.3530141195345177E-2,928851557,5.297329636250226E-2,24,7.6190476190476197E-2]
[null,"Propósito 5: Construir Bogotá - Región con gobierno abierto, transparente y ciudadanía consciente","Gestión pública local",41653404,1.2128954415272506E-3,0,0,2,6.3492063492063492E-3,null,null,null,null,null,null,null,null,null,null,null,null,null,null,null,null,null,null,null,null,null,null,null,null,null,null,null,null,null,null,null,null,null,null,null,null,null,null,null,null,null,null,null,null,null,null,null,null,null,null,null,null,null,null,null,null,null,null,null,null,null,null,null,null,null,"Propósito 2 : Cambiar Nuestros Hábitos de Vida para Reverdecer a Bogotá y Adaptarnos y Mitigar la Crisis Climática","Bogotá protectora de los animales",837259000,2.4379943220910933E-2,0,0,1,3.1746031746031746E-3]
[null,null,"Fortalecimiento de cultura ciudadana y su institucionalidad",102530448,2.9855594274347135E-3,0,0,1,3.1746031746031746E-3,null,null,null,null,null,null,null,null,null,null,null,null,null,null,null,null,null,null,null,null,null,null,null,null,null,null,null,null,null,null,null,null,null,null,null,null,null,null,null,null,null,null,null,null,null,null,null,null,null,null,null,null,null,null,null,null,null,null,null,null,null,null,null,null,null,null,"Bogotá protectora de sus recursos naturales",495336000,1.4423569714118496E-2,0,0,1,3.1746031746031746E-3]
[null,"Propósito 2 : Cambiar Nuestros Hábitos de Vida para Reverdecer a Bogotá y Adaptarnos y Mitigar la Crisis Climática","Eficiencia en la atención de emergencias",102490499,2.9843961621228662E-3,0,0,1,3.1746031746031746E-3,null,null,null,null,null,null,null,null,null,null,null,null,null,null,null,null,null,null,null,null,null,null,null,null,null,null,null,null,null,null,null,null,null,null,null,null,null,null,null,null,null,null,null,null,null,null,null,null,null,null,null,null,null,null,null,null,null,null,null,null,null,null,null,null,null,null,"Cambio cultural para la gestión de la crisis climática",1092949000,3.1825318764386386E-2,0,0,1,3.1746031746031746E-3]
[null,"Propósito 4: Hacer de Bogotá Región un modelo de movilidad multimodal, incluyente y sostenible","Movilidad segura, sostenible y accesible",3555612,1.0353500968707362E-4,0,0,1,3.1746031746031746E-3,null,null,null,null,null,null,null,null,null,null,null,null,null,null,null,null,null,null,null,null,null,null,null,null,null,null,null,null,null,null,null,null,null,null,null,null,null,null,null,null,null,null,null,null,null,null,null,null,null,null,null,null,null,null,null,null,null,null,null,null,null,null,null,null,null,null,"Ecoeficiencia, reciclaje, manejo de residuos e inclusión de la población recicladora",1162897960,3.3862145687909184E-2,0,0,1,3.1746031746031746E-3]
[null,"Propósito 3: Inspirar confianza y legitimidad para vivir sin miedo y ser epicentro de cultura ciudadana, paz y reconciliación","Espacio público más seguro y construido colectivamente",302460000,8.8072599119229777E-3,0,0,1,3.1746031746031746E-3,null,null,null,null,null,null,null,null,null,null,null,null,null,null,null,null,null,null,null,null,null,null,null,null,null,null,null,null,null,null,null,null,null,null,null,null,null,null,null,null,null,null,null,null,null,null,null,null,null,null,null,null,null,null,null,null,null,null,null,null,null,null,null,null,null,null,"Eficiencia en la atención de emergencias",199350000,5.8048246493481639E-3,133633333,7.6212373221203021E-3,22,6.9841269841269843E-2]
["Contratos de prestación de servicios profesionales y de apoyo a la gestión","Propósito 1: Hacer un nuevo contrato social para incrementar la inclusión social, productiva y política","Subsidios y transferencias para la equidad",1151496221,3.3530141195345177E-2,928851557,5.297329636250226E-2,24,7.6190476190476197E-2,null,null,null,null,null,null,null,null,null,null,null,null,null,null,null,null,null,null,null,null,null,null,null,null,null,null,null,null,null,null,null,null,null,null,null,null,null,null,null,null,null,null,null,null,null,null,null,null,null,null,null,null,null,null,null,null,null,null,null,null,null,null,null,null,null,null,"Más árboles y más y mejor espacio público",165447000,4.8176113557095845E-3,0,0,0,0]
[null,"Propósito 5: Construir Bogotá - Región con gobierno abierto, transparente y ciudadanía consciente","Gestión pública local",8111506664,0.23619700941328867,6973104999,0.39768287504617167,186,0.59047619047619049,null,null,null,null,null,null,null,null,null,null,null,null,null,null,null,null,null,null,null,null,null,null,null,null,null,null,null,null,null,null,null,null,null,null,null,null,null,null,null,null,null,null,null,null,null,null,null,null,null,null,null,null,null,null,null,null,null,null,null,null,null,null,null,null,null,"Propósito 3: Inspirar confianza y legitimidad para vivir sin miedo y ser epicentro de cultura ciudadana, paz y reconciliación","Cultura ciudadana para la confianza, la convivencia y la participación desde la vida cotidiana",628530992,1.8302042614702051E-2,539049456,3.0742508177475793E-2,26,8.2539682539682538E-2]
[null,"Propósito 2 : Cambiar Nuestros Hábitos de Vida para Reverdecer a Bogotá y Adaptarnos y Mitigar la Crisis Climática","Eficiencia en la atención de emergencias",199350000,5.8048246493481639E-3,133633333,7.6212373221203021E-3,22,6.9841269841269843E-2,null,null,null,null,null,null,null,null,null,null,null,null,null,null,null,null,null,null,null,null,null,null,null,null,null,null,null,null,null,null,null,null,null,null,null,null,null,null,null,null,null,null,null,null,null,null,null,null,null,null,null,null,null,null,null,null,null,null,null,null,null,null,null,null,null,null,"Espacio público más seguro y construido colectivamente",260800000,7.5941724030599506E-3,173606666,9.900954893402784E-3,13,4.1269841269841269E-2]
[null,"Propósito 3: Inspirar confianza y legitimidad para vivir sin miedo y ser epicentro de cultura ciudadana, paz y reconciliación","Cultura ciudadana para la confianza, la convivencia y la participación desde la vida cotidiana",628530992,1.8302042614702051E-2,539049456,3.0742508177475793E-2,26,8.2539682539682538E-2,null,null,null,null,null,null,null,null,null,null,null,null,null,null,null,null,null,null,null,null,null,null,null,null,null,null,null,null,null,null,null,null,null,null,null,null,null,null,null,null,null,null,null,null,null,null,null,null,null,null,null,null,null,null,null,null,null,null,null,null,null,null,null,null,null,"Propósito 5: Construir Bogotá - Región con gobierno abierto, transparente y ciudadanía consciente","Fortalecimiento de cultura ciudadana y su institucionalidad",102530448,2.9855594274347135E-3,0,0,1,3.1746031746031746E-3]
[null,null,"Espacio público más seguro y construido colectivamente",260800000,7.5941724030599506E-3,173606666,9.900954893402784E-3,13,4.1269841269841269E-2,null,null,null,null,null,null,null,null,null,null,null,null,null,null,null,null,null,null,null,null,null,null,null,null,null,null,null,null,null,null,null,null,null,null,null,null,null,null,null,null,null,null,null,null,null,null,null,null,null,null,null,null,null,null,null,null,null,null,null,null,null,null,null,null,null,null,"Gestión pública local",8111506664,0.23619700941328867,6973104999,0.39768287504617167,186,0.59047619047619049]
["Contratos interadministrativos","Propósito 1: Hacer un nuevo contrato social para incrementar la inclusión social, productiva y política","Jóvenes con capacidades: Proyecto de vida para la ciudadanía, la innovación y el trabajo del siglo XXI",2531277000,7.3707645467409447E-2,2531277000,0.14436115834231802,1,3.1746031746031746E-3,null,null,null,null,null,null,null,null,null,null,null,null,null,null,null,null,null,null,null,null,null,null,null,null,null,null,null,null,null,null,null,null,null,null,null,null,null,null,null,null,null,null,null,null,null,null,null,null,null,null,null,null,null,null,null,null,null,null,null,null,null,null,null,null,"Contratación mínima cuantia","Propósito 3: Inspirar confianza y legitimidad para vivir sin miedo y ser epicentro de cultura ciudadana, paz y reconciliación","Plataforma institucional para la seguridad y justicia",12417650,3.615865603560483E-4,0,0,1,3.1746031746031746E-3]
[null,null,"Creación y vida cotidiana: Apropiación ciudadana del arte, la cultura y el patrimonio, para la democracia cultural",1053466000,3.0675622794332648E-2,1053466000,6.0080177726202381E-2,0,0,null,null,null,null,null,null,null,null,null,null,null,null,null,null,null,null,null,null,null,null,null,null,null,null,null,null,null,null,null,null,null,null,null,null,null,null,null,null,null,null,null,null,null,null,null,null,null,null,null,null,null,null,null,null,null,null,null,null,null,null,null,null,null,null,null,"Propósito 4: Hacer de Bogotá Región un modelo de movilidad multimodal, incluyente y sostenible","Movilidad segura, sostenible y accesible",3555612,1.0353500968707362E-4,0,0,1,3.1746031746031746E-3]
[null,null,"Sistema Distrital de Cuidado",1029536265,2.9978818602808346E-2,0,0,2,6.3492063492063492E-3,null,null,null,null,null,null,null,null,null,null,null,null,null,null,null,null,null,null,null,null,null,null,null,null,null,null,null,null,null,null,null,null,null,null,null,null,null,null,null,null,null,null,null,null,null,null,null,null,null,null,null,null,null,null,null,null,null,null,null,null,null,null,null,null,null,"Propósito 5: Construir Bogotá - Región con gobierno abierto, transparente y ciudadanía consciente","Gestión pública local",41653404,1.2128954415272506E-3,0,0,2,6.3492063492063492E-3]
[null,null,"Bogotá región emprendedora e innovadora",1245360000,3.6263337974979833E-2,474280000,2.7048643897366661E-2,2,6.3492063492063492E-3,null,null,null,null,null,null,null,null,null,null,null,null,null,null,null,null,null,null,null,null,null,null,null,null,null,null,null,null,null,null,null,null,null,null,null,null,null,null,null,null,null,null,null,null,null,null,null,null,null,null,null,null,null,null,null,null,null,null,null,null,null,null,null,null,"Licitación pública","Propósito 1: Hacer un nuevo contrato social para incrementar la inclusión social, productiva y política","Sistema Distrital de Cuidado",528478000,1.538862363199508E-2,0,0,1,3.1746031746031746E-3]
[null,null,"Bogotá, referente en cultura, deporte, recreación y actividad física, con parques para el desarrollo y la salud",227201686,6.6158311876913052E-3,181761349,1.0366024296630643E-2,1,3.1746031746031746E-3,null,null,null,null,null,null,null,null,null,null,null,null,null,null,null,null,null,null,null,null,null,null,null,null,null,null,null,null,null,null,null,null,null,null,null,null,null,null,null,null,null,null,null,null,null,null,null,null,null,null,null,null,null,null,null,null,null,null,null,null,null,null,null,null,null,"Propósito 2 : Cambiar Nuestros Hábitos de Vida para Reverdecer a Bogotá y Adaptarnos y Mitigar la Crisis Climática","Eficiencia en la atención de emergencias",2092337151,6.0926261694866875E-2,0,0,1,3.1746031746031746E-3]
[null,"Propósito 2 : Cambiar Nuestros Hábitos de Vida para Reverdecer a Bogotá y Adaptarnos y Mitigar la Crisis Climática","Bogotá protectora de los animales",837259000,2.4379943220910933E-2,0,0,1,3.1746031746031746E-3,null,null,null,null,null,null,null,null,null,null,null,null,null,null,null,null,null,null,null,null,null,null,null,null,null,null,null,null,null,null,null,null,null,null,null,null,null,null,null,null,null,null,null,null,null,null,null,null,null,null,null,null,null,null,null,null,null,null,null,null,null,null,null,null,null,null,"Más árboles y más y mejor espacio público",907000000,2.6410714607267544E-2,0,0,1,3.1746031746031746E-3]
[null,null,"Cambio cultural para la gestión de la crisis climática",1092949000,3.1825318764386386E-2,0,0,1,3.1746031746031746E-3,null,null,null,null,null,null,null,null,null,null,null,null,null,null,null,null,null,null,null,null,null,null,null,null,null,null,null,null,null,null,null,null,null,null,null,null,null,null,null,null,null,null,null,null,null,null,null,null,null,null,null,null,null,null,null,null,null,null,null,null,null,null,null,null,"Régimen especial","Propósito 1: Hacer un nuevo contrato social para incrementar la inclusión social, productiva y política","Sistema Distrital de Cuidado",4130597735,0.12027788085613091,3057411788,0.17436713060053785,2,6.3492063492063492E-3]
[null,null,"Ecoeficiencia, reciclaje, manejo de residuos e inclusión de la población recicladora",1162897960,3.3862145687909184E-2,0,0,1,3.1746031746031746E-3,null,null,null,null,null,null,null,null,null,null,null,null,null,null,null,null,null,null,null,null,null,null,null,null,null,null,null,null,null,null,null,null,null,null,null,null,null,null,null,null,null,null,null,null,null,null,null,null,null,null,null,null,null,null,null,null,null,null,null,null,null,null,null,null,null,"Propósito 3: Inspirar confianza y legitimidad para vivir sin miedo y ser epicentro de cultura ciudadana, paz y reconciliación","Bogotá territorio de paz y atención integral a las víctimas del conflicto armado",358968000,1.0452702757598253E-2,251277600,1.4330602854400229E-2,1,3.1746031746031746E-3]
[null,null,"Más árboles y más y mejor espacio público",165447000,4.8176113557095845E-3,0,0,0,0,null,null,null,null,null,null,null,null,null,null,null,null,null,null,null,null,null,null,null,null,null,null,null,null,null,null,null,null,null,null,null,null,null,null,null,null,null,null,null,null,null,null,null,null,null,null,null,null,null,null,null,null,null,null,null,null,null,null,null,null,null,null,null,null,null,null,"Cultura ciudadana para la confianza, la convivencia y la participación desde la vida cotidiana",60271000,1.7550167365982603E-3,36162600,2.0623878084737109E-3,1,3.1746031746031746E-3]
[null,null,"Bogotá protectora de sus recursos naturales",495336000,1.4423569714118496E-2,0,0,1,3.1746031746031746E-3,null,null,null,null,null,null,null,null,null,null,null,null,null,null,null,null,null,null,null,null,null,null,null,null,null,null,null,null,null,null,null,null,null,null,null,null,null,null,null,null,null,null,null,null,null,null,null,null,null,null,null,null,null,null,null,null,null,null,null,null,null,null,null,null,null,null,"Más mujeres viven una vida libre de violencias, se sienten seguras y acceden con confianza al sistema de justicia",1010227000,2.9416556764670417E-2,404090800,2.304568641182848E-2,0,0]
["Interventoría","Propósito 5: Construir Bogotá - Región con gobierno abierto, transparente y ciudadanía consciente","Fortalecimiento de cultura ciudadana y su institucionalidad",81969580,2.3868524629080327E-3,0,0,1,3.1746031746031746E-3,null,null,null,null,null,null,null,null,null,null,null,null,null,null,null,null,null,null,null,null,null,null,null,null,null,null,null,null,null,null,null,null,null,null,null,null,null,null,null,null,null,null,null,null,null,null,null,null,null,null,null,null,null,null,null,null,null,null,null,null,null,null,null,null,null,null,"Plataforma institucional para la seguridad y justicia",728966000,2.1226585429328988E-2,437379600,2.4944178646311613E-2,0,0]
[null,"Propósito 2 : Cambiar Nuestros Hábitos de Vida para Reverdecer a Bogotá y Adaptarnos y Mitigar la Crisis Climática","Más árboles y más y mejor espacio público",118565081,3.4524680448495696E-3,0,0,1,3.1746031746031746E-3,null,null,null,null,null,null,null,null,null,null,null,null,null,null,null,null,null,null,null,null,null,null,null,null,null,null,null,null,null,null,null,null,null,null,null,null,null,null,null,null,null,null,null,null,null,null,null,null,null,null,null,null,null,null,null,null,null,null,null,null,null,null,null,null,"Selección abreviada","Propósito 1: Hacer un nuevo contrato social para incrementar la inclusión social, productiva y política","Bogotá, referente en cultura, deporte, recreación y actividad física, con parques para el desarrollo y la salud",87262085,2.5409636416429131E-3,0,0,1,3.1746031746031746E-3]
[null,null,"Eficiencia en la atención de emergencias",212977824,6.2016499750174817E-3,0,0,1,3.1746031746031746E-3,null,null,null,null,null,null,null,null,null,null,null,null,null,null,null,null,null,null,null,null,null,null,null,null,null,null,null,null,null,null,null,null,null,null,null,null,null,null,null,null,null,null,null,null,null,null,null,null,null,null,null,null,null,null,null,null,null,null,null,null,null,null,null,null,null,null,"Creación y vida cotidiana: Apropiación ciudadana del arte, la cultura y el patrimonio, para la democracia cultural",397207207,1.1566181018772704E-2,0,0,1,3.1746031746031746E-3]
["Obra pública","Propósito 5: Construir Bogotá - Región con gobierno abierto, transparente y ciudadanía consciente","Fortalecimiento de cultura ciudadana y su institucionalidad",241594593,7.0349347810164907E-3,0,0,1,3.1746031746031746E-3,null,null,null,null,null,null,null,null,null,null,null,null,null,null,null,null,null,null,null,null,null,null,null,null,null,null,null,null,null,null,null,null,null,null,null,null,null,null,null,null,null,null,null,null,null,null,null,null,null,null,null,null,null,null,null,null,null,null,null,null,null,null,null,null,null,null,"Formación integral: más y mejor tiempo en los colegios",666799000,1.9416359525260631E-2,0,0,1,3.1746031746031746E-3]
[null,"Propósito 2 : Cambiar Nuestros Hábitos de Vida para Reverdecer a Bogotá y Adaptarnos y Mitigar la Crisis Climática","Más árboles y más y mejor espacio público",907000000,2.6410714607267544E-2,0,0,1,3.1746031746031746E-3,null,null,null,null,null,null,null,null,null,null,null,null,null,null,null,null,null,null,null,null,null,null,null,null,null,null,null,null,null,null,null,null,null,null,null,null,null,null,null,null,null,null,null,null,null,null,null,null,null,null,null,null,null,null,null,null,null,null,null,null,null,null,null,null,null,null,"Prevención y atención de maternidad temprana",221560645,6.4515710730949491E-3,44312129,2.527163274131682E-3,1,3.1746031746031746E-3]
[null,null,"Eficiencia en la atención de emergencias",2092337151,6.0926261694866875E-2,0,0,1,3.1746031746031746E-3,null,null,null,null,null,null,null,null,null,null,null,null,null,null,null,null,null,null,null,null,null,null,null,null,null,null,null,null,null,null,null,null,null,null,null,null,null,null,null,null,null,null,null,null,null,null,null,null,null,null,null,null,null,null,null,null,null,null,null,null,null,null,null,null,null,null,"Sistema Distrital de Cuidado",1173306563,3.4165231292422243E-2,38931053,2.2202753418792865E-3,4,1.2698412698412698E-2]
["Suministro","Propósito 1: Hacer un nuevo contrato social para incrementar la inclusión social, productiva y política","Subsidios y transferencias para la equidad",214509306,6.2462448306163437E-3,51107432,2.9147059304142735E-3,1,3.1746031746031746E-3,null,null,null,null,null,null,null,null,null,null,null,null,null,null,null,null,null,null,null,null,null,null,null,null,null,null,null,null,null,null,null,null,null,null,null,null,null,null,null,null,null,null,null,null,null,null,null,null,null,null,null,null,null,null,null,null,null,null,null,null,null,null,null,null,null,null,"Subsidios y transferencias para la equidad",214509306,6.2462448306163437E-3,51107432,2.9147059304142735E-3,1,3.1746031746031746E-3]
[null,"Propósito 4: Hacer de Bogotá Región un modelo de movilidad multimodal, incluyente y sostenible","Movilidad segura, sostenible y accesible",11500000,3.3486573096314965E-4,0,0,1,3.1746031746031746E-3,null,null,null,null,null,null,null,null,null,null,null,null,null,null,null,null,null,null,null,null,null,null,null,null,null,null,null,null,null,null,null,null,null,null,null,null,null,null,null,null,null,null,null,null,null,null,null,null,null,null,null,null,null,null,null,null,null,null,null,null,null,null,null,null,null,"Propósito 2 : Cambiar Nuestros Hábitos de Vida para Reverdecer a Bogotá y Adaptarnos y Mitigar la Crisis Climática","Eficiencia en la atención de emergencias",172945138,5.0359478306863294E-3,0,0,2,6.3492063492063492E-3]
[null,"Propósito 3: Inspirar confianza y legitimidad para vivir sin miedo y ser epicentro de cultura ciudadana, paz y reconciliación","Plataforma institucional para la seguridad y justicia",12417650,3.615865603560483E-4,0,0,1,3.1746031746031746E-3,null,null,null,null,null,null,null,null,null,null,null,null,null,null,null,null,null,null,null,null,null,null,null,null,null,null,null,null,null,null,null,null,null,null,null,null,null,null,null,null,null,null,null,null,null,null,null,null,null,null,null,null,null,null,null,null,null,null,null,null,null,null,null,null,null,"Propósito 3: Inspirar confianza y legitimidad para vivir sin miedo y ser epicentro de cultura ciudadana, paz y reconciliación","Espacio público más seguro y construido colectivamente",302460000,8.8072599119229777E-3,0,0,1,3.1746031746031746E-3]
["Convenios de cooperacion","Propósito 1: Hacer un nuevo contrato social para incrementar la inclusión social, productiva y política","Sistema Distrital de Cuidado",4130597735,0.12027788085613091,3057411788,0.17436713060053785,2,6.3492063492063492E-3,null,null,null,null,null,null,null,null,null,null,null,null,null,null,null,null,null,null,null,null,null,null,null,null,null,null,null,null,null,null,null,null,null,null,null,null,null,null,null,null,null,null,null,null,null,null,null,null,null,null,null,null,null,null,null,null,null,null,null,null,null,null,null,null,null,"Propósito 4: Hacer de Bogotá Región un modelo de movilidad multimodal, incluyente y sostenible","Movilidad segura, sostenible y accesible",11500000,3.3486573096314965E-4,0,0,1,3.1746031746031746E-3]
[null,"Propósito 3: Inspirar confianza y legitimidad para vivir sin miedo y ser epicentro de cultura ciudadana, paz y reconciliación","Bogotá territorio de paz y atención integral a las víctimas del conflicto armado",358968000,1.0452702757598253E-2,251277600,1.4330602854400229E-2,1,3.1746031746031746E-3,null,null,null,null,null,null,null,null,null,null,null,null,null,null,null,null,null,null,null,null,null,null,null,null,null,null,null,null,null,null,null,null,null,null,null,null,null,null,null,null,null,null,null,null,null,null,null,null,null,null,null,null,null,null,null,null,null,null,null,null,null,null,null,null,null,"Propósito 5: Construir Bogotá - Región con gobierno abierto, transparente y ciudadanía consciente","Fortalecimiento de cultura ciudadana y su institucionalidad",406449528,1.1835305938551928E-2,119437360,6.8116273481521146E-3,4,1.2698412698412698E-2]
[null,null,"Más mujeres viven una vida libre de violencias, se sienten seguras y acceden con confianza al sistema de justicia",1010227000,2.9416556764670417E-2,404090800,2.304568641182848E-2,0,0,null,null,null,null,null,null,null,null,null,null,null,null,null,null,null,null,null,null,null,null,null,null,null,null,null,null,null,null,null,null,null,null,null,null,null,null,null,null,null,null,null,null,null,null,null,null,null,null,null,null,null,null,null,null,null,null,null,null,null,null,null,null,null,null,null,null,"Gestión pública local",105194893,3.0631447598291582E-3,105194892,5.9993657196802412E-3,2,6.3492063492063492E-3]
[null,null,"Cultura ciudadana para la confianza, la convivencia y la participación desde la vida cotidiana",60271000,1.7550167365982603E-3,36162600,2.0623878084737109E-3,1,3.1746031746031746E-3,null,null,null,null,null,null,null,null,null,null,null,null,null,null,null,null,null,null,null,null,null,null,null,null,null,null,null,null,null,null,null,null,null,null,null,null,null,null,null,null,null,null,null,null,null,null,null,null,null,null,null,null,null,null,null,null,null,null,null,null,null,null,null,null,"Total general",null,null,34342122638,1,17534335614,1,315,1]
[null,null,"Plataforma institucional para la seguridad y justicia",728966000,2.1226585429328988E-2,437379600,2.4944178646311613E-2,0,0]
["Total general",null,null,34342122638,1,17534335614,1,315,1]
[]
[]
[]
[]
[]
[]
[]
[]
[]
[]
[]
[]
[]
[]
[]
[]
[]
[]
[]
[]
[]
[]
[]
[]
[]
[]
[]
[]
[]
[]
[]
[]
[]
[]
[]
[]
[]
[]
[]
[]
[]
[]
[]
[]
[]
[]
[]
[]
[]
[]
[]
[]
[]
[]
[]
[]
[]
[]
[]
[null,"INVERSION TIPO DE CONTRATO AÑO ANTERIORES SE SUMO EL NUMERO DE ADICIONES"]
[null,null,null,null,null,null,null,null,null,null,null,null,null,null,null,null,null,null,null,null,null,null,null,null,null,null,null,null,null,null,null,null,null,null,null,null,null,null,null,null,null,null,null,null,null,null,null,null,null,null,null,null,null,null,null,null,null,null,null,null,null,null,null,null,null,null,null,null,null,null,null,null,null,"FUNCIONAMIENTO POR MODALIDAD DE CONTRATO AÑOS ANTERIORES SE SUMO EL NUMERO DE ADICIONES"]
["Año","(Varios elementos)"]
["Afectación","Inversión",null,null,null,null,null,null,null,null,null,null,null,null,null,null,null,null,null,null,null,null,null,null,null,null,null,null,null,null,null,null,null,null,null,null,null,null,null,null,null,null,null,null,null,null,null,null,null,null,null,null,null,null,null,null,null,null,null,null,null,null,null,null,null,null,null,null,null,null,null,null,null,"Año","(Varios elementos)"]
[null,null,null,null,null,null,null,null,null,null,null,null,null,null,null,null,null,null,null,null,null,null,null,null,null,null,null,null,null,null,null,null,null,null,null,null,null,null,null,null,null,null,null,null,null,null,null,null,null,null,null,null,null,null,null,null,null,null,null,null,null,null,null,null,null,null,null,null,null,null,null,null,null,"Afectación","Inversión"]
[null,null,null,"Valores"]
["Tipo de contrato ","Propósito","Equivalencia número de programa","Suma de Valor Final ","Suma de Valor Final 2","Suma de Giros (Valor en pesos)","Suma de Giros (Valor en pesos)2","Suma de Número de adiciones","Suma de Número de adiciones2",null,null,null,null,null,null,null,null,null,null,null,null,null,null,null,null,null,null,null,null,null,null,null,null,null,null,null,null,null,null,null,null,null,null,null,null,null,null,null,null,null,null,null,null,null,null,null,null,null,null,null,null,null,null,null,null,null,null,null,null,null,null,null,null,null,null,"Valores"]
["Arrendamiento de bienes inmuebles","Propósito 4: Hacer de Bogotá Región un modelo de movilidad multimodal, incluyente y sostenible","Movilidad segura, sostenible y accesible",4167224,1.1440371697863804E-3,0,0,1,0.125,null,null,null,null,null,null,null,null,null,null,null,null,null,null,null,null,null,null,null,null,null,null,null,null,null,null,null,null,null,null,null,null,null,null,null,null,null,null,null,null,null,null,null,null,null,null,null,null,null,null,null,null,null,null,null,null,null,null,null,null,null,null,null,null,"Modalidad de Selección","Equivalencia número de programa","Suma de Valor Final ","Suma de Valor Final 2","Suma de Giros (Valor en pesos)","Suma de Giros (Valor en pesos)2","Suma de Número de adiciones","Suma de Número de adiciones2"]
["Contratos interadministrativos","Propósito 5: Construir Bogotá - Región con gobierno abierto, transparente y ciudadanía consciente","Fortalecimiento de cultura ciudadana y su institucionalidad",549045475,0.15073066177940492,0,0,1,0.125,null,null,null,null,null,null,null,null,null,null,null,null,null,null,null,null,null,null,null,null,null,null,null,null,null,null,null,null,null,null,null,null,null,null,null,null,null,null,null,null,null,null,null,null,null,null,null,null,null,null,null,null,null,null,null,null,null,null,null,null,null,null,null,null,"Concurso de méritos","Movilidad segura, sostenible y accesible",290234272,7.9678653010707007E-2,13782288,8.3522227065464791E-2,3,0.375]
["Interventoría","Propósito 4: Hacer de Bogotá Región un modelo de movilidad multimodal, incluyente y sostenible","Movilidad segura, sostenible y accesible",290234272,7.9678653010707007E-2,13782288,8.3522227065464791E-2,3,0.375,null,null,null,null,null,null,null,null,null,null,null,null,null,null,null,null,null,null,null,null,null,null,null,null,null,null,null,null,null,null,null,null,null,null,null,null,null,null,null,null,null,null,null,null,null,null,null,null,null,null,null,null,null,null,null,null,null,null,null,null,null,null,null,null,"Contratación directa","Fortalecimiento de cultura ciudadana y su institucionalidad",549045475,0.15073066177940492,0,0,1,0.125]
["Obra pública","Propósito 4: Hacer de Bogotá Región un modelo de movilidad multimodal, incluyente y sostenible","Movilidad segura, sostenible y accesible",2759113000,0.75746536006723164,151231128,0.91647777293453525,2,0.25,null,null,null,null,null,null,null,null,null,null,null,null,null,null,null,null,null,null,null,null,null,null,null,null,null,null,null,null,null,null,null,null,null,null,null,null,null,null,null,null,null,null,null,null,null,null,null,null,null,null,null,null,null,null,null,null,null,null,null,null,null,null,null,null,null,"Movilidad segura, sostenible y accesible",4167224,1.1440371697863804E-3,0,0,1,0.125]
["Suministro","Propósito 4: Hacer de Bogotá Región un modelo de movilidad multimodal, incluyente y sostenible","Movilidad segura, sostenible y accesible",40000000,1.0981287972870001E-2,0,0,1,0.125,null,null,null,null,null,null,null,null,null,null,null,null,null,null,null,null,null,null,null,null,null,null,null,null,null,null,null,null,null,null,null,null,null,null,null,null,null,null,null,null,null,null,null,null,null,null,null,null,null,null,null,null,null,null,null,null,null,null,null,null,null,null,null,null,"Licitación pública","Movilidad segura, sostenible y accesible",2759113000,0.75746536006723164,151231128,0.91647777293453525,2,0.25]
["Total general",null,null,3642559971,1,165013416,1,8,1,null,null,null,null,null,null,null,null,null,null,null,null,null,null,null,null,null,null,null,null,null,null,null,null,null,null,null,null,null,null,null,null,null,null,null,null,null,null,null,null,null,null,null,null,null,null,null,null,null,null,null,null,null,null,null,null,null,null,null,null,null,null,null,null,"Selección abreviada","Movilidad segura, sostenible y accesible",40000000,1.0981287972870001E-2,0,0,1,0.125]
[null,null,null,null,null,null,null,null,null,null,null,null,null,null,null,null,null,null,null,null,null,null,null,null,null,null,null,null,null,null,null,null,null,null,null,null,null,null,null,null,null,null,null,null,null,null,null,null,null,null,null,null,null,null,null,null,null,null,null,null,null,null,null,null,null,null,null,null,null,null,null,null,null,"Total general",null,3642559971,1,165013416,1,8,1]

{"sheet":"1. INFORMACION ACUMULADA","index":3,"n_rows":390,"n_cols":43,"rows_kept":390,"cut":false,"hidden":false,"merged":[[1,1,1,38],[2,1,2,38],[4,1,4,4],[4,9,4,11],[4,15,4,16],[4,23,4,38],[5,1,5,4],[5,9,5,11],[5,34,5,35],[6,1,6,4],[6,9,6,11],[6,34,6,35],[7,34,7,35],[8,1,8,4],[8,7,8,8],[8,11,9,16],[8,34,8,35],[9,1,9,4],[9,6,9,8],[9,34,9,35],[10,38,10,41],[11,3,11,4],[11,9,11,13],[11,16,11,21],[11,38,11,41],[10,1,10,21],[10,22,10,27],[10,28,10,33],[10,34,10,37]]}
[]
[null,"VEEDURIA DISTRITAL - INFORMACIÓN GESTION CONTRACTUAL"]
[null,"DEL 1 DE ENERO AL 31 DE DICIEMBRE DE 2021"]
[]
[null,"1. Entidad",null,null,null,null,null,null,"2. Sector"]
[null,"3. Presupuesto Disponible Inversión Directa PREDIS (BOGDATA)",null,null,null,64038050807,null,null,"5. Presupuesto Disponible Funcionamiento PREDIS (BOGDATA)",2748000000,null,null,null,null,null,null,null,null,null,null,null,null,null,null,null,null,null,null,null,null,null,null,null,null,"9. Nombre de quien diligencia el formato",null,"Mónica Yamile Quevedo Correa "]
[null,"4. Presupuesto Comprometido de Inversión Directa según PREDIS (BOGDATA)",null,null,null,57727387246,null,null,"6. Presupuesto Comprometido Funcionamiento según PREDIS (BOGDATA)",2673752818,null,null,null,null,null,null,null,null,null,null,null,null,null,null,null,null,null,null,null,null,null,null,null,null,"Cargo",null,"Profesional de Contratación "]
[null,null,null,null,null,null,null,null,null,null,null,null,null,null,null,null,null,null,null,null,null,null,null,null,null,null,null,null,null,null,null,null,null,null,"Dependencia",null,"Contratación"]
[null,"7. Presupuesto Disponible Operación (Régimen Privado)",null,null,null,null,null,null,null,null,null,null,null,null,null,null,null,null,null,null,null,null,null,null,null,null,null,null,null,null,null,null,null,null,"Teléfono",null,3212327585]
[null,"8. Presupuesto Comprometido Operación mediante contratos",null,null,null,null,null,null,null,null,null,null,null,null,null,null,null,null,null,null,null,null,null,null,null,null,null,null,null,null,null,null,null,null,"Correo Electrónico",null,"monica.quevedo@gobiernobogota.gov.co"]
[null,"1- INFORMACION GENERAL",null,null,null,null,null,null,null,null,null,null,null,null,null,null,null,null,null,null,null,null,"2- INFORMACION FINANCIERA",null,null,null,null,null,"3 - PLAZOS ",null,null,null,null,null,"4. CESION",null,null,null,"5. ESTADO",null,null,null,"6. %  Avance y/o cumplimiento"]
[null,null,2,3,null,4,5,6,7,8,null,null,null,null,9,10,11,null,null,null,null,null,12,13,14,15,null,null,18,19,20,21,22,23,24,25,26,27,28,null,null,null,29]
["Cuenta contratos","Número Contrato","Año","Número de proceso contractual \nSECOP","Link proceso SECOP","Tipo de contrato ","Modalidad de Selección","Procedimiento o causal","Objeto","Afectación","Plan de Desarrollo Distrital","Número Programa","Equivalencia número de programa","Propósito","Número Proyecto","Número de proponentes","Número  de Identificación del contratista\n(Cédula o NIT sin puntos, comas ni caracteres especiales y sin digito de verificación)","Nombre del contratista\n  (según el caso: nombres y apellidos o Razón social y Tipo societario)","Naturaleza Jurídica","Número  de Identificación del integrante del Consorcio o U.T.\n(Cédula o NIT sin puntos, comas ni caracteres especiales y sin digito de verificación)","Nombre del Integrante del Consorcio o U.T. y Tipo societario\n (Según el caso: nombres y apellidos o razón social y tipo societario)","% Participación (indicar solo el numero del porcentaje, sin caracteres especiales)","Valor Inicial del contrato","Valor total reducciones \n(En valor negativo)","Número de adiciones","Valor total de adiciones ","Valor Final ","Giros (Valor en pesos)","Fecha de suscripción (DD/MM/AAAA)","Fecha de inicio (DD/MM/AAAA)","Fecha de terminación (DD/MM/AAAA)","Plazo en días","Número de prórrogas","Prorroga en días","Número  de Identificación del cesionario\n(NIT sin digito de verificación)","Nombre cesionario","Fecha cesión\n(DD/MM/AAAA)","Valor cesión","Celebrado o por iniciar","En Ejecución","Terminado","Liquidado","% Avance y/o Cumplimiento"]
[1,76,2021,"FDLRUU-CD-076-2021","https://community.secop.gov.co/Public/Tendering/OpportunityDetail/Index?noticeUID=CO1.NTC.1766282&isFromPublicArea=True&isModal=False\n","Contratos de prestación de servicios profesionales y de apoyo a la gestión","Contratación directa","Prestación de servicios profesionales y de apoyo a la gestión, o para la ejecución de trabajos artísticos que sólo puedan encomendarse a determinadas personas naturales;","EL CONTRATISTA SE OBLIGA A PRESTAR SUS SERVICIOS PROFESIONALES EN EL ÁREA DE GESTIÓN DEL DESARROLLO LOCAL - PLANEACIÓN, REALIZANDO LAS ACTIVIDADES PROPIAS PARA LA FORMULACION, EJECUCIÓN Y SEGUIMIENTO DE LOS PROYECTOS DE INVERSIÓN DEL PLAN DE DESARROLLO LOCAL 2021 - 2024","Inversión","Un Nuevo Contrato Social y Ambiental para la Bogotá del Siglo XXI",57,{"$f":"IF(ISERROR(VLOOKUP(L14,Proposito_programa!$C$2:$E$59,2,FALSE)),\" \",VLOOKUP(L14,Proposito_programa!$C$2:$E$59,2,FALSE))","v":"Gestión pública local"},{"$f":"IF(ISERROR(VLOOKUP(L14,Proposito_programa!$C$2:$E$59,3,FALSE)),\" \",VLOOKUP(L14,Proposito_programa!$C$2:$E$59,3,FALSE))","v":"Propósito 5: Construir Bogotá - Región con gobierno abierto, transparente y ciudadanía consciente"},"133011605570000001697",1,52198468,"ZANDY DANIXA BARRERA RODRIGUEZ","Persona Natural",null,null,null,52000000,null,1,4853333,{"$f":"+W14+X14+Z14","v":56853333},39000000,44242,44243,44574,300,1,28,null,null,null,null,null,null,"X",null,{"$f":"IF(ISERROR(AB14/AA14),\"-\",(AB14/AA14))","v":0.68597561377799965}]
[1,292,2021,"FDLRUU-CD-292-2021","https://community.secop.gov.co/Public/Tendering/OpportunityDetail/Index?noticeUID=CO1.NTC.2254709&isFromPublicArea=True&isModal=False\n","Contratos de prestación de servicios profesionales y de apoyo a la gestión","Contratación directa","Prestación de servicios profesionales y de apoyo a la gestión, o para la ejecución de trabajos artísticos que sólo puedan encomendarse a determinadas personas naturales;","APOYAR JURÍDICAMENTE LA EJECUCIÓN DE LAS ACCIONES REQUERIDAS PARA LA DEPURACIÓN DE LAS ACTUACIONES ADMINISTRATIVAS QUE CURSAN EN LA ALCALDÍA LOCAL","Inversión","Un Nuevo Contrato Social y Ambiental para la Bogotá del Siglo XXI",57,{"$f":"IF(ISERROR(VLOOKUP(L15,Proposito_programa!$C$2:$E$59,2,FALSE)),\" \",VLOOKUP(L15,Proposito_programa!$C$2:$E$59,2,FALSE))","v":"Gestión pública local"},{"$f":"IF(ISERROR(VLOOKUP(L15,Proposito_programa!$C$2:$E$59,3,FALSE)),\" \",VLOOKUP(L15,Proposito_programa!$C$2:$E$59,3,FALSE))","v":"Propósito 5: Construir Bogotá - Región con gobierno abierto, transparente y ciudadanía consciente"},"133011605570000001698",1,79627943,"YUSED MAURICIO ROJAS ","Persona Natural",null,null,null,15600000,null,null,null,15600000,0,44459,44462,44552,90,null,null,null,null,null,null,null,null,"X",null,0]
[1,113,2021,"FDLRUU-CD-113-2021","https://community.secop.gov.co/Public/Tendering/OpportunityDetail/Index?noticeUID=CO1.NTC.1775767&isFromPublicArea=True&isModal=False\n","Contratos de prestación de servicios profesionales y de apoyo a la gestión","Contratación directa","Prestación de servicios profesionales y de apoyo a la gestión, o para la ejecución de trabajos artísticos que sólo puedan encomendarse a determinadas personas naturales;","PRESTAR LOS SERVICIOS PROFESIONALES COMO ABOGADO PARA APOYAR AL FONDO DE DESARROLLO LOCAL EN EL ANÁLISIS, REVISIÓN, TRÁMITE PARA COBRO PERSUASIVO Y COACTIVO, SOLICITUDES DE ENTES DE CONTROL, CORPORACIONES PÚBLICAS Y LOS CONCEPTOS JURÍDICOS QUE SE LE SOLICITEN","Inversión","Un Nuevo Contrato Social y Ambiental para la Bogotá del Siglo XXI",57,{"$f":"IF(ISERROR(VLOOKUP(L16,Proposito_programa!$C$2:$E$59,2,FALSE)),\" \",VLOOKUP(L16,Proposito_programa!$C$2:$E$59,2,FALSE))","v":"Gestión pública local"},{"$f":"IF(ISERROR(VLOOKUP(L16,Proposito_programa!$C$2:$E$59,3,FALSE)),\" \",VLOOKUP(L16,Proposito_programa!$C$2:$E$59,3,FALSE))","v":"Propósito 5: Construir Bogotá - Región con gobierno abierto, transparente y ciudadanía consciente"},"133011605570000001698",1,1033773166,"YURY TATIANA ANGULO PATIÑO","Persona Natural",null,null,null,57000000,null,null,null,57000000,53580000,44245,44246,44548,300,null,null,null,null,null,null,null,null,"X",null,0.94]
[1,16,2021,"FDLRUU-CD-016-2021","https://community.secop.gov.co/Public/Tendering/OpportunityDetail/Index?noticeUID=CO1.NTC.1713505&isFromPublicArea=True&isModal=False\n","Contratos de prestación de servicios profesionales y de apoyo a la gestión","Contratación directa","Prestación de servicios profesionales y de apoyo a la gestión, o para la ejecución de trabajos artísticos que sólo puedan encomendarse a determinadas personas naturales;","PRESTAR LOS SERVICIOS PROFESIONALES PARA DEPURAR LAS OBLIGACIONES POR PAGAR A CARGO DEL FONDO DE DESARROLLO DE RAFAEL URIBE URIBE","Inversión","Un Nuevo Contrato Social y Ambiental para la Bogotá del Siglo XXI",57,{"$f":"IF(ISERROR(VLOOKUP(L17,Proposito_programa!$C$2:$E$59,2,FALSE)),\" \",VLOOKUP(L17,Proposito_programa!$C$2:$E$59,2,FALSE))","v":"Gestión pública local"},{"$f":"IF(ISERROR(VLOOKUP(L17,Proposito_programa!$C$2:$E$59,3,FALSE)),\" \",VLOOKUP(L17,Proposito_programa!$C$2:$E$59,3,FALSE))","v":"Propósito 5: Construir Bogotá - Región con gobierno abierto, transparente y ciudadanía consciente"},"133011605570000001697",1,1101177020,"YIRLY NHAYIA PEÑA QUINTERO","Persona Natural",null,null,null,52000000,null,1,7280000,59280000,51826667,44225,44229,44574,300,1,42,null,null,null,null,null,null,"X",null,0.87426901147098512]
[1,154,2021,"FDLRUU-CD-150-2021","https://community.secop.gov.co/Public/Tendering/OpportunityDetail/Index?noticeUID=CO1.NTC.1800149&isFromPublicArea=True&isModal=False\n","Contratos de prestación de servicios profesionales y de apoyo a la gestión","Contratación directa","Prestación de servicios profesionales y de apoyo a la gestión, o para la ejecución de trabajos artísticos que sólo puedan encomendarse a determinadas personas naturales;","EL CONTRATISTA SE OBLIGA CON EL FONDO DE DESARROLLO LOCAL DE RAFAEL URIBE URIBE A PRESTAR SUS SERVICIOS DE APOYO A LA GESTION LOCAL Y TERRITORIAL DE LOS TEMAS DE SEGURIDAD Y CONVIVENCIA CIUDADANA PARA LA ALCALDIA LOCAL DE RAFAEL URIBE URIBE","Inversión","Un Nuevo Contrato Social y Ambiental para la Bogotá del Siglo XXI",43,{"$f":"IF(ISERROR(VLOOKUP(L18,Proposito_programa!$C$2:$E$59,2,FALSE)),\" \",VLOOKUP(L18,Proposito_programa!$C$2:$E$59,2,FALSE))","v":"Cultura ciudadana para la confianza, la convivencia y la participación desde la vida cotidiana"},{"$f":"IF(ISERROR(VLOOKUP(L18,Proposito_programa!$C$2:$E$59,3,FALSE)),\" \",VLOOKUP(L18,Proposito_programa!$C$2:$E$59,3,FALSE))","v":"Propósito 3: Inspirar confianza y legitimidad para vivir sin miedo y ser epicentro de cultura ciudadana, paz y reconciliación"},"133011603430000001680",1,1032410626,"YESID ALEJANDRO MORENO MARTINEZ","Persona Natural",null,null,null,19800000,null,1,1906667,21706667,18553333,44271,44273,44574,270,1,26,null,null,null,null,null,null,"X",null,0.85472970124800829]
[1,61,2021,"FDLRUU-CD-061-2021","https://community.secop.gov.co/Public/Tendering/OpportunityDetail/Index?noticeUID=CO1.NTC.1743765&isFromPublicArea=True&isModal=False\n","Contratos de prestación de servicios profesionales y de apoyo a la gestión","Contratación directa","Prestación de servicios profesionales y de apoyo a la gestión, o para la ejecución de trabajos artísticos que sólo puedan encomendarse a determinadas personas naturales;","PRESTAR LOS SERVICIOS PROFESIONALES PARA LA OPERACIÓN, PRESTACIÓN, SEGUIMIENTO Y CUMPLIMIENTO PROCEDIMIENTOS ADMINISTRATIVOS OPERATIVOS Y PROGRAMÁTICOS DEL SERVICIO APOYO ECONÓMICO TIPO C, QUE CONTRIBUYAN A LA GARANTÍA DE LOS DERECHOS DE LA POBLACIÓN MAYOR EN EL MARCO DE LA POLÍTICA PÚBLICA SOCIAL PARA EL ENVEJECIMIENTO Y LA VEJEZ EN EL DISTRITO CAPITAL A CARGO DE LA ALCALDÍA LOCAL RAFAEL URIBE URIBE.” ","Inversión","Un Nuevo Contrato Social y Ambiental para la Bogotá del Siglo XXI",1,{"$f":"IF(ISERROR(VLOOKUP(L19,Proposito_programa!$C$2:$E$59,2,FALSE)),\" \",VLOOKUP(L19,Proposito_programa!$C$2:$E$59,2,FALSE))","v":"Subsidios y transferencias para la equidad"},{"$f":"IF(ISERROR(VLOOKUP(L19,Proposito_programa!$C$2:$E$59,3,FALSE)),\" \",VLOOKUP(L19,Proposito_programa!$C$2:$E$59,3,FALSE))","v":"Propósito 1: Hacer un nuevo contrato social para incrementar la inclusión social, productiva y política"},"133011601010000001636",1,52834869,"YANILY ANDREA MONTENEGRO TRIVIÑO ","Persona Natural",null,null,null,41600000,null,null,null,41600000,34840000,44236,44237,44570,240,null,null,null,null,null,null,null,null,"X",null,0.83750000000000002]
[1,148,2021,"FDLRUU-CD-148","https://community.secop.gov.co/Public/Tendering/OpportunityDetail/Index?noticeUID=CO1.NTC.1796303&isFromPublicArea=True&isModal=False\n","Contratos de prestación de servicios profesionales y de apoyo a la gestión","Contratación directa","Prestación de servicios profesionales y de apoyo a la gestión, o para la ejecución de trabajos artísticos que sólo puedan encomendarse a determinadas personas naturales;","EL CONTRATISTA SE OBLIGA A PRESTAR SUS SERVICIOS PROFESIONALES EN EL ÁREA DE GESTIÓN DEL DESARROLLO LOCAL - PLANEACIÓN, REALIZANDO LAS ACTIVIDADES PROPIAS PARA LA FORMULACION, EJECUCIÓN Y SEGUIMIENTO DE LOS PROYECTOS DE INVERSIÓN DEL PLAN DE DESARROLLO LOCAL 2021 - 2024","Inversión","Un Nuevo Contrato Social y Ambiental para la Bogotá del Siglo XXI",57,{"$f":"IF(ISERROR(VLOOKUP(L20,Proposito_programa!$C$2:$E$59,2,FALSE)),\" \",VLOOKUP(L20,Proposito_programa!$C$2:$E$59,2,FALSE))","v":"Gestión pública local"},{"$f":"IF(ISERROR(VLOOKUP(L20,Proposito_programa!$C$2:$E$59,3,FALSE)),\" \",VLOOKUP(L20,Proposito_programa!$C$2:$E$59,3,FALSE))","v":"Propósito 5: Construir Bogotá - Región con gobierno abierto, transparente y ciudadanía consciente"},"133011605570000001697",1,1077859493,"YANDRY PATRICIA AMAYA CULMA ","Persona Natural",null,null,null,52000000,null,null,null,52000000,46453333,44252,44258,44563,300,null,null,null,null,null,null,null,null,"X",null,0.89333332692307688]
[1,37,2021,"FDLRUU-CD-037-2021","https://community.secop.gov.co/Public/Tendering/OpportunityDetail/Index?noticeUID=CO1.NTC.1729760&isFromPublicArea=True&isModal=False\n","Contratos de prestación de servicios profesionales y de apoyo a la gestión","Contratación directa","Prestación de servicios profesionales y de apoyo a la gestión, o para la ejecución de trabajos artísticos que sólo puedan encomendarse a determinadas personas naturales;","APOYAR LA GESTIÓN DOCUMENTAL DE LA ALCALDÍA LOCAL AL EQUIPO JURÍDICO DE DEPURACIÓN EN LAS LABORES OPERATIVAS QUE GENERA EL PROCESO DE IMPULSO DE LAS ACTUACIONES ADMINISTRATIVAS EXISTENTES EN LA ALCALDÍA LOCAL DE RAFAEL URIBE URIBE","Inversión","Un Nuevo Contrato Social y Ambiental para la Bogotá del Siglo XXI",57,{"$f":"IF(ISERROR(VLOOKUP(L21,Proposito_programa!$C$2:$E$59,2,FALSE)),\" \",VLOOKUP(L21,Proposito_programa!$C$2:$E$59,2,FALSE))","v":"Gestión pública local"},{"$f":"IF(ISERROR(VLOOKUP(L21,Proposito_programa!$C$2:$E$59,3,FALSE)),\" \",VLOOKUP(L21,Proposito_programa!$C$2:$E$59,3,FALSE))","v":"Propósito 5: Construir Bogotá - Región con gobierno abierto, transparente y ciudadanía consciente"},"133011605570000001698",1,1030548964,"XIMENA ALEJANDRA ALARCON LOPEZ ","Persona Natural",null,null,null,17500000,null,null,null,17500000,17266667,44230,44232,44534,300,null,null,null,null,null,null,null,null,"X",null,0.98666668571428573]
[1,90,2021,"FDLRUU-CD-090-2021","https://community.secop.gov.co/Public/Tendering/OpportunityDetail/Index?noticeUID=CO1.NTC.1756663&isFromPublicArea=True&isModal=False\n","Contratos de prestación de servicios profesionales y de apoyo a la gestión","Contratación directa","Prestación de servicios profesionales y de apoyo a la gestión, o para la ejecución de trabajos artísticos que sólo puedan encomendarse a determinadas personas naturales;","APOYAR LAS LABORES COMO NOTIFICADOR PARA LA DISTRIBUCIÓN DE LAS COMUNICACIONES EMITIDAS O RECIBIDAS POR LA ALCALDÍA LOCAL DE RAFAEL URIBE URIBE","Inversión","Un Nuevo Contrato Social y Ambiental para la Bogotá del Siglo XXI",57,{"$f":"IF(ISERROR(VLOOKUP(L22,Proposito_programa!$C$2:$E$59,2,FALSE)),\" \",VLOOKUP(L22,Proposito_programa!$C$2:$E$59,2,FALSE))","v":"Gestión pública local"},{"$f":"IF(ISERROR(VLOOKUP(L22,Proposito_programa!$C$2:$E$59,3,FALSE)),\" \",VLOOKUP(L22,Proposito_programa!$C$2:$E$59,3,FALSE))","v":"Propósito 5: Construir Bogotá - Región con gobierno abierto, transparente y ciudadanía consciente"},"133011605570000001697",1,79536458,"WILSON MIGUEL CARRANZA SIERRA","Persona Natural",null,null,null,17500000,null,1,933333,18433333,15108333,44239,44242,44560,300,1,16,79355789,"WILLIAM ARISTIZABAL ",44467,6066667,null,null,"X",null,0.81962024990271698]
[1,266,2021,"FDLRUU-CD-266-2021","https://community.secop.gov.co/Public/Tendering/OpportunityDetail/Index?noticeUID=CO1.NTC.2164245&isFromPublicArea=True&isModal=False\n","Contratos de prestación de servicios profesionales y de apoyo a la gestión","Contratación directa","Prestación de servicios profesionales y de apoyo a la gestión, o para la ejecución de trabajos artísticos que sólo puedan encomendarse a determinadas personas naturales;","“PRESTAR SUS SERVICIOS ASISTENCIALES PARA LA GESTIÓN DEL RIESGO, EN EL MARCO DE LOS VIGÍAS DEL RIESGO DE LA LOCALIDAD DE RAFAEL URIBE URIBE”","Inversión","Un Nuevo Contrato Social y Ambiental para la Bogotá del Siglo XXI",30,{"$f":"IF(ISERROR(VLOOKUP(L23,Proposito_programa!$C$2:$E$59,2,FALSE)),\" \",VLOOKUP(L23,Proposito_programa!$C$2:$E$59,2,FALSE))","v":"Eficiencia en la atención de emergencias"},{"$f":"IF(ISERROR(VLOOKUP(L23,Proposito_programa!$C$2:$E$59,3,FALSE)),\" \",VLOOKUP(L23,Proposito_programa!$C$2:$E$59,3,FALSE))","v":"Propósito 2 : Cambiar Nuestros Hábitos de Vida para Reverdecer a Bogotá y Adaptarnos y Mitigar la Crisis Climática"},"133011602300000001665",1,79742551,"WILSON HERNANDO\nALFONSO MORENO","Persona Natural",null,null,null,8100000,null,null,null,8100000,5400000,44420,44440,44576,135,null,null,80120580,"YESID FERNANDO PEDRAZA GONZALEZ",44440,8100000,null,null,"X",null,0.66666666666666663]
[1,294,2021,"FDLRUU-CD-294-2021","https://community.secop.gov.co/Public/Tendering/OpportunityDetail/Index?noticeUID=CO1.NTC.2268074&isFromPublicArea=True&isModal=False\n","Contratos de prestación de servicios profesionales y de apoyo a la gestión","Contratación directa","Prestación de servicios profesionales y de apoyo a la gestión, o para la ejecución de trabajos artísticos que sólo puedan encomendarse a determinadas personas naturales;","APOYAR JURÍDICAMENTE LA EJECUCIÓN DE LAS ACCIONES REQUERIDAS PARA LA DEPURACIÓN DE LAS ACTUACIONES ADMINISTRATIVAS QUE CURSAN EN LA ALCALDÍA LOCAL","Inversión","Un Nuevo Contrato Social y Ambiental para la Bogotá del Siglo XXI",57,{"$f":"IF(ISERROR(VLOOKUP(L24,Proposito_programa!$C$2:$E$59,2,FALSE)),\" \",VLOOKUP(L24,Proposito_programa!$C$2:$E$59,2,FALSE))","v":"Gestión pública local"},{"$f":"IF(ISERROR(VLOOKUP(L24,Proposito_programa!$C$2:$E$59,3,FALSE)),\" \",VLOOKUP(L24,Proposito_programa!$C$2:$E$59,3,FALSE))","v":"Propósito 5: Construir Bogotá - Región con gobierno abierto, transparente y ciudadanía consciente"},"133011605570000001698",1,1022402850,"WILMER JAVIER HERNANDEZ LASSO","Persona Natural",null,null,null,15600000,null,null,null,15600000,5200000,44462,44470,44561,90,null,null,null,null,null,null,null,null,"X",null,0.33333333333333331]
[1,213,2021,"FDLRUU-CD-213-2021","https://community.secop.gov.co/Public/Tendering/OpportunityDetail/Index?noticeUID=CO1.NTC.1890582&isFromPublicArea=True&isModal=False\n","Contratos de prestación de servicios profesionales y de apoyo a la gestión","Contratación directa","Prestación de servicios profesionales y de apoyo a la gestión, o para la ejecución de trabajos artísticos que sólo puedan encomendarse a determinadas personas naturales;","APOYAR JURÍDICAMENTE LA EJECUCIÓN DE LAS ACCIONES REQUERIDAS PARA LA DEPURACIÓN DE LAS ACTUACIONES ADMINISTRATIVAS QUE CURSAN EN LA ALCALDÍA LOCAL”","Inversión","Un Nuevo Contrato Social y Ambiental para la Bogotá del Siglo XXI",57,{"$f":"IF(ISERROR(VLOOKUP(L25,Proposito_programa!$C$2:$E$59,2,FALSE)),\" \",VLOOKUP(L25,Proposito_programa!$C$2:$E$59,2,FALSE))","v":"Gestión pública local"},{"$f":"IF(ISERROR(VLOOKUP(L25,Proposito_programa!$C$2:$E$59,3,FALSE)),\" \",VLOOKUP(L25,Proposito_programa!$C$2:$E$59,3,FALSE))","v":"Propósito 5: Construir Bogotá - Región con gobierno abierto, transparente y ciudadanía consciente"},"133011605570000001698",1,80030678,"WILLIAM HOANNY AMADOR RAMOS","Persona Natural",null,null,null,31200000,null,null,null,31200000,24613333,44292,44295,44477,180,null,null,null,null,null,null,null,null,"X",null,0.78888887820512821]
[1,156,2021,"FDLRUU-CD-150-2021","https://community.secop.gov.co/Public/Tendering/OpportunityDetail/Index?noticeUID=CO1.NTC.1800149&isFromPublicArea=True&isModal=False\n","Contratos de prestación de servicios profesionales y de apoyo a la gestión","Contratación directa","Prestación de servicios profesionales y de apoyo a la gestión, o para la ejecución de trabajos artísticos que sólo puedan encomendarse a determinadas personas naturales;","EL CONTRATISTA SE OBLIGA CON EL FONDO DE DESARROLLO LOCAL DE RAFAEL URIBE URIBE A PRESTAR SUS SERVICIOS DE APOYO A LA GESTION LOCAL Y TERRITORIAL DE LOS TEMAS DE SEGURIDAD Y CONVIVENCIA CIUDADANA PARA LA ALCALDIA LOCAL DE RAFAEL URIBE URIBE","Inversión","Un Nuevo Contrato Social y Ambiental para la Bogotá del Siglo XXI",43,{"$f":"IF(ISERROR(VLOOKUP(L26,Proposito_programa!$C$2:$E$59,2,FALSE)),\" \",VLOOKUP(L26,Proposito_programa!$C$2:$E$59,2,FALSE))","v":"Cultura ciudadana para la confianza, la convivencia y la participación desde la vida cotidiana"},{"$f":"IF(ISERROR(VLOOKUP(L26,Proposito_programa!$C$2:$E$59,3,FALSE)),\" \",VLOOKUP(L26,Proposito_programa!$C$2:$E$59,3,FALSE))","v":"Propósito 3: Inspirar confianza y legitimidad para vivir sin miedo y ser epicentro de cultura ciudadana, paz y reconciliación"},"133011603430000001680",1,79640008,"WILLIAM BOLIVAR MACA ","Persona Natural",null,null,null,19800000,null,1,3153333,22953333,19800000,44253,44256,44574,270,1,43,null,null,null,null,null,null,"X",null,0.86261982083386324]
[1,78,2021,"FDLRUU-CD-078-2021","https://community.secop.gov.co/Public/Tendering/OpportunityDetail/Index?noticeUID=CO1.NTC.1756298&isFromPublicArea=True&isModal=False\n","Contratos de prestación de servicios profesionales y de apoyo a la gestión","Contratación directa","Prestación de servicios profesionales y de apoyo a la gestión, o para la ejecución de trabajos artísticos que sólo puedan encomendarse a determinadas personas naturales;","APOYAR Y DAR SOPORTE TÉCNICO AL ADMINISTRADOR Y USUARIO FINAL DE LA RED DE SISTEMAS Y TECNOLOGÍA E INFORMACIÓN DE LA ALCALDÍA LOCAL DE RAFAEL URIBE URIBE","Inversión","Un Nuevo Contrato Social y Ambiental para la Bogotá del Siglo XXI",57,{"$f":"IF(ISERROR(VLOOKUP(L27,Proposito_programa!$C$2:$E$59,2,FALSE)),\" \",VLOOKUP(L27,Proposito_programa!$C$2:$E$59,2,FALSE))","v":"Gestión pública local"},{"$f":"IF(ISERROR(VLOOKUP(L27,Proposito_programa!$C$2:$E$59,3,FALSE)),\" \",VLOOKUP(L27,Proposito_programa!$C$2:$E$59,3,FALSE))","v":"Propósito 5: Construir Bogotá - Región con gobierno abierto, transparente y ciudadanía consciente"},"133011605570000001697",1,52316051,"WALDINA CONTRERAS ALFONSO","Persona Natural",null,null,null,39000000,null,1,4160000,43160000,37570000,44238,44239,44574,300,1,32,null,null,null,null,null,null,"X",null,0.87048192771084343]
[1,110,2021,"FDLRUU-CD-110-2021","https://community.secop.gov.co/Public/Tendering/OpportunityDetail/Index?noticeUID=CO1.NTC.1776731&isFromPublicArea=True&isModal=False\n","Contratos de prestación de servicios profesionales y de apoyo a la gestión","Contratación directa","Prestación de servicios profesionales y de apoyo a la gestión, o para la ejecución de trabajos artísticos que sólo puedan encomendarse a determinadas personas naturales;","PRESTAR LOS SERVICIOS PROFESIONALES PARA LA OPERACIÓN, PRESTACIÓN, SEGUIMIENTO Y CUMPLIMIENTO PROCEDIMIENTOS ADMINISTRATIVOS OPERATIVOS Y PROGRAMÁTICOS DEL SERVICIO APOYO ECONÓMICO TIPO C, QUE CONTRIBUYAN A LA GARANTÍA DE LOS DERECHOS DE LA POBLACIÓN MAYOR EN EL MARCO DE LA POLÍTICA PÚBLICA SOCIAL PARA EL ENVEJECIMIENTO Y LA VEJEZ EN EL DISTRITO CAPITAL A CARGO DE LA ALCALDÍA LOCAL RAFAEL URIBE URIBE”","Inversión","Un Nuevo Contrato Social y Ambiental para la Bogotá del Siglo XXI",1,{"$f":"IF(ISERROR(VLOOKUP(L28,Proposito_programa!$C$2:$E$59,2,FALSE)),\" \",VLOOKUP(L28,Proposito_programa!$C$2:$E$59,2,FALSE))","v":"Subsidios y transferencias para la equidad"},{"$f":"IF(ISERROR(VLOOKUP(L28,Proposito_programa!$C$2:$E$59,3,FALSE)),\" \",VLOOKUP(L28,Proposito_programa!$C$2:$E$59,3,FALSE))","v":"Propósito 1: Hacer un nuevo contrato social para incrementar la inclusión social, productiva y política"},"133011601010000001636",1,1026272955,"VIVIANA CAROLINA MALDONADO VIRGUEZ","Persona Natural",null,null,null,41600000,null,1,10053333,51653333,45066666,44245,44258,44568,240,1,58,null,null,null,null,null,null,"X",null,0.87248321420033048]
[1,318,2021,"FDLRUU-MC-319-2021","https://community.secop.gov.co/Public/Tendering/OpportunityDetail/Index?noticeUID=CO1.NTC.2443542&isFromPublicArea=True&isModal=False\n","Contratos de prestación de servicios","Contratación mínima cuantia","No aplica","PRESTACIÓN DEL SERVICIO DE MONITOREO DE GPS Y MEDICIÓN DE VARIABLES DE OPERACIÓN DE LOS VEHÍCULOS LIVIANOS Y MAQUINARIA PESADA DEL FONDO DE DESARROLLO LOCAL RAFAEL URIBE URIBE","Inversión","Un Nuevo Contrato Social y Ambiental para la Bogotá del Siglo XXI",49,{"$f":"IF(ISERROR(VLOOKUP(L29,Proposito_programa!$C$2:$E$59,2,FALSE)),\" \",VLOOKUP(L29,Proposito_programa!$C$2:$E$59,2,FALSE))","v":"Movilidad segura, sostenible y accesible"},{"$f":"IF(ISERROR(VLOOKUP(L29,Proposito_programa!$C$2:$E$59,3,FALSE)),\" \",VLOOKUP(L29,Proposito_programa!$C$2:$E$59,3,FALSE))","v":"Propósito 4: Hacer de Bogotá Región un modelo de movilidad multimodal, incluyente y sostenible"},"133011604490000001685",1,900465924,"VISATEL DE COLOMBIA S A S","Persona Jurídica",null,null,null,3555612,null,null,null,3555612,0,44547,"CELEBRADO SIN INICIAR","CELEBRADO SIN INICIAR",210,null,null,null,null,null,null,"X",null,null,null,0]
[0,318,2021,"FDLRUU-MC-319-2021","https://community.secop.gov.co/Public/Tendering/OpportunityDetail/Index?noticeUID=CO1.NTC.2443542&isFromPublicArea=True&isModal=False\n","Contratos de prestación de servicios","Contratación mínima cuantia","No aplica","PRESTACIÓN DEL SERVICIO DE MONITOREO DE GPS Y MEDICIÓN DE VARIABLES DE OPERACIÓN DE LOS VEHÍCULOS LIVIANOS Y MAQUINARIA PESADA DEL FONDO DE DESARROLLO LOCAL RAFAEL URIBE URIBE","Funcionamiento","Un Nuevo Contrato Social y Ambiental para la Bogotá del Siglo XXI","No aplica",{"$f":"IF(ISERROR(VLOOKUP(L30,Proposito_programa!$C$2:$E$59,2,FALSE)),\" \",VLOOKUP(L30,Proposito_programa!$C$2:$E$59,2,FALSE))","v":" "},{"$f":"IF(ISERROR(VLOOKUP(L30,Proposito_programa!$C$2:$E$59,3,FALSE)),\" \",VLOOKUP(L30,Proposito_programa!$C$2:$E$59,3,FALSE))","v":" "},null,1,900465924,"VISATEL DE COLOMBIA S A S","Persona Jurídica",null,null,null,3591528,null,null,null,3591528,"-",44547,"CELEBRADO SIN INICIAR","CELEBRADO SIN INICIAR",210,null,null,null,null,null,null,"X",null,null,null,"-"]
[1,65,2021,"FDLRUU-CD-065-2021","https://community.secop.gov.co/Public/Tendering/OpportunityDetail/Index?noticeUID=CO1.NTC.1745736&isFromPublicArea=True&isModal=False\n","Contratos de prestación de servicios profesionales y de apoyo a la gestión","Contratación directa","Prestación de servicios profesionales y de apoyo a la gestión, o para la ejecución de trabajos artísticos que sólo puedan encomendarse a determinadas personas naturales;","PRESTAR LOS SERVICIOS PERSONALES DE APOYO A LA GESTIÓN PARA LA CONDUCCIÓN DE LOS VEHÍCULOS LIVIANOS QUE LE SEAN ASIGNADOS Y QUE SE ENCUENTREN AL SERVICIO DE LA ALCALDÍA LOCAL DE RAFAEL URIBE URIBE","Inversión","Un Nuevo Contrato Social y Ambiental para la Bogotá del Siglo XXI",57,{"$f":"IF(ISERROR(VLOOKUP(L31,Proposito_programa!$C$2:$E$59,2,FALSE)),\" \",VLOOKUP(L31,Proposito_programa!$C$2:$E$59,2,FALSE))","v":"Gestión pública local"},{"$f":"IF(ISERROR(VLOOKUP(L31,Proposito_programa!$C$2:$E$59,3,FALSE)),\" \",VLOOKUP(L31,Proposito_programa!$C$2:$E$59,3,FALSE))","v":"Propósito 5: Construir Bogotá - Región con gobierno abierto, transparente y ciudadanía consciente"},"133011605570000001697",1,79258775,"VICTOR JAIME SANCHEZ CARDOZO","Persona Natural",null,null,null,26000000,null,1,2860000,28860000,25133333,44236,44238,44574,300,1,33,null,null,null,null,null,null,"X",null,0.87087085932085928]
[1,27,2021,"CPS-027-2021","https://community.secop.gov.co/Public/Tendering/OpportunityDetail/Index?noticeUID=CO1.NTC.1721687&isFromPublicArea=True&isModal=False\n","Contratos de prestación de servicios profesionales y de apoyo a la gestión","Contratación directa","Prestación de servicios profesionales y de apoyo a la gestión, o para la ejecución de trabajos artísticos que sólo puedan encomendarse a determinadas personas naturales;","PRESTAR LOS SERVICIOS TECNICOS DE APOYO A LOS PROFESIONALES ENCARGADOS DE LA DEPURACION DE LAS OBLIGACIONES POR PAGAR A CARGO DEL FONDO DE DESARROLLO LOCAL DE RAFAEL URIBE URIBE”","Inversión","Un Nuevo Contrato Social y Ambiental para la Bogotá del Siglo XXI",57,{"$f":"IF(ISERROR(VLOOKUP(L32,Proposito_programa!$C$2:$E$59,2,FALSE)),\" \",VLOOKUP(L32,Proposito_programa!$C$2:$E$59,2,FALSE))","v":"Gestión pública local"},{"$f":"IF(ISERROR(VLOOKUP(L32,Proposito_programa!$C$2:$E$59,3,FALSE)),\" \",VLOOKUP(L32,Proposito_programa!$C$2:$E$59,3,FALSE))","v":"Propósito 5: Construir Bogotá - Región con gobierno abierto, transparente y ciudadanía consciente"},"133011605570000001697",1,1097332656,"VIANEY LUCIA ARDILA AVILA ","Persona Natural",null,null,null,39000000,null,1,5460000,44460000,38870000,44228,44228,44574,300,1,42,null,null,null,null,null,null,"X",null,0.8742690058479532]
[1,216,2021,"FDLRUU-CD-216-2021","https://community.secop.gov.co/Public/Tendering/OpportunityDetail/Index?noticeUID=CO1.NTC.1897422&isFromPublicArea=True&isModal=False\n","Contratos de prestación de servicios profesionales y de apoyo a la gestión","Contratación directa","Prestación de servicios profesionales y de apoyo a la gestión, o para la ejecución de trabajos artísticos que sólo puedan encomendarse a determinadas personas naturales;","APOYAR AL ALCALDE LOCAL EN LA FORMULACIÓN, SEGUIMIENTO E IMPLEMENTACIÓN DE LA ESTRATEGIA LOCAL PARA LA TERMINACIÓN JURÍDICA DE LAS ACTUACIONES ADMINISTRATIVAS QUE CURSAN EN LA ALCALDÍA LOCAL","Inversión","Un Nuevo Contrato Social y Ambiental para la Bogotá del Siglo XXI",57,{"$f":"IF(ISERROR(VLOOKUP(L33,Proposito_programa!$C$2:$E$59,2,FALSE)),\" \",VLOOKUP(L33,Proposito_programa!$C$2:$E$59,2,FALSE))","v":"Gestión pública local"},{"$f":"IF(ISERROR(VLOOKUP(L33,Proposito_programa!$C$2:$E$59,3,FALSE)),\" \",VLOOKUP(L33,Proposito_programa!$C$2:$E$59,3,FALSE))","v":"Propósito 5: Construir Bogotá - Región con gobierno abierto, transparente y ciudadanía consciente"},"133011605570000001698",1,1010169789,"VANESSA DOMINGUEZ PALOMINO","Persona Natural",null,null,null,68000000,null,null,null,68000000,44880000,44293,44299,44604,300,null,null,null,null,null,null,null,"X",null,null,0.66]
[1,238,2021,"FDLRUU-CD-238-2021 ","https://community.secop.gov.co/Public/Tendering/OpportunityDetail/Index?noticeUID=CO1.NTC.2094199&isFromPublicArea=True&isModal=False\n","Contratos de prestación de servicios profesionales y de apoyo a la gestión","Contratación directa","Prestación de servicios profesionales y de apoyo a la gestión, o para la ejecución de trabajos artísticos que sólo puedan encomendarse a determinadas personas naturales;","PRESTAR LOS SERVICIOS PROFESIONALES AL DESPACHO DE LA ALCALDÍA LOCAL DE RAFAEL URIBE URIBE EN LA EJECUCION DE ACTIVIDADES DE ORDEN ADMINISTRATIVO Y DE GESTION QUE SE LE SOLICITEN","Inversión","Un Nuevo Contrato Social y Ambiental para la Bogotá del Siglo XXI",57,{"$f":"IF(ISERROR(VLOOKUP(L34,Proposito_programa!$C$2:$E$59,2,FALSE)),\" \",VLOOKUP(L34,Proposito_programa!$C$2:$E$59,2,FALSE))","v":"Gestión pública local"},{"$f":"IF(ISERROR(VLOOKUP(L34,Proposito_programa!$C$2:$E$59,3,FALSE)),\" \",VLOOKUP(L34,Proposito_programa!$C$2:$E$59,3,FALSE))","v":"Propósito 5: Construir Bogotá - Región con gobierno abierto, transparente y ciudadanía consciente"},"133011605570000001697",1,1020799677,"VALENTINA RICO CALDERON ","Persona Natural",null,null,null,17600000,null,1,4546667,22146667,17160000,44390,44393,44561,120,1,28,null,null,null,null,null,null,"X",null,0.774834425423925]
[1,245,2021,"FDLRUU-CD-245-2021 ","https://community.secop.gov.co/Public/Tendering/OpportunityDetail/Index?noticeUID=CO1.NTC.2110522&isFromPublicArea=True&isModal=False\n","Contratos interadministrativos","Contratación directa","Contratos interadministrativos","DESARROLLAR ASPECTOS TÉCNICOS, FINANCIEROS Y ADMINISTRATIVOS PARA REALIZAR LA IMPLEMENTACIÓN DE PROCESOS COMUNITARIOS DE EDUCACIÓN AMBIENTAL PROCEDA EN EL MARCO DEL PROYECTO DE INVERSIÓN 1660”","Inversión","Un Nuevo Contrato Social y Ambiental para la Bogotá del Siglo XXI",27,{"$f":"IF(ISERROR(VLOOKUP(L35,Proposito_programa!$C$2:$E$59,2,FALSE)),\" \",VLOOKUP(L35,Proposito_programa!$C$2:$E$59,2,FALSE))","v":"Cambio cultural para la gestión de la crisis climática"},{"$f":"IF(ISERROR(VLOOKUP(L35,Proposito_programa!$C$2:$E$59,3,FALSE)),\" \",VLOOKUP(L35,Proposito_programa!$C$2:$E$59,3,FALSE))","v":"Propósito 2 : Cambiar Nuestros Hábitos de Vida para Reverdecer a Bogotá y Adaptarnos y Mitigar la Crisis Climática"},"133011602270000001660",1,899999063,"UNIVERSIDAD NACIONAL DE COLOMBIA ","Persona Jurídica",null,null,null,819210000,null,null,null,819210000,0,44412,44440,44651,180,null,null,null,null,null,null,null,"X",null,null,0]
[1,299,2021,"FDLRUU-CD-299-2021 ","https://community.secop.gov.co/Public/Tendering/OpportunityDetail/Index?noticeUID=CO1.NTC.2348836&isFromPublicArea=True&isModal=False\n","Contratos interadministrativos","Contratación directa","Contratos interadministrativos","AUNAR ESFUERZOS TÉCNICOS ADMINISTATIVOS, Y FINANCIEROS PARA REALIZAR ACCIONES EN EL BIENESTAR ANIMAL DE LA LOCALIDAD DE RAFAEL URIBE URIBE QUE FORTALEZCAN LAS REDES LOCALES DE PROTECCIONISTAS DE ANIMALES Y ATENCIÓN EN URGENCIAS, BRIGADAS MÉDICO-VETERINARIAS Y ACCIONES DE ESTERILIZACIÓN, EDUCACIÓN Y ADOPCIÓN EN EL MARCO DEL PROYECTO DE INVERSIÓN 1673","Inversión","Un Nuevo Contrato Social y Ambiental para la Bogotá del Siglo XXI",34,{"$f":"IF(ISERROR(VLOOKUP(L36,Proposito_programa!$C$2:$E$59,2,FALSE)),\" \",VLOOKUP(L36,Proposito_programa!$C$2:$E$59,2,FALSE))","v":"Bogotá protectora de los animales"},{"$f":"IF(ISERROR(VLOOKUP(L36,Proposito_programa!$C$2:$E$59,3,FALSE)),\" \",VLOOKUP(L36,Proposito_programa!$C$2:$E$59,3,FALSE))","v":"Propósito 2 : Cambiar Nuestros Hábitos de Vida para Reverdecer a Bogotá y Adaptarnos y Mitigar la Crisis Climática"},"133011602340000001673",1,899999063,"UNIVERSIDAD NACIONAL DE COLOMBIA ","Persona Jurídica",null,null,null,837259000,null,null,null,837259000,0,44504,44511,44691,180,null,null,null,null,null,null,null,"X",null,null,0]
[1,318,2019,"19-12-10231507","https://www.contratos.gov.co/consultas/detalleProceso.do?numConstancia=19-12-10231507","Contratos interadministrativos","Contratación directa","Contratos interadministrativos","FORTALECER ORGANIZACIONES INSTANCIAS Y EXPRESIONES SOCIALES CIUDADANAS E EL MARCO DEL MODELO DE PARTICIPACION UNO MAS UNO = TODOS, UNA MAS UNA =TODAS Y BRINDAR FORMACION EN MECANISMOS DE CONTROL SOCIAL Y POLITICAS PUBLICAS EN LA LOCALIDAD DE RAFAEL URIBE","Inversión","Un Nuevo Contrato Social y Ambiental para la Bogotá del Siglo XXI",55,{"$f":"IF(ISERROR(VLOOKUP(L37,Proposito_programa!$C$2:$E$59,2,FALSE)),\" \",VLOOKUP(L37,Proposito_programa!$C$2:$E$59,2,FALSE))","v":"Fortalecimiento de cultura ciudadana y su institucionalidad"},{"$f":"IF(ISERROR(VLOOKUP(L37,Proposito_programa!$C$2:$E$59,3,FALSE)),\" \",VLOOKUP(L37,Proposito_programa!$C$2:$E$59,3,FALSE))","v":"Propósito 5: Construir Bogotá - Región con gobierno abierto, transparente y ciudadanía consciente"},"133011605550000001689",1,899999036,"UNIVERSIDAD NACIONAL DE COLOMBIA","Persona Jurídica",null,null,null,null,null,1,549045475,549045475,0,44408,44408,44740,885,5,525,null,null,null,null,null,"X",null,null,0]
[1,252,2021,"FDLRUU-CD-252-2021","https://community.secop.gov.co/Public/Tendering/OpportunityDetail/Index?noticeUID=CO1.NTC.2209095&isFromPublicArea=True&isModal=False\n","Contratos interadministrativos","Contratación directa","Contratos interadministrativos","AUNAR ESFUERZOS TECNICOS, ECONÓMICOS Y FINANCIEROS PARA REALIZAR UNA ACCIÓN QUE FORTALEZCA EL PROGRAMA DE AGRICULTURA URBANA Y A SU VEZ EJECUTAR PROCESOS DE JARDINERIA Y COBERTURAS VERDES EN EL MARCO DE LOS PROYECTOS DE INVERSION 1649 Y 1660","Inversión","Un Nuevo Contrato Social y Ambiental para la Bogotá del Siglo XXI",24,{"$f":"IF(ISERROR(VLOOKUP(L38,Proposito_programa!$C$2:$E$59,2,FALSE)),\" \",VLOOKUP(L38,Proposito_programa!$C$2:$E$59,2,FALSE))","v":"Bogotá región emprendedora e innovadora"},{"$f":"IF(ISERROR(VLOOKUP(L38,Proposito_programa!$C$2:$E$59,3,FALSE)),\" \",VLOOKUP(L38,Proposito_programa!$C$2:$E$59,3,FALSE))","v":"Propósito 1: Hacer un nuevo contrato social para incrementar la inclusión social, productiva y política"},"133011601240000001649",1,860512780,"UNIVERSIDAD NACIONAL ABIERTA Y A DISTANCIA-UNAD ","Persona Jurídica",null,null,null,771080000,null,null,null,{"$f":"+W38+X38+Z38","v":771080000},0,44438,44445,44656,210,null,null,null,null,null,null,null,"X",null,null,0]
[0,252,2021,"FDLRUU-CD-252-2021","https://community.secop.gov.co/Public/Tendering/OpportunityDetail/Index?noticeUID=CO1.NTC.2209095&isFromPublicArea=True&isModal=False\n","Contratos interadministrativos","Contratación directa","Contratos interadministrativos","AUNAR ESFUERZOS TECNICOS, ECONÓMICOS Y FINANCIEROS PARA REALIZAR UNA ACCIÓN QUE FORTALEZCA EL PROGRAMA DE AGRICULTURA URBANA Y A SU VEZ EJECUTAR PROCESOS DE JARDINERIA Y COBERTURAS VERDES EN EL MARCO DE LOS PROYECTOS DE INVERSION 1649 Y 1660","Inversión","Un Nuevo Contrato Social y Ambiental para la Bogotá del Siglo XXI",27,{"$f":"IF(ISERROR(VLOOKUP(L39,Proposito_programa!$C$2:$E$59,2,FALSE)),\" \",VLOOKUP(L39,Proposito_programa!$C$2:$E$59,2,FALSE))","v":"Cambio cultural para la gestión de la crisis climática"},{"$f":"IF(ISERROR(VLOOKUP(L39,Proposito_programa!$C$2:$E$59,3,FALSE)),\" \",VLOOKUP(L39,Proposito_programa!$C$2:$E$59,3,FALSE))","v":"Propósito 2 : Cambiar Nuestros Hábitos de Vida para Reverdecer a Bogotá y Adaptarnos y Mitigar la Crisis Climática"},"133011602270000001660",1,860512780,"UNIVERSIDAD NACIONAL ABIERTA Y A DISTANCIA-UNAD ","Persona Jurídica",null,null,null,273739000,null,null,null,273739000,0,44438,44445,44656,210,null,null,null,null,null,null,null,"X",null,null,0]
[1,307,2021,"FDLRUU-CD-307-2021","https://community.secop.gov.co/Public/Tendering/OpportunityDetail/Index?noticeUID=CO1.NTC.2390010&isFromPublicArea=True&isModal=False\n","Contratos interadministrativos","Contratación directa","Contratos interadministrativos","UNAR ESFUERZOS TECNICOS, ADMINISTRATIVOS, FINANCIEROS Y JURIDICOS, PARA DESARROLLAR ESTRATEGIAS DE FORMACION, ASISTENCIA TÉCNICA, FORTALECIMIENTO Y COMERCIALIZACIÓN, ENFOCADAS A MATERIALIZAR LAS INICIATIVAS CIUDADANAS PRIORIZADAS, DERIVADAS DEL EJERCICIO DE PRESUPUESTOS PARTICIPATIVOS FASE UNO AÑO 2020 EN LA LOCALIDAD DE RAFAEL URIBE URIBE EN EL MARCO DEL PROYECTO 1653 OPORTUNIDADES PARA EL DESARROLLO ECONOMICO CULTURAL Y CREATIVO","Inversión","Un Nuevo Contrato Social y Ambiental para la Bogotá del Siglo XXI",6,{"$f":"IF(ISERROR(VLOOKUP(L40,Proposito_programa!$C$2:$E$59,2,FALSE)),\" \",VLOOKUP(L40,Proposito_programa!$C$2:$E$59,2,FALSE))","v":"Sistema Distrital de Cuidado"},{"$f":"IF(ISERROR(VLOOKUP(L40,Proposito_programa!$C$2:$E$59,3,FALSE)),\" \",VLOOKUP(L40,Proposito_programa!$C$2:$E$59,3,FALSE))","v":"Propósito 1: Hacer un nuevo contrato social para incrementar la inclusión social, productiva y política"},"133011601060000001653",1,860512780,"UNIVERSIDAD NACIONAL ABIERTA Y A DISTANCIA-UNAD","Persona Jurídica",null,null,null,223147265,null,null,null,223147265,0,44512,"CELEBRADO SIN INICIAR","CELEBRADO SIN INICIAR",150,null,null,null,null,null,null,"X",null,null,null,0]
[1,253,2021,"FDLRUU-CD-253-2021","https://community.secop.gov.co/Public/Tendering/OpportunityDetail/Index?noticeUID=CO1.NTC.2229818&isFromPublicArea=True&isModal=False\n","Contratos interadministrativos","Contratación directa","Contratos interadministrativos","REALIZAR ACCIONES DE RESTAURACIÓN, REHABILITACIÓN O RECUPERACIÓN EN ÁREAS PRIORITARIAS Y DE VALOR AMBIENTAL, A SU VEZ REALIZAR ACCIONES DE MANTENIMIENTO Y PLANTACIÓN DE ÁRBOLES EN LA LOCALIDAD DE RAFAEL URIBE URIBE EN EL MARCO DE LOS PROYECTOS DE INVERSIÓN 1661 Y 1667","Inversión","Un Nuevo Contrato Social y Ambiental para la Bogotá del Siglo XXI",28,{"$f":"IF(ISERROR(VLOOKUP(L41,Proposito_programa!$C$2:$E$59,2,FALSE)),\" \",VLOOKUP(L41,Proposito_programa!$C$2:$E$59,2,FALSE))","v":"Bogotá protectora de sus recursos naturales"},{"$f":"IF(ISERROR(VLOOKUP(L41,Proposito_programa!$C$2:$E$59,3,FALSE)),\" \",VLOOKUP(L41,Proposito_programa!$C$2:$E$59,3,FALSE))","v":"Propósito 2 : Cambiar Nuestros Hábitos de Vida para Reverdecer a Bogotá y Adaptarnos y Mitigar la Crisis Climática"},"133011602280000001661",1,899999230,"UNIVERSIDAD DISTRITAL-FRANCISCO JOSE DE CALDAS","Persona Jurídica",null,null,null,495336000,null,null,null,{"$f":"+W41+X41+Z41","v":495336000},0,44449,44460,44671,210,null,null,null,null,null,null,null,"X",null,null,0]
[0,253,2021,"FDLRUU-CD-253-2021","https://community.secop.gov.co/Public/Tendering/OpportunityDetail/Index?noticeUID=CO1.NTC.2229818&isFromPublicArea=True&isModal=False\n","Contratos interadministrativos","Contratación directa","Contratos interadministrativos","REALIZAR ACCIONES DE RESTAURACIÓN, REHABILITACIÓN O RECUPERACIÓN EN ÁREAS PRIORITARIAS Y DE VALOR AMBIENTAL, A SU VEZ REALIZAR ACCIONES DE MANTENIMIENTO Y PLANTACIÓN DE ÁRBOLES EN LA LOCALIDAD DE RAFAEL URIBE URIBE EN EL MARCO DE LOS PROYECTOS DE INVERSIÓN 1661 Y 1667","Inversión","Un Nuevo Contrato Social y Ambiental para la Bogotá del Siglo XXI",33,{"$f":"IF(ISERROR(VLOOKUP(L42,Proposito_programa!$C$2:$E$59,2,FALSE)),\" \",VLOOKUP(L42,Proposito_programa!$C$2:$E$59,2,FALSE))","v":"Más árboles y más y mejor espacio público"},{"$f":"IF(ISERROR(VLOOKUP(L42,Proposito_programa!$C$2:$E$59,3,FALSE)),\" \",VLOOKUP(L42,Proposito_programa!$C$2:$E$59,3,FALSE))","v":"Propósito 2 : Cambiar Nuestros Hábitos de Vida para Reverdecer a Bogotá y Adaptarnos y Mitigar la Crisis Climática"},"133011602330000001667",1,899999230,"UNIVERSIDAD DISTRITAL-FRANCISCO JOSE DE CALDAS","Persona Jurídica",null,null,null,165447000,null,null,null,165447000,0,44449,44460,44671,210,null,null,null,null,null,null,null,"X",null,null,0]
[1,305,2021,"FDLRUU-CIA-305-2021","https://community.secop.gov.co/Public/Tendering/OpportunityDetail/Index?noticeUID=CO1.NTC.2383074&isFromPublicArea=True&isModal=False\n","Contratos interadministrativos","Contratación directa","Contratos interadministrativos","REALIZAR ACCIONES QUE INCENTIVEN EL CAMBIO DE HÁBITOS DE CONSUMO DE LA LOCALIDAD DE RAFAEL URIBE URIBE A TRAVÉS DEL AHORRO Y USO SOSTENIBLE DE LOS RECURSOS NATURALES DE LA LOCALIDAD EN EL MARCO DEL PROYECTO DE INVERSIÓN 1675","Inversión","Un Nuevo Contrato Social y Ambiental para la Bogotá del Siglo XXI",38,{"$f":"IF(ISERROR(VLOOKUP(L43,Proposito_programa!$C$2:$E$59,2,FALSE)),\" \",VLOOKUP(L43,Proposito_programa!$C$2:$E$59,2,FALSE))","v":"Ecoeficiencia, reciclaje, manejo de residuos e inclusión de la población recicladora"},{"$f":"IF(ISERROR(VLOOKUP(L43,Proposito_programa!$C$2:$E$59,3,FALSE)),\" \",VLOOKUP(L43,Proposito_programa!$C$2:$E$59,3,FALSE))","v":"Propósito 2 : Cambiar Nuestros Hábitos de Vida para Reverdecer a Bogotá y Adaptarnos y Mitigar la Crisis Climática"},"133011602380000001675",1,899999230,"UNIVERSIDAD DISTRITAL FRANCISCO JOSE DE CALDAS","Persona Jurídica",null,null,null,1162897960,null,null,null,1162897960,0,44512,44526,44706,180,null,null,null,null,null,null,null,"X",null,null,0]
[1,66472,2021,"OC-66472","https://www.colombiacompra.gov.co/tienda-virtual-del-estado-colombiano/ordenes-compra/66472","Compraventa de bienes muebles","Selección abreviada","Acuerdo marco de precios ","CONTRATAR LA ADQUISICION DE LICENCIAS\nOFFICE 365 – HERRAMIENTA COLABORATIVA Y\nDE CORREO ELECTRÓNICO PARA LA ALCALDÍA\nLOCAL DE RAFAEL URIBE URIBE","Inversión","Un Nuevo Contrato Social y Ambiental para la Bogotá del Siglo XXI",57,{"$f":"IF(ISERROR(VLOOKUP(L44,Proposito_programa!$C$2:$E$59,2,FALSE)),\" \",VLOOKUP(L44,Proposito_programa!$C$2:$E$59,2,FALSE))","v":"Gestión pública local"},{"$f":"IF(ISERROR(VLOOKUP(L44,Proposito_programa!$C$2:$E$59,3,FALSE)),\" \",VLOOKUP(L44,Proposito_programa!$C$2:$E$59,3,FALSE))","v":"Propósito 5: Construir Bogotá - Región con gobierno abierto, transparente y ciudadanía consciente"},"133011605570000001697",1,"901399373\n","UNION TEMPORAL  DELL  EMC","Unión Temporal",830035246,"DELL COLOMBIA INC ",0.5,95857837,null,null,null,95857837,95857836,44285,44291,44320,30,null,null,null,null,null,null,null,null,"X",null,0.99999998956788483]
[0,66472,2021,"OC-66472","https://www.colombiacompra.gov.co/tienda-virtual-del-estado-colombiano/ordenes-compra/66472","Compraventa de bienes muebles","Selección abreviada","Acuerdo marco de precios ","CONTRATAR LA ADQUISICION DE LICENCIAS\nOFFICE 365 – HERRAMIENTA COLABORATIVA Y\nDE CORREO ELECTRÓNICO PARA LA ALCALDÍA\nLOCAL DE RAFAEL URIBE URIBE","Inversión","Un Nuevo Contrato Social y Ambiental para la Bogotá del Siglo XXI",57,{"$f":"IF(ISERROR(VLOOKUP(L45,Proposito_programa!$C$2:$E$59,2,FALSE)),\" \",VLOOKUP(L45,Proposito_programa!$C$2:$E$59,2,FALSE))","v":"Gestión pública local"},{"$f":"IF(ISERROR(VLOOKUP(L45,Proposito_programa!$C$2:$E$59,3,FALSE)),\" \",VLOOKUP(L45,Proposito_programa!$C$2:$E$59,3,FALSE))","v":"Propósito 5: Construir Bogotá - Región con gobierno abierto, transparente y ciudadanía consciente"},"133011605570000001697",1,"901399373\n","UNION TEMPORAL  DELL  EMC","Unión Temporal",900129331,"EMC INFORMATION SYSTEMS COLOMBIANA LTDA",0.5,0,null,null,null,0,0,44285,44291,44320,30,null,null,null,null,null,null,null,null,"X",null,"-"]
[1,269,2021,"FDLRUU-CD-269-2021","https://community.secop.gov.co/Public/Tendering/OpportunityDetail/Index?noticeUID=CO1.NTC.2164939&isFromPublicArea=True&isModal=False\n","Contratos de prestación de servicios profesionales y de apoyo a la gestión","Contratación directa","Prestación de servicios profesionales y de apoyo a la gestión, o para la ejecución de trabajos artísticos que sólo puedan encomendarse a determinadas personas naturales;","\tPRESTAR SUS SERVICIOS ASISTENCIALES PARA LA GESTIÓN DEL RIESGO, EN EL MARCO DE LOS VIGÍAS DEL RIESGO DE LA LOCALIDAD DE RAFAEL URIBE URIBE","Inversión","Un Nuevo Contrato Social y Ambiental para la Bogotá del Siglo XXI",30,{"$f":"IF(ISERROR(VLOOKUP(L46,Proposito_programa!$C$2:$E$59,2,FALSE)),\" \",VLOOKUP(L46,Proposito_programa!$C$2:$E$59,2,FALSE))","v":"Eficiencia en la atención de emergencias"},{"$f":"IF(ISERROR(VLOOKUP(L46,Proposito_programa!$C$2:$E$59,3,FALSE)),\" \",VLOOKUP(L46,Proposito_programa!$C$2:$E$59,3,FALSE))","v":"Propósito 2 : Cambiar Nuestros Hábitos de Vida para Reverdecer a Bogotá y Adaptarnos y Mitigar la Crisis Climática"},"133011602300000001665",1,1031160707,"ULISES RUIZ CONTRERAS ","Persona Natural",null,null,null,8100000,null,null,null,8100000,6240000,44418,44425,44562,135,null,null,1020834737,"LAURA ALEJANDRA BARRAGAN MONTENEGRO",44434,7500000,null,null,"X",null,0.77037037037037037]
[1,81,2021,"FDLRUU-CD-081-2021","https://community.secop.gov.co/Public/Tendering/OpportunityDetail/Index?noticeUID=CO1.NTC.1760964&isFromPublicArea=True&isModal=False\n","Contratos de prestación de servicios profesionales y de apoyo a la gestión","Contratación directa","Prestación de servicios profesionales y de apoyo a la gestión, o para la ejecución de trabajos artísticos que sólo puedan encomendarse a determinadas personas naturales;","PRESTAR LOS SERVICIOS PROFESIONALES PARA LA REVISIÓN Y/O ELABORACIÓN DE LOS DOCUMENTOS Y GESTIONES RELACIONADAS CON TEMAS ADMINISTRATIVOS CONTABLES Y FINANCIEROS DEL FONDO DE DESARROLLO LOCAL DE RAFAEL URIBE URIBE","Inversión","Un Nuevo Contrato Social y Ambiental para la Bogotá del Siglo XXI",57,{"$f":"IF(ISERROR(VLOOKUP(L47,Proposito_programa!$C$2:$E$59,2,FALSE)),\" \",VLOOKUP(L47,Proposito_programa!$C$2:$E$59,2,FALSE))","v":"Gestión pública local"},{"$f":"IF(ISERROR(VLOOKUP(L47,Proposito_programa!$C$2:$E$59,3,FALSE)),\" \",VLOOKUP(L47,Proposito_programa!$C$2:$E$59,3,FALSE))","v":"Propósito 5: Construir Bogotá - Región con gobierno abierto, transparente y ciudadanía consciente"},"133011605570000001697",1,1033762488,"TANIA XIMENA MORALES CASTIBLANCO ","Persona Natural",null,null,null,43000000,null,1,4586667,47586667,41423333,44239,44239,44574,300,1,32,null,null,null,null,null,null,"X",null,0.87048191460856039]
[1,235,2021,"FDLRUU-CD-235-2021 ","https://community.secop.gov.co/Public/Tendering/OpportunityDetail/Index?noticeUID=CO1.NTC.2093989&isFromPublicArea=True&isModal=False\n","Contratos interadministrativos","Contratación directa","Contratos interadministrativos","AUNAR ESFUERZOS TÉCNICOS, ADMINISTRATIVOS Y FINANCIEROS ENTRE LA SUBRED INTEGRADA DE SERVICIOS DE SALUD CENTRO ORIENTE Y EL FDLRUU PARA EL OTORGAMIENTO DE DISPOSITIVOS DE ASISTENCIA PERSONAL DAP, QUE NO SE ENCUENTREN INCLUIDOS EN LOS PLANES DE BENEFICIOS DE SALUD A PERSONAS CON DISCAPACIDAD PERMANENTE RESIDENTES EN LA LOCALIDAD RAFAEL URIBE URIBE DANDO RESPUESTA A SUS NECESIDADES TERRITORIALES EN PRO DE MEJORAR SU CALIDAD DE VIDA Y LA DE SUS CUIDADORES, EN EN EL MARCO DEL PROYECTO DE INVERSIÓN","Inversión","Un Nuevo Contrato Social y Ambiental para la Bogotá del Siglo XXI",6,{"$f":"IF(ISERROR(VLOOKUP(L48,Proposito_programa!$C$2:$E$59,2,FALSE)),\" \",VLOOKUP(L48,Proposito_programa!$C$2:$E$59,2,FALSE))","v":"Sistema Distrital de Cuidado"},{"$f":"IF(ISERROR(VLOOKUP(L48,Proposito_programa!$C$2:$E$59,3,FALSE)),\" \",VLOOKUP(L48,Proposito_programa!$C$2:$E$59,3,FALSE))","v":"Propósito 1: Hacer un nuevo contrato social para incrementar la inclusión social, productiva y política"},"133011601060000001658",1,900959051,"SUBRED INTEGRADA DE SERVICIOS DE SALUD CENTRO ORIENTE E.S.E","Persona Jurídica",null,null,null,806389000,null,null,null,806389000,0,44393,44405,44647,240,null,null,null,null,null,null,null,"X",null,null,0]
[1,287,2021,"FDLRUU-MC-279-2021","https://community.secop.gov.co/Public/Tendering/OpportunityDetail/Index?noticeUID=CO1.NTC.2211076&isFromPublicArea=True&isModal=False\n","Suministro","Contratación mínima cuantia","Prestación de servicios profesionales y de apoyo a la gestión, o para la ejecución de trabajos artísticos que sólo puedan encomendarse a determinadas personas naturales;","SUMINISTRAR 1 DOTACION LOGISTICA A LA ESTACION 18 DE POLICIA DE RAFEL URIBE URIBE EN EL MARCO DEL PROYECTO DE INVERSION 1684","Inversión","Un Nuevo Contrato Social y Ambiental para la Bogotá del Siglo XXI",48,{"$f":"IF(ISERROR(VLOOKUP(L49,Proposito_programa!$C$2:$E$59,2,FALSE)),\" \",VLOOKUP(L49,Proposito_programa!$C$2:$E$59,2,FALSE))","v":"Plataforma institucional para la seguridad y justicia"},{"$f":"IF(ISERROR(VLOOKUP(L49,Proposito_programa!$C$2:$E$59,3,FALSE)),\" \",VLOOKUP(L49,Proposito_programa!$C$2:$E$59,3,FALSE))","v":"Propósito 3: Inspirar confianza y legitimidad para vivir sin miedo y ser epicentro de cultura ciudadana, paz y reconciliación"},"133011603480000001684",1,830053792,"STRATEGY S.A.S","Persona Jurídica",null,null,null,12417650,null,null,null,12417650,0,44455,44477,44599,120,null,null,null,null,null,null,null,"X",null,null,0]
[1,115,2021,"FDLRUU-CD-115-2021","https://community.secop.gov.co/Public/Tendering/OpportunityDetail/Index?noticeUID=CO1.NTC.1775087&isFromPublicArea=True&isModal=False\n","Contratos de prestación de servicios profesionales y de apoyo a la gestión","Contratación directa","Prestación de servicios profesionales y de apoyo a la gestión, o para la ejecución de trabajos artísticos que sólo puedan encomendarse a determinadas personas naturales;","PRESTAR LOS SERVICIOS DE APOYO A LA GESTIÓN PARA EL MANEJO DE LOS DOCUMENTOS OFICIALES, MEDIANTE LA APLICACIÓN E IMPLEMENTACIÓN DEL SISTEMA ORFEO, EN LAS DIFERENTES DEPENDENCIAS DE LA ALCALDIA LOCAL DE RAFAEL URIBE URIBE.\t ","Inversión","Un Nuevo Contrato Social y Ambiental para la Bogotá del Siglo XXI",57,{"$f":"IF(ISERROR(VLOOKUP(L50,Proposito_programa!$C$2:$E$59,2,FALSE)),\" \",VLOOKUP(L50,Proposito_programa!$C$2:$E$59,2,FALSE))","v":"Gestión pública local"},{"$f":"IF(ISERROR(VLOOKUP(L50,Proposito_programa!$C$2:$E$59,3,FALSE)),\" \",VLOOKUP(L50,Proposito_programa!$C$2:$E$59,3,FALSE))","v":"Propósito 5: Construir Bogotá - Región con gobierno abierto, transparente y ciudadanía consciente"},"133011605570000001697",1,1030587570,"STEPHANIE ANDREA ARIAS RIVERA","Persona Natural",null,null,null,33000000,null,1,2750000,35750000,31020000,44245,44246,44574,300,1,25,null,null,null,null,null,null,"X",null,0.86769230769230765]
[1,63094,2020,"OC-63094","https://www.colombiacompra.gov.co/tienda-virtual-del-estado-colombiano/ordenes-compra/63094","Suministro","Selección abreviada","Acuerdo marco de precios ","CONTRATAR EL SERVICIO DE IMPRESORAS PARA EL FUNCIONAMIENTO DE LA ALCALDIA LOCAL RAFAEL URIBE URIBE","Funcionamiento","Un Nuevo Contrato Social y Ambiental para la Bogotá del Siglo XXI","No aplica",{"$f":"IF(ISERROR(VLOOKUP(L51,Proposito_programa!$C$2:$E$59,2,FALSE)),\" \",VLOOKUP(L51,Proposito_programa!$C$2:$E$59,2,FALSE))","v":" "},{"$f":"IF(ISERROR(VLOOKUP(L51,Proposito_programa!$C$2:$E$59,3,FALSE)),\" \",VLOOKUP(L51,Proposito_programa!$C$2:$E$59,3,FALSE))","v":" "},"1310202010203",1,830053669,"SOLUCION COPY LTDA.","Persona Jurídica",null,null,null,null,null,1,11165175,11165175,0,44408,44408,44869,390,1,68,null,null,null,null,null,"X",null,null,0]
[1,75043,2021,"OC-75043"," https://colombiacompra.gov.co/tienda-virtual-del-estado-colombiano/ordenes-compra/75043","Compraventa de bienes muebles","Selección abreviada","Acuerdo marco de precios ","CONTRATAR LA ADQUISICIÓN DE ESCANER PARA LA ALCALDIA LOCAL DE RAFAEL URIBE URIBE”","Funcionamiento","Un Nuevo Contrato Social y Ambiental para la Bogotá del Siglo XXI","No aplica",{"$f":"IF(ISERROR(VLOOKUP(L52,Proposito_programa!$C$2:$E$59,2,FALSE)),\" \",VLOOKUP(L52,Proposito_programa!$C$2:$E$59,2,FALSE))","v":" "},{"$f":"IF(ISERROR(VLOOKUP(L52,Proposito_programa!$C$2:$E$59,3,FALSE)),\" \",VLOOKUP(L52,Proposito_programa!$C$2:$E$59,3,FALSE))","v":" "},"1310201010102",1,800230829,"SISTETRONICS LTDA ","Persona Jurídica",null,null,null,17285940,null,null,null,17285940,17285940,44435,44435,44498,30,null,null,null,null,null,null,null,null,"X",null,1]
[1,293,2021,"FDLRUU-SASI-254-2021","https://community.secop.gov.co/Public/Tendering/OpportunityDetail/Index?noticeUID=CO1.NTC.2206412&isFromPublicArea=True&isModal=False","Compraventa de bienes muebles","Selección abreviada","Subasta inversa ","ADQUIRIR ELEMENTOS DE DOTACIÓN PARA FORTALECIMIENTO DE LAS CAPACIDADES LOCALES PARA DAR RESPUESTA A EMERGENCIAS Y DESASTRES EN LA LOCALIDAD RAFAEL URIBE URIBE EN EL MARCO DEL PROYECTO DE INVERSIÓN 1665","Inversión","Un Nuevo Contrato Social y Ambiental para la Bogotá del Siglo XXI",30,{"$f":"IF(ISERROR(VLOOKUP(L53,Proposito_programa!$C$2:$E$59,2,FALSE)),\" \",VLOOKUP(L53,Proposito_programa!$C$2:$E$59,2,FALSE))","v":"Eficiencia en la atención de emergencias"},{"$f":"IF(ISERROR(VLOOKUP(L53,Proposito_programa!$C$2:$E$59,3,FALSE)),\" \",VLOOKUP(L53,Proposito_programa!$C$2:$E$59,3,FALSE))","v":"Propósito 2 : Cambiar Nuestros Hábitos de Vida para Reverdecer a Bogotá y Adaptarnos y Mitigar la Crisis Climática"},"133011602300000001665",5,900954187,"SISCOM SERVICIOS INTEGRALES SAS","Persona Jurídica",null,null,null,70454639,null,null,null,70454639,0,44468,44480,44540,60,null,null,null,null,null,null,null,null,"X",null,0]
[1,222,2021,"FDLRUU-CD-222-2021","https://community.secop.gov.co/Public/Tendering/OpportunityDetail/Index?noticeUID=CO1.NTC.1985795&isFromPublicArea=True&isModal=False\n","Contratos de prestación de servicios profesionales y de apoyo a la gestión","Contratación directa","Prestación de servicios profesionales y de apoyo a la gestión, o para la ejecución de trabajos artísticos que sólo puedan encomendarse a determinadas personas naturales;","APOYAR JURÍDICAMENTE LA EJECUCIÓN DE LAS ACCIONES REQUERIDAS PARA EL TRÁMITE E IMPULSO PROCESAL DE LAS ACTUACIONES CONTRAVENCIONALES Y/O QUERELLAS QUE CURSEN EN LAS INSPECCIONES DE POLICÍA DE LA LOCALIDAD DE RAFAEL URIBE URIBE","Inversión","Un Nuevo Contrato Social y Ambiental para la Bogotá del Siglo XXI",57,{"$f":"IF(ISERROR(VLOOKUP(L54,Proposito_programa!$C$2:$E$59,2,FALSE)),\" \",VLOOKUP(L54,Proposito_programa!$C$2:$E$59,2,FALSE))","v":"Gestión pública local"},{"$f":"IF(ISERROR(VLOOKUP(L54,Proposito_programa!$C$2:$E$59,3,FALSE)),\" \",VLOOKUP(L54,Proposito_programa!$C$2:$E$59,3,FALSE))","v":"Propósito 5: Construir Bogotá - Región con gobierno abierto, transparente y ciudadanía consciente"},"133011605570000001698",1,1098675891,"SILVIA PATRICIA GOMEZ JAIMES","Persona Natural",null,null,null,31200000,null,1,5720000,36920000,31720000,44340,44344,44561,180,1,33,null,null,null,null,null,null,"X",null,0.85915492957746475]
[1,55,2021,"FDLRUU-CD-055-2021","https://community.secop.gov.co/Public/Tendering/OpportunityDetail/Index?noticeUID=CO1.NTC.1738980&isFromPublicArea=True&isModal=False\n","Contratos de prestación de servicios profesionales y de apoyo a la gestión","Contratación directa","Prestación de servicios profesionales y de apoyo a la gestión, o para la ejecución de trabajos artísticos que sólo puedan encomendarse a determinadas personas naturales;","EL CONTRATISTA SE OBLIGA A PRESTAR SUS SERVICIOS DE APOYO TÉCNICO ADMINISTRATIVO PARA EL GRUPO DE PLANEACIÓN DE LA ALCALDÍA LOCAL DE RAFAEL URIBE URIBE","Inversión","Un Nuevo Contrato Social y Ambiental para la Bogotá del Siglo XXI",57,{"$f":"IF(ISERROR(VLOOKUP(L55,Proposito_programa!$C$2:$E$59,2,FALSE)),\" \",VLOOKUP(L55,Proposito_programa!$C$2:$E$59,2,FALSE))","v":"Gestión pública local"},{"$f":"IF(ISERROR(VLOOKUP(L55,Proposito_programa!$C$2:$E$59,3,FALSE)),\" \",VLOOKUP(L55,Proposito_programa!$C$2:$E$59,3,FALSE))","v":"Propósito 5: Construir Bogotá - Región con gobierno abierto, transparente y ciudadanía consciente"},"133011605570000001697",1,1031163818,"SHAMIR ALEJANDRA HERNANDEZ MARTINEZ ","Persona Natural",null,null,null,39000000,null,1,2600000,41600000,37700000,44204,44238,44560,300,1,20,null,null,null,null,null,null,"X",null,0.90625]
[1,306,2021,"FDLRUU-CI-306-2021","https://community.secop.gov.co/Public/Tendering/OpportunityDetail/Index?noticeUID=CO1.NTC.2390503&isFromPublicArea=True&isModal=False","Contratos interadministrativos","Contratación directa","Contratos interadministrativos","PRESTAR EL SERVICIO DE CURSO Y ENTREGA DE CORRESPONDENCIA Y DEMAS ENVIOS POSTALES QUE REQUIERA LA ALCALDIA LOCAL DE RAFAEL URIBE URIBE EN LAS MODALIDADES DE CORREO CERTIFICADO, NOTIEXPRESS Y SERVICIOS POST EXPRESS, RESPUESTA FACIL, SMS CERTIFICADO, CORREO ELECTRONICO CERTIFICADO A NIVEL URBANO Y NACIONAL","Funcionamiento","Un Nuevo Contrato Social y Ambiental para la Bogotá del Siglo XXI","No aplica",{"$f":"IF(ISERROR(VLOOKUP(L56,Proposito_programa!$C$2:$E$59,2,FALSE)),\" \",VLOOKUP(L56,Proposito_programa!$C$2:$E$59,2,FALSE))","v":" "},{"$f":"IF(ISERROR(VLOOKUP(L56,Proposito_programa!$C$2:$E$59,3,FALSE)),\" \",VLOOKUP(L56,Proposito_programa!$C$2:$E$59,3,FALSE))","v":" "},"131020202010601",1,900062917,"SERVICIOS POSTALES NACIONALES S.A -472","Persona Jurídica",null,null,null,3000000,null,null,null,3000000,0,44512,44524,44827,300,null,null,null,null,null,null,null,"X",null,null,0]
[1,311,2021,"FDLRUU-CD-311-2021 ","https://community.secop.gov.co/Public/Tendering/OpportunityDetail/Index?noticeUID=CO1.NTC.2439280&isFromPublicArea=True&isModal=False\n","Contratos de prestación de servicios profesionales y de apoyo a la gestión","Contratación directa","Prestación de servicios profesionales y de apoyo a la gestión, o para la ejecución de trabajos artísticos que sólo puedan encomendarse a determinadas personas naturales;","APOYAR JURIDICAMENTE LA EJECUCIÓN DE LAS ACCIONES REQUERIDAS PARA LA DEPURACIÓN DE LAS ACTUACIONES ADMINISTRATIVAS QUE CURSAN EN LA ALCALDIA LOCAL","Inversión","Un Nuevo Contrato Social y Ambiental para la Bogotá del Siglo XXI",57,{"$f":"IF(ISERROR(VLOOKUP(L57,Proposito_programa!$C$2:$E$59,2,FALSE)),\" \",VLOOKUP(L57,Proposito_programa!$C$2:$E$59,2,FALSE))","v":"Gestión pública local"},{"$f":"IF(ISERROR(VLOOKUP(L57,Proposito_programa!$C$2:$E$59,3,FALSE)),\" \",VLOOKUP(L57,Proposito_programa!$C$2:$E$59,3,FALSE))","v":"Propósito 5: Construir Bogotá - Región con gobierno abierto, transparente y ciudadanía consciente"},"133011605570000001698",1,80001279,"SERGIO FERNEY ROMERO\nCARRILLO","Persona Natural",null,null,null,7800000,null,null,null,7800000,0,44539,44551,44596,45,null,null,null,null,null,null,null,"X",null,null,0]
[1,112,2021,"FDLRUU-CD-112-2021","https://community.secop.gov.co/Public/Tendering/OpportunityDetail/Index?noticeUID=CO1.NTC.1774557&isFromPublicArea=True&isModal=False\n","Contratos de prestación de servicios profesionales y de apoyo a la gestión","Contratación directa","Prestación de servicios profesionales y de apoyo a la gestión, o para la ejecución de trabajos artísticos que sólo puedan encomendarse a determinadas personas naturales;","PRESTAR LOS SERVICIOS PROFESIONALES PARA LA OPERACIÓN, PRESTACIÓN, SEGUIMIENTO Y CUMPLIMIENTO PROCEDIMIENTOS ADMINISTRATIVOS OPERATIVOS Y PROGRAMÁTICOS DEL SERVICIO APOYO ECONÓMICO TIPO C, QUE CONTRIBUYAN A LA GARANTÍA DE LOS DERECHOS DE LA POBLACIÓN MAYOR EN EL MARCO DE LA POLÍTICA PÚBLICA SOCIAL PARA EL ENVEJECIMIENTO Y LA VEJEZ EN EL DISTRITO CAPITAL A CARGO DE LA ALCALDÍA LOCAL RAFAEL URIBE URIBE","Inversión","Un Nuevo Contrato Social y Ambiental para la Bogotá del Siglo XXI",1,{"$f":"IF(ISERROR(VLOOKUP(L58,Proposito_programa!$C$2:$E$59,2,FALSE)),\" \",VLOOKUP(L58,Proposito_programa!$C$2:$E$59,2,FALSE))","v":"Subsidios y transferencias para la equidad"},{"$f":"IF(ISERROR(VLOOKUP(L58,Proposito_programa!$C$2:$E$59,3,FALSE)),\" \",VLOOKUP(L58,Proposito_programa!$C$2:$E$59,3,FALSE))","v":"Propósito 1: Hacer un nuevo contrato social para incrementar la inclusión social, productiva y política"},"133011601010000001636",1,80114984,"SERGIO ENRIQUE MORALES GIL","Persona Natural",null,null,null,41600000,null,1,12306667,53906667,43160000,44245,44249,44561,240,null,71,null,null,null,null,null,null,"X",null,0.80064308186592203]
[1,225,2021,"FDLRUU-CD-225-2021","https://www.contratos.gov.co/consultas/detalleProceso.do?numConstancia=21-22-26755","Contratos interadministrativos","Contratación directa","Contratos interadministrativos","AUNAR ESFUERZOS TÉCNICOS, ADMINISTRATIVOS, LOGÍSTICOS Y FINANCIEROS ENTRE LA SECRETARÍA DISTRITAL INTEGRACIÓN SOCIAL-SDIS Y EL FONDO DE DESARROLLO LOCAL DE USAQUÉN; EL FONDO DE DESARROLLO LOCAL DE SAN CRISTÓBAL; EL FONDO DE DESARROLLO LOCAL DE USME; EL FONDO DE DESARROLLO LOCAL DE BOSA; EL FONDO DE DESARROLLO LOCAL DE KENNEDY; EL FONDO DE DESARROLLO LOCAL DE SUBA; EL FONDO DE DESARROLLO LOCAL DE RAFAEL URIBE URIBE Y EL FONDO DE DESARROLLO LOCAL DE CIUDAD BOLÍVAR, PARA LA OPERACIÓN Y PUESTA EN MARCHA DEL PROGRAMA “RETO LOCAL JÓVENES Y ENTORNOS SEGUROS”.","Funcionamiento","Un Nuevo Contrato Social y Ambiental para la Bogotá del Siglo XXI","No aplica",{"$f":"IF(ISERROR(VLOOKUP(L59,Proposito_programa!$C$2:$E$59,2,FALSE)),\" \",VLOOKUP(L59,Proposito_programa!$C$2:$E$59,2,FALSE))","v":" "},{"$f":"IF(ISERROR(VLOOKUP(L59,Proposito_programa!$C$2:$E$59,3,FALSE)),\" \",VLOOKUP(L59,Proposito_programa!$C$2:$E$59,3,FALSE))","v":" "},"N/A",1,899099061,"SECRETARIA DISTRITAL DE INTEGRACION SOCIAL","Persona Jurídica",null,null,null,0,null,null,null,0,"-",44365,44378,44742,360,null,null,null,null,null,null,null,"X",null,null,"-"]
[1,233,2021,"FDLRUU-CD-233-2021 ","https://www.contratos.gov.co/consultas/detalleProceso.do?numConstancia=21-22-27304&g-recaptcha-response=03AGdBq254V5ltFbf3kHDzZRljRDxhQwD_XZa1RNQVlhHb5HFztHMfyogZfvHHZnMF6wOGezN36FWHRtXXOx1E-xC7uMVTgIYbwtGcCszIol85TSnuOez8V5X10mGQWuOXsAmcCGx3XoqcIaf3Zyamnh2vLXMSFc4egOGrzJT6G7kwILz6V4zhBwMTy_l5pxNe91konY5yEB_HT2vjWcvh53Y0oM48MNHR_WXBaPfl0jw6cRLlFrDXyyPFHkr2_Cem1eqAcSjiIToqoQ88675jqdVu1uoLJu0la-g7g6BQXqiNCe-Tjapwv6S2NovFnTO5mYXp3pYMhUzprbkW-Kav3bQsp6XN2e05J3NMybC8a51dhGCTRZDaEMOMfa1tTeAzJUdFMpkG73ERg8XPMfr1rFDviVrnfNOr_Vlz4Br6vh5T1uNE38qdVxBnPSvV_jFTGQTrdJj9cLkFgtM_gfB4Pr2z66-Nvb4wrUhqW6lwORngBQ5Yw1HDB0AGgyBLVrsFUCC81UjrbeyNUw1Y0bFbGX50cvHUa9LmsA","Contratos interadministrativos","Contratación directa","Contratos interadministrativos","AUNAR ESFUERZOS TÉCNICOS, ADMINISTRATIVOS, JURÍDICOS Y FINANCIEROS ENTRE LA SECRETARÍA DE EDUCACIÓN DEL DISTRITO Y LOS FONDOS DE DESARROLLO LOCAL QUE HACEN PARTE DEL DISTRITO CAPITAL, PARA LA IMPLEMENTACIÓN DE UN NUEVO MODELO INCLUSIVO, EFICIENTE Y FLEXIBLE PARA EL ACCESO Y LA PERMANENCIA DE LAS Y LOS JÓVENES EGRESADOS DE INSTITUCIONES DE EDUCACIÓN MEDIA A PROGRAMAS DE EDUCACIÓN SUPERIOR","Inversión","Un Nuevo Contrato Social y Ambiental para la Bogotá del Siglo XXI",17,{"$f":"IF(ISERROR(VLOOKUP(L60,Proposito_programa!$C$2:$E$59,2,FALSE)),\" \",VLOOKUP(L60,Proposito_programa!$C$2:$E$59,2,FALSE))","v":"Jóvenes con capacidades: Proyecto de vida para la ciudadanía, la innovación y el trabajo del siglo XXI"},{"$f":"IF(ISERROR(VLOOKUP(L60,Proposito_programa!$C$2:$E$59,3,FALSE)),\" \",VLOOKUP(L60,Proposito_programa!$C$2:$E$59,3,FALSE))","v":"Propósito 1: Hacer un nuevo contrato social para incrementar la inclusión social, productiva y política"},"133011601170000001642",1,899999061,"SECRETARIA DISTRITAL DE EDUCACIÓN","Persona Jurídica",null,null,null,2531277000,null,null,null,2531277000,2531277000,44375,44386,46568,2160,null,null,null,null,null,null,null,"X",null,null,1]
[1,248,2021,"FDLRUU-CD-232-2021 ","https://www.contratos.gov.co/consultas/detalleProceso.do?numConstancia=21-22-26737&g-recaptcha-response=03AGdBq243Icv-4pQG_qfcX8vlNGeUuG93FIHU1x3TMTqu8CWiGPQa42tG0FNpw1Uz6d9uunRTpWoTakuC69UGzPP0f7uyJg2Bo1dchdZz1KnIZkRuh9fL_pH9emfMlCpoVteKrr7TNT5JgGe_716JD0VvSBDurNejK6TpskthUU-l22Wlj5GHmLqtvnbCpxBUH03eTvuJqSpzGdlb6FtGoHkY40PM-6vc2yCou4cwJQYzSSBTPz08Fgfis6DERz6zcf-8xuGpGs7ZkriuaSVmIpQ0W4h1X5Sw9P9g9zjfkpiBb_7DIKH9GoGiMhthfw_UwTLDaJY9LZQ6GcAJkK93gVh8Pr_QDt5Hp4ZXsqFHoGlYOtr4bKaPUDLspxmPqMj4sg_lmiBK6KVcC828oIX_ufckgSCZ1BZWBG0EbTuVnywq0RD81qiMvO31M59k8rAmwQ7VxYYwYWSrvB20vyEbvJgO8faPK2t8M7uzqQpvZ-DOUoT_Q_kGM7gfYNWuKjUvXSlroGsDC3JwRzQiYTkqdbkyXp1h2ByO0A","Contratos interadministrativos","Contratación directa","Contratos interadministrativos","AUNAR ESFUERZOS TECNICOS ADMINISTRATIVOS Y FINANCIEROS CON EL FIN DE DESARROLLAR ACCIONES ARTICULADAS ENTRE LAS PARTES ORIENTADAS A FOMENTAR LA  GENERACION Y CIRCULACION DE BIENES Y SERVICIOS CULTURALES, ARTISTICOS PATRIMONIALES, ASI COMO AL FORTALECIMIENTO  DE LOSAGENTES DE ESTOS SECTORES EN LAS LOCALIDADES DEL DISTRITO CAPITAL DE ACUERDO CON LOS PROYECTOS PRESENTADOS A LOS FONDOS DE DESARROLLO LOCAL QUE FORMAN PARTE DEL CONVENIO EN EL MARCO DEL PROGRAMA  ES CULTURA LOCAL 2021","Inversión","Un Nuevo Contrato Social y Ambiental para la Bogotá del Siglo XXI",24,{"$f":"IF(ISERROR(VLOOKUP(L61,Proposito_programa!$C$2:$E$59,2,FALSE)),\" \",VLOOKUP(L61,Proposito_programa!$C$2:$E$59,2,FALSE))","v":"Bogotá región emprendedora e innovadora"},{"$f":"IF(ISERROR(VLOOKUP(L61,Proposito_programa!$C$2:$E$59,3,FALSE)),\" \",VLOOKUP(L61,Proposito_programa!$C$2:$E$59,3,FALSE))","v":"Propósito 1: Hacer un nuevo contrato social para incrementar la inclusión social, productiva y política"},"133011601240000001650",1,899999061,"SECRETARIA DISTRITAL DE CULTURA RECREACION Y DEPORTE-SCRD-\n\n","Persona Jurídica",null,null,null,474280000,null,null,null,{"$f":"+W61+X61+Z61","v":474280000},474280000,44377,44384,44742,354,null,null,null,null,null,null,null,"X",null,null,1]
[0,248,2021,"FDLRUU-CD-232-2021 ","https://www.contratos.gov.co/consultas/detalleProceso.do?numConstancia=21-22-26737&g-recaptcha-response=03AGdBq243Icv-4pQG_qfcX8vlNGeUuG93FIHU1x3TMTqu8CWiGPQa42tG0FNpw1Uz6d9uunRTpWoTakuC69UGzPP0f7uyJg2Bo1dchdZz1KnIZkRuh9fL_pH9emfMlCpoVteKrr7TNT5JgGe_716JD0VvSBDurNejK6TpskthUU-l22Wlj5GHmLqtvnbCpxBUH03eTvuJqSpzGdlb6FtGoHkY40PM-6vc2yCou4cwJQYzSSBTPz08Fgfis6DERz6zcf-8xuGpGs7ZkriuaSVmIpQ0W4h1X5Sw9P9g9zjfkpiBb_7DIKH9GoGiMhthfw_UwTLDaJY9LZQ6GcAJkK93gVh8Pr_QDt5Hp4ZXsqFHoGlYOtr4bKaPUDLspxmPqMj4sg_lmiBK6KVcC828oIX_ufckgSCZ1BZWBG0EbTuVnywq0RD81qiMvO31M59k8rAmwQ7VxYYwYWSrvB20vyEbvJgO8faPK2t8M7uzqQpvZ-DOUoT_Q_kGM7gfYNWuKjUvXSlroGsDC3JwRzQiYTkqdbkyXp1h2ByO0A","Contratos interadministrativos","Contratación directa","Contratos interadministrativos","AUNAR ESFUERZOS TECNICOS ADMINISTRATIVOS Y FINANCIEROS CON EL FIN DE DESARROLLAR ACCIONES ARTICULADAS ENTRE LAS PARTES ORIENTADAS A FOMENTAR LA  GENERACION Y CIRCULACION DE BIENES Y SERVICIOS CULTURALES, ARTISTICOS PATRIMONIALES, ASI COMO AL FORTALECIMIENTO  DE LOSAGENTES DE ESTOS SECTORES EN LAS LOCALIDADES DEL DISTRITO CAPITAL DE ACUERDO CON LOS PROYECTOS PRESENTADOS A LOS FONDOS DE DESARROLLO LOCAL QUE FORMAN PARTE DEL CONVENIO EN EL MARCO DEL PROGRAMA  ES CULTURA LOCAL 2021","Inversión","Un Nuevo Contrato Social y Ambiental para la Bogotá del Siglo XXI",21,{"$f":"IF(ISERROR(VLOOKUP(L62,Proposito_programa!$C$2:$E$59,2,FALSE)),\" \",VLOOKUP(L62,Proposito_programa!$C$2:$E$59,2,FALSE))","v":"Creación y vida cotidiana: Apropiación ciudadana del arte, la cultura y el patrimonio, para la democracia cultural"},{"$f":"IF(ISERROR(VLOOKUP(L62,Proposito_programa!$C$2:$E$59,3,FALSE)),\" \",VLOOKUP(L62,Proposito_programa!$C$2:$E$59,3,FALSE))","v":"Propósito 1: Hacer un nuevo contrato social para incrementar la inclusión social, productiva y política"},"133011601210000001647",1,899999061,"SECRETARIA DISTRITAL DE CULTURA RECREACION Y DEPORTE-SCRD-\n\n","Persona Jurídica",null,null,null,1053466000,null,null,null,1053466000,1053466000,44377,44384,44742,354,null,null,null,null,null,null,null,"X",null,null,1]
[1,78708,2021,"OC-78708"," https://colombiacompra.gov.co/tienda-virtual-del-estado-colombiano/ordenes-compra/78708","Compraventa de bienes muebles","Selección abreviada","Acuerdo marco de precios "," CONTRATAR LA ADQUISICIÓN DE ELEMENTOS DE BIOSEGURIDAD PARA EL MANEJO DE LA EMERGENCIA SANITARIA, SOCIAL y ECOLOGICA PRODUCTO DEL COVID-19 EN LA ALCALDÍA LOCAL DE RAFAEL URIBE URIBE","Funcionamiento","Un Nuevo Contrato Social y Ambiental para la Bogotá del Siglo XXI","No aplica",{"$f":"IF(ISERROR(VLOOKUP(L63,Proposito_programa!$C$2:$E$59,2,FALSE)),\" \",VLOOKUP(L63,Proposito_programa!$C$2:$E$59,2,FALSE))","v":" "},{"$f":"IF(ISERROR(VLOOKUP(L63,Proposito_programa!$C$2:$E$59,3,FALSE)),\" \",VLOOKUP(L63,Proposito_programa!$C$2:$E$59,3,FALSE))","v":" "},"13102020208",1,"900992742\n","SARAO EVENTOS SAS","Persona Jurídica",null,null,null,489000,null,null,null,489000,0,44498,44498,44530,30,null,null,null,null,null,null,null,null,"X",null,0]
[1,146,2021,"FDLRUU-CD-146-2021","https://community.secop.gov.co/Public/Tendering/OpportunityDetail/Index?noticeUID=CO1.NTC.1795742&isFromPublicArea=True&isModal=False\n","Contratos de prestación de servicios profesionales y de apoyo a la gestión","Contratación directa","Prestación de servicios profesionales y de apoyo a la gestión, o para la ejecución de trabajos artísticos que sólo puedan encomendarse a determinadas personas naturales;","PRESTAR LOS SERVICIOS PROFESIONALES PARA LA OPERACIÓN, PRESTACIÓN, SEGUIMIENTO Y CUMPLIMIENTO PROCEDIMIENTOS ADMINISTRATIVOS OPERATIVOS Y PROGRAMÁTICOS DEL SERVICIO APOYO ECONÓMICO TIPO C, QUE CONTRIBUYAN A LA GARANTÍA DE LOS DERECHOS DE LA POBLACIÓN MAYOR EN EL MARCO DE LA POLÍTICA PÚBLICA SOCIAL PARA EL ENVEJECIMIENTO Y LA VEJEZ EN EL DISTRITO CAPITAL A CARGO DE LA ALCALDÍA LOCAL RAFAEL URIBE URIBE","Inversión","Un Nuevo Contrato Social y Ambiental para la Bogotá del Siglo XXI",1,{"$f":"IF(ISERROR(VLOOKUP(L64,Proposito_programa!$C$2:$E$59,2,FALSE)),\" \",VLOOKUP(L64,Proposito_programa!$C$2:$E$59,2,FALSE))","v":"Subsidios y transferencias para la equidad"},{"$f":"IF(ISERROR(VLOOKUP(L64,Proposito_programa!$C$2:$E$59,3,FALSE)),\" \",VLOOKUP(L64,Proposito_programa!$C$2:$E$59,3,FALSE))","v":"Propósito 1: Hacer un nuevo contrato social para incrementar la inclusión social, productiva y política"},"133011601010000001636",1,39766949,"SANDRA YAZMIN ATARA ORJUELA","Persona Natural",null,null,null,41600000,null,1,11786667,53386667,47840000,44252,44252,44561,240,1,68,null,null,null,null,null,null,"X",null,0.89610389050884187]
[1,271,2021,"FDLRUU-CD-271-2021","https://community.secop.gov.co/Public/Tendering/OpportunityDetail/Index?noticeUID=CO1.NTC.2171525&isFromPublicArea=True&isModal=False\n","Contratos de prestación de servicios profesionales y de apoyo a la gestión","Contratación directa","Prestación de servicios profesionales y de apoyo a la gestión, o para la ejecución de trabajos artísticos que sólo puedan encomendarse a determinadas personas naturales;","\tPRESTAR SUS SERVICIOS ASISTENCIALES PARA LA GESTIÓN DEL RIESGO, EN EL MARCO DE LOS VIGÍAS DEL RIESGO DE LA LOCALIDAD DE RAFAEL URIBE URIBE","Inversión","Un Nuevo Contrato Social y Ambiental para la Bogotá del Siglo XXI",30,{"$f":"IF(ISERROR(VLOOKUP(L65,Proposito_programa!$C$2:$E$59,2,FALSE)),\" \",VLOOKUP(L65,Proposito_programa!$C$2:$E$59,2,FALSE))","v":"Eficiencia en la atención de emergencias"},{"$f":"IF(ISERROR(VLOOKUP(L65,Proposito_programa!$C$2:$E$59,3,FALSE)),\" \",VLOOKUP(L65,Proposito_programa!$C$2:$E$59,3,FALSE))","v":"Propósito 2 : Cambiar Nuestros Hábitos de Vida para Reverdecer a Bogotá y Adaptarnos y Mitigar la Crisis Climática"},"133011602300000001665",1,52025495,"SANDRA ROMERO CALDERON","Persona Natural",null,null,null,8100000,null,null,null,8100000,5760000,44421,44433,44567,135,null,null,null,null,null,null,null,null,"X",null,0.71111111111111114]
[1,30,2021,"FDLRUU-CD-030-2021","https://community.secop.gov.co/Public/Tendering/OpportunityDetail/Index?noticeUID=CO1.NTC.1725837&isFromPublicArea=True&isModal=False\n","Contratos de prestación de servicios profesionales y de apoyo a la gestión","Contratación directa","Prestación de servicios profesionales y de apoyo a la gestión, o para la ejecución de trabajos artísticos que sólo puedan encomendarse a determinadas personas naturales;","“APOYAR AL ALCALDE (SA) LOCAL EN LA PROMOCIÓN, ACOMPAÑAMIENTO, COORDINACIÓN Y ATENCIÓN DE LAS INSTANCIAS DE COORDINACIÓN INTERINSTITUCIONALES Y LAS INSTANCIAS DE PARTICIPACIÓN LOCALES, ASÍ COMO LOS PROCESOS COMUNITARIOS EN LA LOCALIDAD”.","Inversión","Un Nuevo Contrato Social y Ambiental para la Bogotá del Siglo XXI",57,{"$f":"IF(ISERROR(VLOOKUP(L66,Proposito_programa!$C$2:$E$59,2,FALSE)),\" \",VLOOKUP(L66,Proposito_programa!$C$2:$E$59,2,FALSE))","v":"Gestión pública local"},{"$f":"IF(ISERROR(VLOOKUP(L66,Proposito_programa!$C$2:$E$59,3,FALSE)),\" \",VLOOKUP(L66,Proposito_programa!$C$2:$E$59,3,FALSE))","v":"Propósito 5: Construir Bogotá - Región con gobierno abierto, transparente y ciudadanía consciente"},"133011605570000001697",1,52219936,"SANDRA PATRICIA SANABRIA HERNANDEZ ","Persona Natural",null,null,null,67000000,null,1,6253333,73253333,59853333,44229,44230,44560,300,1,28,1022360143,"MARIA NATHALYA DELGADO MUÑOZ",44294,52260000,null,null,"X",null,0.81707316989931367]
[1,94,2021,"FDLRUU-CD-094-2021","https://community.secop.gov.co/Public/Tendering/OpportunityDetail/Index?noticeUID=CO1.NTC.1757057&isFromPublicArea=True&isModal=False\n","Contratos de prestación de servicios profesionales y de apoyo a la gestión","Contratación directa","Prestación de servicios profesionales y de apoyo a la gestión, o para la ejecución de trabajos artísticos que sólo puedan encomendarse a determinadas personas naturales;","PRESTAR LOS SERVICIOS PROFESIONALES DE APOYO JURIDICO AL AREA DE GESTION POLICIVA NORMATIVA Y JURIDICA DE LA ALCALDIA LOCAL DE RAFAEL URIBE URIBE EN EL DESEMPEÑO DE LAS FUNCIONES ASIGNADAS A LA ALCALDÍA LOCAL DE RAFAEL URIBE URIBE”","Inversión","Un Nuevo Contrato Social y Ambiental para la Bogotá del Siglo XXI",57,{"$f":"IF(ISERROR(VLOOKUP(L67,Proposito_programa!$C$2:$E$59,2,FALSE)),\" \",VLOOKUP(L67,Proposito_programa!$C$2:$E$59,2,FALSE))","v":"Gestión pública local"},{"$f":"IF(ISERROR(VLOOKUP(L67,Proposito_programa!$C$2:$E$59,3,FALSE)),\" \",VLOOKUP(L67,Proposito_programa!$C$2:$E$59,3,FALSE))","v":"Propósito 5: Construir Bogotá - Región con gobierno abierto, transparente y ciudadanía consciente"},"133011605570000001698",1,1105781137,"SANDRA PATRICIA PINTO GARAY","Persona Natural",null,null,null,62000000,null,1,6613333,68613333,59726667,44239,44239,44574,300,1,32,null,null,null,null,null,null,"X",null,0.87048193679791064]
[1,168,2021,"FDLRUU-CD-150-2021","https://community.secop.gov.co/Public/Tendering/OpportunityDetail/Index?noticeUID=CO1.NTC.1800149&isFromPublicArea=True&isModal=False\n","Contratos de prestación de servicios profesionales y de apoyo a la gestión","Contratación directa","Prestación de servicios profesionales y de apoyo a la gestión, o para la ejecución de trabajos artísticos que sólo puedan encomendarse a determinadas personas naturales;","EL CONTRATISTA SE OBLIGA CON EL FONDO DE DESARROLLO LOCAL DE RAFAEL URIBE URIBE A PRESTAR SUS SERVICIOS DE APOYO A LA GESTION LOCAL Y TERRITORIAL DE LOS TEMAS DE SEGURIDAD Y CONVIVENCIA CIUDADANA PARA LA ALCALDIA LOCAL DE RAFAEL URIBE URIBE","Inversión","Un Nuevo Contrato Social y Ambiental para la Bogotá del Siglo XXI",43,{"$f":"IF(ISERROR(VLOOKUP(L68,Proposito_programa!$C$2:$E$59,2,FALSE)),\" \",VLOOKUP(L68,Proposito_programa!$C$2:$E$59,2,FALSE))","v":"Cultura ciudadana para la confianza, la convivencia y la participación desde la vida cotidiana"},{"$f":"IF(ISERROR(VLOOKUP(L68,Proposito_programa!$C$2:$E$59,3,FALSE)),\" \",VLOOKUP(L68,Proposito_programa!$C$2:$E$59,3,FALSE))","v":"Propósito 3: Inspirar confianza y legitimidad para vivir sin miedo y ser epicentro de cultura ciudadana, paz y reconciliación"},"133011603430000001680",1,1031148872,"SANDRA MILENA MUÑOZ NAVARRO","Persona Natural",null,null,null,19800000,null,1,3153333,22953333,19800000,44253,44256,44574,270,1,43,null,null,null,null,null,null,"X",null,0.86261982083386324]
[1,26,2021,"FDLRUU-CD-026-2021","https://community.secop.gov.co/Public/Tendering/OpportunityDetail/Index?noticeUID=CO1.NTC.1721556&isFromPublicArea=True&isModal=False\n","Contratos de prestación de servicios profesionales y de apoyo a la gestión","Contratación directa","Prestación de servicios profesionales y de apoyo a la gestión, o para la ejecución de trabajos artísticos que sólo puedan encomendarse a determinadas personas naturales;","PRESTAR LOS SERVICIOS PROFESIONALES ESPECIALIZADOS PARA APOYAR EL AREA DE GESTION DE DESARROLLO LOCAL DEL FONDO DE DESARROLLO LOCAL DE RAFAEL URIBE URIBE A FIN DE ORIENTAR LA EJECUCIÓN Y SEGUIMIENTO DE LAS ACTIVIDADES DE LOS PROCESOS ASOCIADOS CON EL ÁREA, ASÍ COMO DE LOS PROYECTOS DE INVERSIÓN DEL PLAN DE DESARROLLO LOCAL VIGENCIA 2021 - 2024","Inversión","Un Nuevo Contrato Social y Ambiental para la Bogotá del Siglo XXI",57,{"$f":"IF(ISERROR(VLOOKUP(L69,Proposito_programa!$C$2:$E$59,2,FALSE)),\" \",VLOOKUP(L69,Proposito_programa!$C$2:$E$59,2,FALSE))","v":"Gestión pública local"},{"$f":"IF(ISERROR(VLOOKUP(L69,Proposito_programa!$C$2:$E$59,3,FALSE)),\" \",VLOOKUP(L69,Proposito_programa!$C$2:$E$59,3,FALSE))","v":"Propósito 5: Construir Bogotá - Región con gobierno abierto, transparente y ciudadanía consciente"},"133011605570000001697",1,51647190,"SANDRA MARCELA ROJAS MACIAS","Persona Natural",null,null,null,78000000,null,1,7540000,85540000,77740000,44228,44229,44560,300,1,29,null,null,null,null,null,null,"X",null,0.90881458966565354]
[1,153,2021,"FDLRUU-CD-150-2021","https://community.secop.gov.co/Public/Tendering/OpportunityDetail/Index?noticeUID=CO1.NTC.1800149&isFromPublicArea=True&isModal=False\n","Contratos de prestación de servicios profesionales y de apoyo a la gestión","Contratación directa","Prestación de servicios profesionales y de apoyo a la gestión, o para la ejecución de trabajos artísticos que sólo puedan encomendarse a determinadas personas naturales;","EL CONTRATISTA SE OBLIGA CON EL FONDO DE DESARROLLO LOCAL DE RAFAEL URIBE URIBE A PRESTAR SUS SERVICIOS DE APOYO A LA GESTION LOCAL Y TERRITORIAL DE LOS TEMAS DE SEGURIDAD Y CONVIVENCIA CIUDADANA PARA LA ALCALDIA LOCAL DE RAFAEL URIBE URIBE","Inversión","Un Nuevo Contrato Social y Ambiental para la Bogotá del Siglo XXI",43,{"$f":"IF(ISERROR(VLOOKUP(L70,Proposito_programa!$C$2:$E$59,2,FALSE)),\" \",VLOOKUP(L70,Proposito_programa!$C$2:$E$59,2,FALSE))","v":"Cultura ciudadana para la confianza, la convivencia y la participación desde la vida cotidiana"},{"$f":"IF(ISERROR(VLOOKUP(L70,Proposito_programa!$C$2:$E$59,3,FALSE)),\" \",VLOOKUP(L70,Proposito_programa!$C$2:$E$59,3,FALSE))","v":"Propósito 3: Inspirar confianza y legitimidad para vivir sin miedo y ser epicentro de cultura ciudadana, paz y reconciliación"},"133011603430000001680",1,53002331,"SANDRA LILIANA HERNANDEZ ARAGON ","Persona Natural",null,null,null,19800000,null,1,3080000,22880000,19726667,44253,44257,44574,270,1,42,null,null,null,null,null,null,"X",null,0.86217950174825175]
[null,null,2021,null,null,"Otros gastos","Otros gastos","Otros gastos","SALUD EDILES","Funcionamiento","Un Nuevo Contrato Social y Ambiental para la Bogotá del Siglo XXI","No aplica",{"$f":"IF(ISERROR(VLOOKUP(L71,Proposito_programa!$C$2:$E$59,2,FALSE)),\" \",VLOOKUP(L71,Proposito_programa!$C$2:$E$59,2,FALSE))","v":" "},{"$f":"IF(ISERROR(VLOOKUP(L71,Proposito_programa!$C$2:$E$59,3,FALSE)),\" \",VLOOKUP(L71,Proposito_programa!$C$2:$E$59,3,FALSE))","v":" "},"131020202020106",null,null,"SALUD EDILES",null,null,null,null,141370000,null,null,null,141370000,115511200,44197,44197,44561,360,null,null,null,null,null,null,null,null,"X",null,0.8170842470113886]
[1,62,2021,"FDLRUU-CD-062-2021","https://community.secop.gov.co/Public/Tendering/OpportunityDetail/Index?noticeUID=CO1.NTC.1745520&isFromPublicArea=True&isModal=False\n","Contratos de prestación de servicios profesionales y de apoyo a la gestión","Contratación directa","Prestación de servicios profesionales y de apoyo a la gestión, o para la ejecución de trabajos artísticos que sólo puedan encomendarse a determinadas personas naturales;","PRESTAR LOS SERVICIOS PROFESIONALES COMO ABOGADO PARA APOYAR LOS PROCESOS DE CONTRATACIÓN EN SUS DIFERENTES ETAPAS AL ÁREA DE GESTIÓN DEL DESARROLLO DE LA ALCALDÍA LOCAL DE RAFAEL URIBE URIBE”.","Inversión","Un Nuevo Contrato Social y Ambiental para la Bogotá del Siglo XXI",57,{"$f":"IF(ISERROR(VLOOKUP(L72,Proposito_programa!$C$2:$E$59,2,FALSE)),\" \",VLOOKUP(L72,Proposito_programa!$C$2:$E$59,2,FALSE))","v":"Gestión pública local"},{"$f":"IF(ISERROR(VLOOKUP(L72,Proposito_programa!$C$2:$E$59,3,FALSE)),\" \",VLOOKUP(L72,Proposito_programa!$C$2:$E$59,3,FALSE))","v":"Propósito 5: Construir Bogotá - Región con gobierno abierto, transparente y ciudadanía consciente"},"133011605570000001697",1,52726734,"ROSALBA VILLALOBOS VILLALOBOS ","Persona Natural",null,null,null,52000000,null,1,5546667,57546667,50093333,44237,44239,44574,300,1,32,null,null,null,null,null,null,"X",null,0.8704819168762632]
[1,137,2021,"FDLRUU-CD-137-2021","https://community.secop.gov.co/Public/Tendering/OpportunityDetail/Index?noticeUID=CO1.NTC.1788948&isFromPublicArea=True&isModal=False\n","Contratos de prestación de servicios profesionales y de apoyo a la gestión","Contratación directa","Prestación de servicios profesionales y de apoyo a la gestión, o para la ejecución de trabajos artísticos que sólo puedan encomendarse a determinadas personas naturales;","PRESTAR LOS SERVICIOS PROFESIONALES A LA ALCALDÍA LOCAL DE RAFAEL URIBE URIBE, PARA LA EJECUCIÓN Y DIVULGACION DE LAS ACTIVIDADES COMUNITARIAS Y DE APOYO A LOS PROCESOS DE PARTICIPACIÓN EN EL MARCO DEL SISTEMA LOCAL Y DISTRITAL DE PARTICIPACIÓN, LAS RELACIONES INTERINSTITUCIONALES Y LA EJECUCIÓN DE LOS PROYECTOS QUE HACEN PARTE DEL PLAN DE DESARROLLO.”","Inversión","Un Nuevo Contrato Social y Ambiental para la Bogotá del Siglo XXI",57,{"$f":"IF(ISERROR(VLOOKUP(L73,Proposito_programa!$C$2:$E$59,2,FALSE)),\" \",VLOOKUP(L73,Proposito_programa!$C$2:$E$59,2,FALSE))","v":"Gestión pública local"},{"$f":"IF(ISERROR(VLOOKUP(L73,Proposito_programa!$C$2:$E$59,3,FALSE)),\" \",VLOOKUP(L73,Proposito_programa!$C$2:$E$59,3,FALSE))","v":"Propósito 5: Construir Bogotá - Región con gobierno abierto, transparente y ciudadanía consciente"},"133011605570000001697",1,1090386786,"RENZO ROLANDO RODRIGUEZ PINZON","Persona Natural",null,null,null,31200000,null,1,15600000,46800000,42813333,44249,44251,44523,180,null,90,null,null,null,null,null,null,"X",null,0.91481480769230772]
[1,109,2021,"FDLRUU-CD-109-2021","https://community.secop.gov.co/Public/Tendering/OpportunityDetail/Index?noticeUID=CO1.NTC.1774074&isFromPublicArea=True&isModal=False","Contratos de prestación de servicios profesionales y de apoyo a la gestión","Contratación directa","Prestación de servicios profesionales y de apoyo a la gestión, o para la ejecución de trabajos artísticos que sólo puedan encomendarse a determinadas personas naturales;","PRESTAR LOS SERVICIOS PROFESIONALES PARA LA OPERACIÓN, PRESTACIÓN, SEGUIMIENTO Y CUMPLIMIENTO PROCEDIMIENTOS ADMINISTRATIVOS OPERATIVOS Y PROGRAMÁTICOS DEL SERVICIO APOYO ECONÓMICO TIPO C, QUE CONTRIBUYAN A LA GARANTÍA DE LOS DERECHOS DE LA POBLACIÓN MAYOR EN EL MARCO DE LA POLÍTICA PÚBLICA SOCIAL PARA EL ENVEJECIMIENTO Y LA VEJEZ EN EL DISTRITO CAPITAL A CARGO DE LA ALCALDÍA LOCAL RAFAEL URIBE URIBE","Inversión","Un Nuevo Contrato Social y Ambiental para la Bogotá del Siglo XXI",1,{"$f":"IF(ISERROR(VLOOKUP(L74,Proposito_programa!$C$2:$E$59,2,FALSE)),\" \",VLOOKUP(L74,Proposito_programa!$C$2:$E$59,2,FALSE))","v":"Subsidios y transferencias para la equidad"},{"$f":"IF(ISERROR(VLOOKUP(L74,Proposito_programa!$C$2:$E$59,3,FALSE)),\" \",VLOOKUP(L74,Proposito_programa!$C$2:$E$59,3,FALSE))","v":"Propósito 1: Hacer un nuevo contrato social para incrementar la inclusión social, productiva y política"},"133011601010000001636",1,60340764,"REINA ESPERANZA CORDERO VARGAS ","Persona Natural",null,null,null,41600000,null,1,14560000,56160000,48360000,44245,44249,44574,240,1,84,null,null,null,null,null,null,"X",null,0.86111111111111116]
[1,312,2021,"FDLRUU-SASI-295-2021","https://community.secop.gov.co/Public/Tendering/OpportunityDetail/Index?noticeUID=CO1.NTC.2373812&isFromPublicArea=True&isModal=False","Compraventa de bienes muebles","Selección abreviada","Subasta inversa ","ADQUIRIR BIENES PARA LA DOTACIÓN DE ESPACIOS FÍSICOS Y VIRTUALES DE LAS SEDES DE LAS IED QUE MANTENGAN COMO CENTRO EL JUEGO, EL ARTE, LA LITERATURA Y LA EXPLORACIÓN DEL MEDIO COMO ACTIVIDADES RECTORAS DE LA PRIMERA INFANCIA EN EL MARCO DEL PROYECTO DE INVERSIÓN 1640","Inversión","Un Nuevo Contrato Social y Ambiental para la Bogotá del Siglo XXI",14,{"$f":"IF(ISERROR(VLOOKUP(L75,Proposito_programa!$C$2:$E$59,2,FALSE)),\" \",VLOOKUP(L75,Proposito_programa!$C$2:$E$59,2,FALSE))","v":"Formación integral: más y mejor tiempo en los colegios"},{"$f":"IF(ISERROR(VLOOKUP(L75,Proposito_programa!$C$2:$E$59,3,FALSE)),\" \",VLOOKUP(L75,Proposito_programa!$C$2:$E$59,3,FALSE))","v":"Propósito 1: Hacer un nuevo contrato social para incrementar la inclusión social, productiva y política"},"133011601140000001640",3,830016004,"REDCOMPUTO LTDA ","Persona Jurídica",null,null,null,666799000,null,null,null,666799000,0,44531,44550,44670,120,null,null,null,null,null,null,null,"X",null,null,0]
[1,160,2021,"FDLRUU-CD-150-2021","https://community.secop.gov.co/Public/Tendering/OpportunityDetail/Index?noticeUID=CO1.NTC.1800149&isFromPublicArea=True&isModal=False\n","Contratos de prestación de servicios profesionales y de apoyo a la gestión","Contratación directa","Prestación de servicios profesionales y de apoyo a la gestión, o para la ejecución de trabajos artísticos que sólo puedan encomendarse a determinadas personas naturales;","EL CONTRATISTA SE OBLIGA CON EL FONDO DE DESARROLLO LOCAL DE RAFAEL URIBE URIBE A PRESTAR SUS SERVICIOS DE APOYO A LA GESTION LOCAL Y TERRITORIAL DE LOS TEMAS DE SEGURIDAD Y CONVIVENCIA CIUDADANA PARA LA ALCALDIA LOCAL DE RAFAEL URIBE URIBE","Inversión","Un Nuevo Contrato Social y Ambiental para la Bogotá del Siglo XXI",43,{"$f":"IF(ISERROR(VLOOKUP(L76,Proposito_programa!$C$2:$E$59,2,FALSE)),\" \",VLOOKUP(L76,Proposito_programa!$C$2:$E$59,2,FALSE))","v":"Cultura ciudadana para la confianza, la convivencia y la participación desde la vida cotidiana"},{"$f":"IF(ISERROR(VLOOKUP(L76,Proposito_programa!$C$2:$E$59,3,FALSE)),\" \",VLOOKUP(L76,Proposito_programa!$C$2:$E$59,3,FALSE))","v":"Propósito 3: Inspirar confianza y legitimidad para vivir sin miedo y ser epicentro de cultura ciudadana, paz y reconciliación"},"133011603430000001680",1,79496051,"RAFAEL GALVIS MONCADA ","Persona Natural",null,null,null,19800000,null,1,3080000,22880000,19726667,44256,44257,44574,270,1,42,null,null,null,null,null,null,"X",null,0.86217950174825175]
[1,330,2021,"FDLRUU-CMA-311-2021 ","https://community.secop.gov.co/Public/Tendering/OpportunityDetail/Index?noticeUID=CO1.NTC.2436890&isFromPublicArea=True&isModal=False\n","Interventoría","Concurso de méritos","No aplica","REALIZAR LA INTERVENTORIA TECNICA, ADMINISTRATIVA, FINANCIERA, AMBIENTAL Y SST AL CONTRATO DE OBRA PUBLICA RESULTANTE DEL PROCESO DE LICITACION PUBLICA No. FDLRUU-LP-288-2021, CUYO OBJETO ES EJECUTAR A PRECIOS UNITARIOS FIJOS SIN FORMULA DE REAJUSTE LA CONSTRUCCIÓN DE PARQUES VECINALES Y DE BOLSILLO, EN LA LOCALIDAD DE RAFAEL URIBE URIBE, DE CONFORMIDAD CON LOS ESTUDIOS Y DISEÑOS, ANEXOS TECNICOS Y DEMÁS DOCUMENTOS QUE HACEN PARTE INTEGRAL DEL PROCESO...","Inversión","Un Nuevo Contrato Social y Ambiental para la Bogotá del Siglo XXI",33,{"$f":"IF(ISERROR(VLOOKUP(L77,Proposito_programa!$C$2:$E$59,2,FALSE)),\" \",VLOOKUP(L77,Proposito_programa!$C$2:$E$59,2,FALSE))","v":"Más árboles y más y mejor espacio público"},{"$f":"IF(ISERROR(VLOOKUP(L77,Proposito_programa!$C$2:$E$59,3,FALSE)),\" \",VLOOKUP(L77,Proposito_programa!$C$2:$E$59,3,FALSE))","v":"Propósito 2 : Cambiar Nuestros Hábitos de Vida para Reverdecer a Bogotá y Adaptarnos y Mitigar la Crisis Climática"},"133011602330000001670",2,830028126,"R&M CONSTRUCCIONES E INTERVENTORIAS S.A.S","Persona Jurídica",null,null,null,118565081,null,null,null,118565081,0,44560,"CELEBRADO SIN INICIAR","CELEBRADO SIN INICIAR",150,null,null,null,null,null,null,"X",null,null,null,0]
[1,241,2021,"FDLRUU-CD-241-2021 ","https://community.secop.gov.co/Public/Tendering/OpportunityDetail/Index?noticeUID=CO1.NTC.2104616&isFromPublicArea=True&isModal=False","Convenios de cooperacion","Régimen especial","Decreto 92 de 2017","Aunar esfuerzos para la cooperación administrativa, técnica y económica, entre el Programa para las Naciones Unidas para el Desarrollo (PNUD) y la Alcaldía Local de Rafael Uribe Uribe, con el fin de implementar estrategias que promuevan el fortalecimiento a los emprendimientos de la economía popular de la localidad de Rafael Uribe Uribe y las unidades productivas familiares y/o poblaciones dedicadas a actividades tradicionales que permiten generar ingresos (autoempleo), y el Fortalecimiento de MiPymes locales, a través de un proceso de acompañamiento especializado que permita el mejoramiento de las competencias de los empresarios y las condiciones de sus negocios y de esta forma aportar de forma significativa al cumplimiento de la agenda de reactivación económica en la Localidad, para el desarrollo de la 1. Ruta emprendimiento 2. Fortalecimiento empresarial por el FDL Rafael Uribe Uribe","Inversión","Un Nuevo Contrato Social y Ambiental para la Bogotá del Siglo XXI",6,{"$f":"IF(ISERROR(VLOOKUP(L78,Proposito_programa!$C$2:$E$59,2,FALSE)),\" \",VLOOKUP(L78,Proposito_programa!$C$2:$E$59,2,FALSE))","v":"Sistema Distrital de Cuidado"},{"$f":"IF(ISERROR(VLOOKUP(L78,Proposito_programa!$C$2:$E$59,3,FALSE)),\" \",VLOOKUP(L78,Proposito_programa!$C$2:$E$59,3,FALSE))","v":"Propósito 1: Hacer un nuevo contrato social para incrementar la inclusión social, productiva y política"},"133011601060000001653",1,800091076,"PROGRAMA DE LAS NACIONES UNIDAS PARA EL DESARROLLO- PNUD","Persona Jurídica",null,null,null,3512931735,null,null,null,3512931735,2810345388,44392,44400,44926,523,null,null,null,null,null,null,null,"X",null,null,{"$f":"IF(ISERROR(AB78/AA78),\"-\",(AB78/AA78))","v":0.8}]
[1,323,2021,"FDLRUU-SASI-307-2021","https://community.secop.gov.co/Public/Tendering/OpportunityDetail/Index?noticeUID=CO1.NTC.2443540&isFromPublicArea=True&isModal=False\n","Compraventa de bienes muebles","Selección abreviada","Subasta inversa ","ADQUIRIR ELEMENTOS DE DOTACIÓN PARA JARDINES INFANTILES DE LA SECRETARÍA DISTRITAL DE INTEGRACIÓN SOCIAL QUE OPERAN EN LA LOCALIDAD DE RAFAEL URIBE URIBE DEL PROYECTO DE INVERSIÓN 1656","Inversión","Un Nuevo Contrato Social y Ambiental para la Bogotá del Siglo XXI",6,{"$f":"IF(ISERROR(VLOOKUP(L79,Proposito_programa!$C$2:$E$59,2,FALSE)),\" \",VLOOKUP(L79,Proposito_programa!$C$2:$E$59,2,FALSE))","v":"Sistema Distrital de Cuidado"},{"$f":"IF(ISERROR(VLOOKUP(L79,Proposito_programa!$C$2:$E$59,3,FALSE)),\" \",VLOOKUP(L79,Proposito_programa!$C$2:$E$59,3,FALSE))","v":"Propósito 1: Hacer un nuevo contrato social para incrementar la inclusión social, productiva y política"},"133011601060000001656",3,800045606,"PRODUCTORA Y COMERCIALIZADORA CELMAX LTDA","Persona Jurídica",null,null,null,345218700,null,null,null,345218700,0,44559,"CELEBRADO SIN INICIAR","CELEBRADO SIN INICIAR",90,null,null,null,null,null,null,"X",null,null,null,0]
[null,null,2021,null,null,"Otros gastos","Otros gastos","Otros gastos","PAGO DE LA PLANILLA INTEGRADA DE AUTOLIQUIDACIÓN DE APORTES DEL MES DE JUNIO DE 2021, DE LOS CONTRATISTAS DE PRESTACIÓN DE SERVICIOS CLASIFICADOS EN RIESGO V DE ARL VINCULADOS A LA ALCALDÍA LOCAL DE RAFAEL URIBE URIBE, CON CONTRATOS SUPERIORES A UN MES","Inversión","Un Nuevo Contrato Social y Ambiental para la Bogotá del Siglo XXI",43,{"$f":"IF(ISERROR(VLOOKUP(L80,Proposito_programa!$C$2:$E$59,2,FALSE)),\" \",VLOOKUP(L80,Proposito_programa!$C$2:$E$59,2,FALSE))","v":"Cultura ciudadana para la confianza, la convivencia y la participación desde la vida cotidiana"},{"$f":"IF(ISERROR(VLOOKUP(L80,Proposito_programa!$C$2:$E$59,3,FALSE)),\" \",VLOOKUP(L80,Proposito_programa!$C$2:$E$59,3,FALSE))","v":"Propósito 3: Inspirar confianza y legitimidad para vivir sin miedo y ser epicentro de cultura ciudadana, paz y reconciliación"},"133011603430000001680",null,860011153,"POSITIVA COMPAÑIA DE SEGUROS SA","Persona Jurídica",null,null,null,14242500,null,null,null,14242500,14242500,44197,44197,44561,360,null,null,null,null,null,null,null,null,"X",null,1]
[null,null,2021,null,null,"Otros gastos","Otros gastos","Otros gastos","PAGO DE LA PLANILLA INTEGRADA DE AUTOLIQUIDACIÓN DE APORTES DEL MES DE JUNIO DE 2021, DE LOS CONTRATISTAS DE PRESTACIÓN DE SERVICIOS CLASIFICADOS EN RIESGO V DE ARL VINCULADOS A LA ALCALDÍA LOCAL DE RAFAEL URIBE URIBE, CON CONTRATOS SUPERIORES A UN MES","Inversión","Un Nuevo Contrato Social y Ambiental para la Bogotá del Siglo XXI",57,"Cultura ciudadana para la confianza, la convivencia y la participación desde la vida cotidiana",{"$f":"IF(ISERROR(VLOOKUP(L81,Proposito_programa!$C$2:$E$59,3,FALSE)),\" \",VLOOKUP(L81,Proposito_programa!$C$2:$E$59,3,FALSE))","v":"Propósito 5: Construir Bogotá - Región con gobierno abierto, transparente y ciudadanía consciente"},"133011605570000001697",null,860011153,"POSITIVA COMPAÑIA DE SEGUROS SA","Persona Jurídica",null,null,null,5144100,null,null,null,{"$f":"+W81+X81+Z81","v":5144100},5144100,44197,44197,44561,360,null,null,null,null,null,null,null,null,"X",null,1]
[1,284,2019,"CS-284-2019","https://community.secop.gov.co/Public/Tendering/OpportunityDetail/Index?noticeUID=CO1.NTC.932059&isFromPublicArea=True&isModal=False","Seguros","Selección abreviada","Selección abreviada por menor cuantía ","CONTRATAR LOS SEGUROS QUE AMPAREN LOS INTERESES PATRIMONIALES ACTUALES Y FUTUROS, ASÍ COMO LOS BIENES DE PROPIEDAD DE LA FONDO DE DESARROLLO LOCAL DE RAFAEL URIBE URIBE, QUE ESTÉN BAJO SU RESPONSABILIDAD Y CUSTODIA Y AQUELLOS QUE SEAN ADQUIRIDOS PARA DESARROLLAR LAS FUNCIONES INHERENTES A SU ACTIVIDAD Y CUALQUIER OTRA PÓLIZA DE SEGUROS QUE REQUIERA LA ENTIDAD EN EL DESARROLLO DE SU ACTIVIDAD”GRUPO 3.","Funcionamiento","Un Nuevo Contrato Social y Ambiental para la Bogotá del Siglo XXI","No aplica",{"$f":"IF(ISERROR(VLOOKUP(L82,Proposito_programa!$C$2:$E$59,2,FALSE)),\" \",VLOOKUP(L82,Proposito_programa!$C$2:$E$59,2,FALSE))","v":" "},{"$f":"IF(ISERROR(VLOOKUP(L82,Proposito_programa!$C$2:$E$59,3,FALSE)),\" \",VLOOKUP(L82,Proposito_programa!$C$2:$E$59,3,FALSE))","v":" "},"131020202020105",1,860011153,"POSITIVA COMPAÑIA DE SEGUROS S.A.","Persona Jurídica",null,null,null,null,null,2,6968406,6968406,6968406,44404,44404,44612,858,2,244,null,null,null,null,null,"X",null,null,1]
[1,67,2021,"FDLRUU-CD-067-2021","https://community.secop.gov.co/Public/Tendering/OpportunityDetail/Index?noticeUID=CO1.NTC.1743792&isFromPublicArea=True&isModal=False\n","Contratos de prestación de servicios profesionales y de apoyo a la gestión","Contratación directa","Prestación de servicios profesionales y de apoyo a la gestión, o para la ejecución de trabajos artísticos que sólo puedan encomendarse a determinadas personas naturales;","PRESTAR LOS SERVICIOS PROFESIONALES EN EL APOYO A LOS TRÁMITES Y PROCEDIMIENTOS ADELANTADOS EN EL ÁREA DE GESTIÓN DE DESARROLLO LOCAL - CONTABILIDAD- DEL FONDO DE DESARROLLO LOCAL DE RAFAEL URIBE URIBE","Inversión","Un Nuevo Contrato Social y Ambiental para la Bogotá del Siglo XXI",57,{"$f":"IF(ISERROR(VLOOKUP(L83,Proposito_programa!$C$2:$E$59,2,FALSE)),\" \",VLOOKUP(L83,Proposito_programa!$C$2:$E$59,2,FALSE))","v":"Gestión pública local"},{"$f":"IF(ISERROR(VLOOKUP(L83,Proposito_programa!$C$2:$E$59,3,FALSE)),\" \",VLOOKUP(L83,Proposito_programa!$C$2:$E$59,3,FALSE))","v":"Propósito 5: Construir Bogotá - Región con gobierno abierto, transparente y ciudadanía consciente"},"133011605570000001697",1,52207882,"PILAR JASBLEIDY CASTELLANOS ROJAS ","Persona Natural",null,null,null,52000000,null,null,null,52000000,50266667,44236,44238,44540,300,null,null,null,null,null,null,null,null,"X",null,0.96666667307692311]
[1,68,2021,"FDLRUU-CD-068-2021","https://community.secop.gov.co/Public/Tendering/OpportunityDetail/Index?noticeUID=CO1.NTC.1751240&isFromPublicArea=True&isModal=False\n","Contratos de prestación de servicios profesionales y de apoyo a la gestión","Contratación directa","Prestación de servicios profesionales y de apoyo a la gestión, o para la ejecución de trabajos artísticos que sólo puedan encomendarse a determinadas personas naturales;","APOYAR JURÍDICAMENTE LA EJECUCIÓN DE LAS ACCIONES REQUERIDAS PARA LA DEPURACIÓN DE LAS ACTUACIONES ADMINISTRATIVAS QUE CURSAN EN LA ALCALDÍA LOCAL","Inversión","Un Nuevo Contrato Social y Ambiental para la Bogotá del Siglo XXI",57,{"$f":"IF(ISERROR(VLOOKUP(L84,Proposito_programa!$C$2:$E$59,2,FALSE)),\" \",VLOOKUP(L84,Proposito_programa!$C$2:$E$59,2,FALSE))","v":"Gestión pública local"},{"$f":"IF(ISERROR(VLOOKUP(L84,Proposito_programa!$C$2:$E$59,3,FALSE)),\" \",VLOOKUP(L84,Proposito_programa!$C$2:$E$59,3,FALSE))","v":"Propósito 5: Construir Bogotá - Región con gobierno abierto, transparente y ciudadanía consciente"},"133011605570000001698",1,19339805,"PEDRO LUIS MORENO CABALLERO","Persona Natural",null,null,null,31200000,null,null,null,31200000,31200000,44237,44242,44422,180,null,null,null,null,null,null,null,null,"X",null,1]
[1,73845,2021,"OC-73845"," https://colombiacompra.gov.co/tienda-virtual-del-estado-colombiano/ordenes-compra/73845","Compraventa de bienes muebles","Selección abreviada","Acuerdo marco de precios ","ELEMENTOS DE BIOSEGURIDAD PARA EL\nMANEJO DE LA EMERGENCIA SANITARIA,\nSOCIAL y ECOLOGICA PRODUCTO DEL COVID19 ALCALDIA LOCAL RAFAEL URIBE URIBE","Funcionamiento","Un Nuevo Contrato Social y Ambiental para la Bogotá del Siglo XXI","No aplica",{"$f":"IF(ISERROR(VLOOKUP(L85,Proposito_programa!$C$2:$E$59,2,FALSE)),\" \",VLOOKUP(L85,Proposito_programa!$C$2:$E$59,2,FALSE))","v":" "},{"$f":"IF(ISERROR(VLOOKUP(L85,Proposito_programa!$C$2:$E$59,3,FALSE)),\" \",VLOOKUP(L85,Proposito_programa!$C$2:$E$59,3,FALSE))","v":" "},"13102020208",1,900671732,"PANORAMMA DISEÑO DE SOLUCIONES SAS ","Persona Jurídica",null,null,null,383825,null,null,null,383825,383825,44413,44414,44444,30,null,null,null,null,null,null,null,null,"X",null,1]
[1,82982,2021,"OC-82982","https://colombiacompra.gov.co/tienda-virtual-del-estado-colombiano/ordenes-compra/82982","Compraventa de bienes muebles","Selección abreviada","Acuerdo marco de precios ","ADQUISICION DE BANDERAS PARA LA ALCALDÍA LOCAL DE RAFAEL URIBE URIBE","Funcionamiento","Un Nuevo Contrato Social y Ambiental para la Bogotá del Siglo XXI","No aplica",{"$f":"IF(ISERROR(VLOOKUP(L86,Proposito_programa!$C$2:$E$59,2,FALSE)),\" \",VLOOKUP(L86,Proposito_programa!$C$2:$E$59,2,FALSE))","v":" "},{"$f":"IF(ISERROR(VLOOKUP(L86,Proposito_programa!$C$2:$E$59,3,FALSE)),\" \",VLOOKUP(L86,Proposito_programa!$C$2:$E$59,3,FALSE))","v":" "},"1310202010105",1,830037946,"PANAMERICANA LIBRERÍA Y PAPELERÍA S.A.","Persona Jurídica",null,null,null,1914115,null,null,null,1914115,0,44547,44547,44612,64,null,null,null,null,null,null,null,"X",null,null,0]
[1,74071,2021,"OC-74071"," https://colombiacompra.gov.co/tienda-virtual-del-estado-colombiano/ordenes-compra/74071","Compraventa de bienes muebles","Selección abreviada","Acuerdo marco de precios ","CONTRATAR LA ADQUISICION DE LICENCIAS ADOBE CREATIVE CLOUD PARA LA ALCALDÍA LOCAL DE RAFAEL URIBE URIBE","Inversión","Un Nuevo Contrato Social y Ambiental para la Bogotá del Siglo XXI",57,{"$f":"IF(ISERROR(VLOOKUP(L87,Proposito_programa!$C$2:$E$59,2,FALSE)),\" \",VLOOKUP(L87,Proposito_programa!$C$2:$E$59,2,FALSE))","v":"Gestión pública local"},{"$f":"IF(ISERROR(VLOOKUP(L87,Proposito_programa!$C$2:$E$59,3,FALSE)),\" \",VLOOKUP(L87,Proposito_programa!$C$2:$E$59,3,FALSE))","v":"Propósito 5: Construir Bogotá - Región con gobierno abierto, transparente y ciudadanía consciente"},"133011605570000001697",1,830037946,"PANAMERICANA LIBRERÍA Y PAPELERÍA S.A","Persona Jurídica",null,null,null,9337056,null,null,null,9337056,9337056,44418,44418,44438,20,null,null,null,null,null,null,null,null,"X",null,1]
[1,74072,2021,"OC-74072"," https://colombiacompra.gov.co/tienda-virtual-del-estado-colombiano/ordenes-compra/74072","Compraventa de bienes muebles","Selección abreviada","Acuerdo marco de precios ","ADQUISICIÓN DE ELEMENTOS Y/O ARTÍCULOS DE PAPELERÍA Y OFICINA PARA EL FONDO DE DESARROLLO LOCAL DE RAFAEL URIBE URIBE”","Funcionamiento","Un Nuevo Contrato Social y Ambiental para la Bogotá del Siglo XXI","No aplica",{"$f":"IF(ISERROR(VLOOKUP(L88,Proposito_programa!$C$2:$E$59,2,FALSE)),\" \",VLOOKUP(L88,Proposito_programa!$C$2:$E$59,2,FALSE))","v":" "},{"$f":"IF(ISERROR(VLOOKUP(L88,Proposito_programa!$C$2:$E$59,3,FALSE)),\" \",VLOOKUP(L88,Proposito_programa!$C$2:$E$59,3,FALSE))","v":" "},"1310201010105 - 1310202010206",1,830037946,"PANAMERICANA LIBRERÍA Y PAPELERÍA S.A","Persona Jurídica",null,null,null,7380280,null,null,null,7380280,7380280,44418,44418,44438,20,null,null,null,null,null,null,null,null,"X",null,1]
[null,null,2021,null,null,"Otros gastos","Otros gastos","Otros gastos","PAGO DE HONORARIOS DE LOS EDILES DE LA LOCALIDAD DE RAFAEL URIBE URIBE","Funcionamiento","Un Nuevo Contrato Social y Ambiental para la Bogotá del Siglo XXI","No aplica",{"$f":"IF(ISERROR(VLOOKUP(L89,Proposito_programa!$C$2:$E$59,2,FALSE)),\" \",VLOOKUP(L89,Proposito_programa!$C$2:$E$59,2,FALSE))","v":" "},{"$f":"IF(ISERROR(VLOOKUP(L89,Proposito_programa!$C$2:$E$59,3,FALSE)),\" \",VLOOKUP(L89,Proposito_programa!$C$2:$E$59,3,FALSE))","v":" "},"13101040102",null,null,"PAGO DE HONORARIOS DE LOS EDILES DE LA LOCALIDAD DE RAFAEL URIBE URIBE",null,null,null,null,1044450000,null,null,null,1044450000,971603154,44197,44197,44561,360,null,null,null,null,null,null,null,null,"X",null,0.93025339077983626]
[1,9,2021,"FDLRUU-CD-009-2021","https://community.secop.gov.co/Public/Tendering/OpportunityDetail/Index?noticeUID=CO1.NTC.1689387&isFromPublicArea=True&isModal=False\n","Contratos de prestación de servicios profesionales y de apoyo a la gestión","Contratación directa","Prestación de servicios profesionales y de apoyo a la gestión, o para la ejecución de trabajos artísticos que sólo puedan encomendarse a determinadas personas naturales;","APOYAR TÉCNICAMENTE LAS DISTINTAS ETAPAS DE LOS PROCESOS DE COMPETENCIA DE LAS INSPECCIONES DE POLICÍA DE LA LOCALIDAD, SEGÚN REPARTO.","Inversión","Un Nuevo Contrato Social y Ambiental para la Bogotá del Siglo XXI",57,{"$f":"IF(ISERROR(VLOOKUP(L90,Proposito_programa!$C$2:$E$59,2,FALSE)),\" \",VLOOKUP(L90,Proposito_programa!$C$2:$E$59,2,FALSE))","v":"Gestión pública local"},{"$f":"IF(ISERROR(VLOOKUP(L90,Proposito_programa!$C$2:$E$59,3,FALSE)),\" \",VLOOKUP(L90,Proposito_programa!$C$2:$E$59,3,FALSE))","v":"Propósito 5: Construir Bogotá - Región con gobierno abierto, transparente y ciudadanía consciente"},"133011605570000001698",1,1032456151,"OSCAR JAVIER OVALLE RIVERA","Persona Natural",null,null,null,31200000,null,1,15600000,46800000,46800000,44221,44225,44497,180,1,90,null,null,null,null,null,null,"X",null,1]
[1,126,2021,"FDLRUU-CD-126-2021","https://community.secop.gov.co/Public/Tendering/OpportunityDetail/Index?noticeUID=CO1.NTC.1783718&isFromPublicArea=True&isModal=False\n","Contratos de prestación de servicios profesionales y de apoyo a la gestión","Contratación directa","Prestación de servicios profesionales y de apoyo a la gestión, o para la ejecución de trabajos artísticos que sólo puedan encomendarse a determinadas personas naturales;","PRESTAR SUS SERVICIOS PROFESIONALES PARA LA IMPLEMENTACIÓN DE LAS ACCIONES Y LINEAMIENTOS TÉCNICOS SURTIDOS DEL PROGRAMA DE GESTIÓN DOCUMENTAL Y DEMÁS INSTRUMENTOS TÉCNICOS ARCHIVÍSTICOS","Inversión","Un Nuevo Contrato Social y Ambiental para la Bogotá del Siglo XXI",57,{"$f":"IF(ISERROR(VLOOKUP(L91,Proposito_programa!$C$2:$E$59,2,FALSE)),\" \",VLOOKUP(L91,Proposito_programa!$C$2:$E$59,2,FALSE))","v":"Gestión pública local"},{"$f":"IF(ISERROR(VLOOKUP(L91,Proposito_programa!$C$2:$E$59,3,FALSE)),\" \",VLOOKUP(L91,Proposito_programa!$C$2:$E$59,3,FALSE))","v":"Propósito 5: Construir Bogotá - Región con gobierno abierto, transparente y ciudadanía consciente"},"133011605570000001697",1,1033742425,"OSCAR FABIÁN LÓPEZ CAMACHO","Persona Natural",null,null,null,43000000,null,null,null,43000000,39560000,44249,44252,44554,300,null,null,null,null,null,null,null,null,"X",null,0.92]
[1,219,2021,"FDLRUU-CD-219-2021","https://community.secop.gov.co/Public/Tendering/OpportunityDetail/Index?noticeUID=CO1.NTC.1972508&isFromPublicArea=True&isModal=False\n","Contratos de prestación de servicios profesionales y de apoyo a la gestión","Contratación directa","Prestación de servicios profesionales y de apoyo a la gestión, o para la ejecución de trabajos artísticos que sólo puedan encomendarse a determinadas personas naturales;","APOYAR TÉCNICAMENTE LAS DISTINTAS ETAPAS DE LOS PROCESOS DE COMPETENCIA DE LA ALCALDÍA LOCAL PARA LA DEPURACIÓN DE LAS ACTUACIONES ADMINISTRATIVAS","Inversión","Un Nuevo Contrato Social y Ambiental para la Bogotá del Siglo XXI",57,{"$f":"IF(ISERROR(VLOOKUP(L92,Proposito_programa!$C$2:$E$59,2,FALSE)),\" \",VLOOKUP(L92,Proposito_programa!$C$2:$E$59,2,FALSE))","v":"Gestión pública local"},{"$f":"IF(ISERROR(VLOOKUP(L92,Proposito_programa!$C$2:$E$59,3,FALSE)),\" \",VLOOKUP(L92,Proposito_programa!$C$2:$E$59,3,FALSE))","v":"Propósito 5: Construir Bogotá - Región con gobierno abierto, transparente y ciudadanía consciente"},"133011605570000001698",1,80202017,"OSCAR ARBEY ORTIZ DIAZ","Persona Natural",null,null,null,31200000,null,1,5720000,36920000,28080000,44329,44335,44561,180,1,33,null,null,null,null,null,null,"X",null,0.76056338028169013]
[1,244,2021,"FDLRUU-CD-244-2021.","https://community.secop.gov.co/Public/Tendering/OpportunityDetail/Index?noticeUID=CO1.NTC.2143725&isFromPublicArea=True&isModal=False\n","Contratos interadministrativos","Contratación directa","Contratos interadministrativos","AUNAR ESFUERZOS TÉCNICOS, ADMINISTRATIVOS Y LOGÍSTICOS ENTRE LA ALCALDÍA LOCAL DE RAFAEL URIBE URIBE Y LA ORQUESTA FILARMÓNICA DE BOGOTÁ PARA LA CONTINUIDAD Y DESARROLLO DEL CENTRO FILARMÓNICO LOCAL, COMO UN ESPACIO PARA EL PROCESO DE FORMACIÓN MUSICAL IMPLEMENTADO POR LA ORQUESTA Y DIRIGIDO A LA LOCALIDAD","Funcionamiento","Un Nuevo Contrato Social y Ambiental para la Bogotá del Siglo XXI","No aplica",{"$f":"IF(ISERROR(VLOOKUP(L93,Proposito_programa!$C$2:$E$59,2,FALSE)),\" \",VLOOKUP(L93,Proposito_programa!$C$2:$E$59,2,FALSE))","v":" "},{"$f":"IF(ISERROR(VLOOKUP(L93,Proposito_programa!$C$2:$E$59,3,FALSE)),\" \",VLOOKUP(L93,Proposito_programa!$C$2:$E$59,3,FALSE))","v":" "},"N/A",1,899999282,"ORQUESTA  FILARMONICA DE BOGOTA ","Persona Jurídica",null,null,null,0,null,null,null,0,"-",44410,44411,44865,177,1,301,null,null,null,null,null,"X",null,null,"-"]
[1,87,2021,"FDLRUU-CD-087-2021","https://community.secop.gov.co/Public/Tendering/OpportunityDetail/Index?noticeUID=CO1.NTC.1757556&isFromPublicArea=True&isModal=False\n","Contratos de prestación de servicios profesionales y de apoyo a la gestión","Contratación directa","Prestación de servicios profesionales y de apoyo a la gestión, o para la ejecución de trabajos artísticos que sólo puedan encomendarse a determinadas personas naturales;","APOYAR TÉCNICAMENTE LAS DISTINTAS ETAPAS DE LOS PROCESOS DE COMPETENCIA DE LA ALCALDÍA LOCAL PARA LA DEPURACIÓN DE LAS ACTUACIONES ADMINISTRATIVAS","Inversión","Un Nuevo Contrato Social y Ambiental para la Bogotá del Siglo XXI",57,{"$f":"IF(ISERROR(VLOOKUP(L94,Proposito_programa!$C$2:$E$59,2,FALSE)),\" \",VLOOKUP(L94,Proposito_programa!$C$2:$E$59,2,FALSE))","v":"Gestión pública local"},{"$f":"IF(ISERROR(VLOOKUP(L94,Proposito_programa!$C$2:$E$59,3,FALSE)),\" \",VLOOKUP(L94,Proposito_programa!$C$2:$E$59,3,FALSE))","v":"Propósito 5: Construir Bogotá - Región con gobierno abierto, transparente y ciudadanía consciente"},"133011605570000001698",1,19410967,"ORLANDO MERCHAN BARRETO","Persona Natural",null,null,null,31200000,null,1,15600000,46800000,46800000,44238,44242,44514,180,1,90,null,null,null,null,null,null,"X",null,1]
[1,242,2021,"FDLRUU-CD-242-2021 ","https://community.secop.gov.co/Public/Tendering/OpportunityDetail/Index?noticeUID=CO1.NTC.2104961&isFromPublicArea=True&isModal=False","Convenios de cooperacion","Régimen especial","Decreto 92 de 2017","AUNAR ESFUERZOS, TÉCNICOS, ADMINISTRATIVOS, JURÍDICOS Y FINANCIEROS PARA FOMENTAR UNA VIDA LIBRE DE VIOLENCIA PARA LAS MUJERES Y PARA IMPLEMENTAR UNA ESTRATEGIA DE CUIDADO A CUIDADORAS Y CUIDADORES RESIDENTES EN LA LOCALIDAD DE RAFAEL URIBE URIBE” EN EL MARCO DEL PROYECTO 1657 Y 1679.","Inversión","Un Nuevo Contrato Social y Ambiental para la Bogotá del Siglo XXI",6,{"$f":"IF(ISERROR(VLOOKUP(L95,Proposito_programa!$C$2:$E$59,2,FALSE)),\" \",VLOOKUP(L95,Proposito_programa!$C$2:$E$59,2,FALSE))","v":"Sistema Distrital de Cuidado"},{"$f":"IF(ISERROR(VLOOKUP(L95,Proposito_programa!$C$2:$E$59,3,FALSE)),\" \",VLOOKUP(L95,Proposito_programa!$C$2:$E$59,3,FALSE))","v":"Propósito 1: Hacer un nuevo contrato social para incrementar la inclusión social, productiva y política"},"133011601060000001657",1,860403137,"ORGANIZACION DE ESTADOS IBEROAMERICANOS-OEI (MUJERES)","Persona Jurídica",null,null,null,617666000,null,null,null,{"$f":"+W95+X95+Z95","v":617666000},247066400,44393,44406,44621,210,null,null,null,null,null,null,null,"X",null,null,0.4]
[0,242,2021,"FDLRUU-CD-242-2021 ","https://community.secop.gov.co/Public/Tendering/OpportunityDetail/Index?noticeUID=CO1.NTC.2104961&isFromPublicArea=True&isModal=False","Convenios de cooperacion","Régimen especial","Decreto 92 de 2017","AUNAR ESFUERZOS, TÉCNICOS, ADMINISTRATIVOS, JURÍDICOS Y FINANCIEROS PARA FOMENTAR UNA VIDA LIBRE DE VIOLENCIA PARA LAS MUJERES Y PARA IMPLEMENTAR UNA ESTRATEGIA DE CUIDADO A CUIDADORAS Y CUIDADORES RESIDENTES EN LA LOCALIDAD DE RAFAEL URIBE URIBE” EN EL MARCO DEL PROYECTO 1657 Y 1679.","Inversión","Un Nuevo Contrato Social y Ambiental para la Bogotá del Siglo XXI",40,{"$f":"IF(ISERROR(VLOOKUP(L96,Proposito_programa!$C$2:$E$59,2,FALSE)),\" \",VLOOKUP(L96,Proposito_programa!$C$2:$E$59,2,FALSE))","v":"Más mujeres viven una vida libre de violencias, se sienten seguras y acceden con confianza al sistema de justicia"},{"$f":"IF(ISERROR(VLOOKUP(L96,Proposito_programa!$C$2:$E$59,3,FALSE)),\" \",VLOOKUP(L96,Proposito_programa!$C$2:$E$59,3,FALSE))","v":"Propósito 3: Inspirar confianza y legitimidad para vivir sin miedo y ser epicentro de cultura ciudadana, paz y reconciliación"},"133011603400000001679",1,860403137,"ORGANIZACION DE ESTADOS IBEROAMERICANOS-OEI (MUJERES)","Persona Jurídica",null,null,null,1010227000,null,null,null,1010227000,404090800,44393,44406,44621,210,null,null,null,null,null,null,null,"X",null,null,0.4]
[1,243,2021,"FDLRUU-CD-243-2021 ","https://community.secop.gov.co/Public/Tendering/OpportunityDetail/Index?noticeUID=CO1.NTC.2126144&isFromPublicArea=True&isModal=False\n","Convenios de cooperacion","Régimen especial","Decreto 92 de 2017","AUNAR ESFUERZOS TECNICOS ADMINISTRATIVOS, JURIDICOS Y FINANCIEROS PARA CREAR ENTORNOS DE RECONCILIACIÓN, Y DE MEJORAMIENTO DE LA CALIDAD DE VIDA DE LAS VICTIMAS DEL CONFLICTO Y EXCOMBATIENTES RESIDENTES EN LA LOCALIDAD DE RAFAEL URIBE URIBE","Inversión","Un Nuevo Contrato Social y Ambiental para la Bogotá del Siglo XXI",39,{"$f":"IF(ISERROR(VLOOKUP(L97,Proposito_programa!$C$2:$E$59,2,FALSE)),\" \",VLOOKUP(L97,Proposito_programa!$C$2:$E$59,2,FALSE))","v":"Bogotá territorio de paz y atención integral a las víctimas del conflicto armado"},{"$f":"IF(ISERROR(VLOOKUP(L97,Proposito_programa!$C$2:$E$59,3,FALSE)),\" \",VLOOKUP(L97,Proposito_programa!$C$2:$E$59,3,FALSE))","v":"Propósito 3: Inspirar confianza y legitimidad para vivir sin miedo y ser epicentro de cultura ciudadana, paz y reconciliación"},"133011603390000001678",1,860403137,"ORGANIZACION DE ESTADOS IBEROAMERICANOS -OEI (VICTIMAS)","Persona Jurídica",null,null,null,358968000,null,null,null,358968000,251277600,44403,44406,44620,210,null,null,null,null,null,null,null,"X",null,null,0.7]
[1,227,2021,"FDLRUU-CD-227-2021","https://community.secop.gov.co/Public/Tendering/OpportunityDetail/Index?noticeUID=CO1.NTC.2016792&isFromPublicArea=True&isModal=False\n","Convenios de cooperacion","Régimen especial","Decreto 92 de 2017","AUNAR ESFUERZOS PARA DISEÑAR E IMPLEMENTAR ESTRATEGIAS INNOVADORAS Y TRANSFERENCIA DE CONOCIMIENTO PARA PROMOVER EL FORTALECIMIENTO DE LA CONFIANZA CIUDADANA, LA CONVIVENCIA SOCIAL Y LA JUSTICIA LOCAL EN LA LOCALIDAD RAFAEL URIBE URIBE EN EL MARCO DEL PLAN DE DESARROLLO LOCAL 2021- 2024 “UN NUEVO CONTRATO SOCIAL Y AMBIENTAL PARA LA LOCALIDAD DE RAFAEL URIBE URIBE”. EN EL MARCO DEL PROYECTO DE INVERSION 1680 Y 1682.","Inversión","Un Nuevo Contrato Social y Ambiental para la Bogotá del Siglo XXI",43,{"$f":"IF(ISERROR(VLOOKUP(L98,Proposito_programa!$C$2:$E$59,2,FALSE)),\" \",VLOOKUP(L98,Proposito_programa!$C$2:$E$59,2,FALSE))","v":"Cultura ciudadana para la confianza, la convivencia y la participación desde la vida cotidiana"},{"$f":"IF(ISERROR(VLOOKUP(L98,Proposito_programa!$C$2:$E$59,3,FALSE)),\" \",VLOOKUP(L98,Proposito_programa!$C$2:$E$59,3,FALSE))","v":"Propósito 3: Inspirar confianza y legitimidad para vivir sin miedo y ser epicentro de cultura ciudadana, paz y reconciliación"},"133011603430000001680",1,860403137,"ORGANIZACION DE ESTADOS IBEROAMERICANOS OEI","Persona Jurídica",null,null,null,60271000,null,null,null,{"$f":"+W98+X98+Z98","v":60271000},36162600,44363,44369,44613,240,null,null,null,null,null,null,null,"X",null,null,0.6]
[0,227,2021,"FDLRUU-CD-227-2021","https://community.secop.gov.co/Public/Tendering/OpportunityDetail/Index?noticeUID=CO1.NTC.2016792&isFromPublicArea=True&isModal=False\n","Convenios de cooperacion","Régimen especial","Decreto 92 de 2017","AUNAR ESFUERZOS PARA DISEÑAR E IMPLEMENTAR ESTRATEGIAS INNOVADORAS Y TRANSFERENCIA DE CONOCIMIENTO PARA PROMOVER EL FORTALECIMIENTO DE LA CONFIANZA CIUDADANA, LA CONVIVENCIA SOCIAL Y LA JUSTICIA LOCAL EN LA LOCALIDAD RAFAEL URIBE URIBE EN EL MARCO DEL PLAN DE DESARROLLO LOCAL 2021- 2024 “UN NUEVO CONTRATO SOCIAL Y AMBIENTAL PARA LA LOCALIDAD DE RAFAEL URIBE URIBE”. EN EL MARCO DEL PROYECTO DE INVERSION 1680 Y 1682.","Inversión","Un Nuevo Contrato Social y Ambiental para la Bogotá del Siglo XXI",48,{"$f":"IF(ISERROR(VLOOKUP(L99,Proposito_programa!$C$2:$E$59,2,FALSE)),\" \",VLOOKUP(L99,Proposito_programa!$C$2:$E$59,2,FALSE))","v":"Plataforma institucional para la seguridad y justicia"},{"$f":"IF(ISERROR(VLOOKUP(L99,Proposito_programa!$C$2:$E$59,3,FALSE)),\" \",VLOOKUP(L99,Proposito_programa!$C$2:$E$59,3,FALSE))","v":"Propósito 3: Inspirar confianza y legitimidad para vivir sin miedo y ser epicentro de cultura ciudadana, paz y reconciliación"},"133011603480000001682",1,860403137,"ORGANIZACION DE ESTADOS IBEROAMERICANOS OEI","Persona Jurídica",null,null,null,728966000,null,null,null,728966000,437379600,44363,44369,44613,240,null,null,null,null,null,null,null,"X",null,null,0.6]
[1,86,2021,"FDLRUU-CD-086-2021","https://community.secop.gov.co/Public/Tendering/OpportunityDetail/Index?noticeUID=CO1.NTC.1756653&isFromPublicArea=True&isModal=False\n","Contratos de prestación de servicios profesionales y de apoyo a la gestión","Contratación directa","Prestación de servicios profesionales y de apoyo a la gestión, o para la ejecución de trabajos artísticos que sólo puedan encomendarse a determinadas personas naturales;","APOYAR LA GESTIÓN DOCUMENTAL DE LA ALCALDÍA LOCAL DE RAFAEL URIBE URIBE EN LA IMPLEMENTACIÓN DE LOS PROCESOS DE CLASIFICACIÓN, ORDENACIÓN, SELECCIÓN NATURAL, FOLIACIÓN, IDENTIFICACIÓN, LEVANTAMIENTO DE INVENTARIOS, ALMACENAMIENTO Y APLICACIÓN DE PROTOCOLOS DE ELIMINACIÓN Y TRANSFERENCIAS DOCUMENTALES.”","Inversión","Un Nuevo Contrato Social y Ambiental para la Bogotá del Siglo XXI",57,{"$f":"IF(ISERROR(VLOOKUP(L100,Proposito_programa!$C$2:$E$59,2,FALSE)),\" \",VLOOKUP(L100,Proposito_programa!$C$2:$E$59,2,FALSE))","v":"Gestión pública local"},{"$f":"IF(ISERROR(VLOOKUP(L100,Proposito_programa!$C$2:$E$59,3,FALSE)),\" \",VLOOKUP(L100,Proposito_programa!$C$2:$E$59,3,FALSE))","v":"Propósito 5: Construir Bogotá - Región con gobierno abierto, transparente y ciudadanía consciente"},"133011605570000001697",1,79806948,"OMAR ALEXANDER SALVADOR ROMERO ","Persona Natural",null,null,null,26000000,null,1,2513333,28513333,24786667,44238,44242,44574,300,1,29,null,null,null,null,null,null,"X",null,0.86930093370704853]
[1,270,2021,"FDLRUU-CD-270-2021","https://community.secop.gov.co/Public/Tendering/OpportunityDetail/Index?noticeUID=CO1.NTC.2178989&isFromPublicArea=True&isModal=False\n","Contratos de prestación de servicios profesionales y de apoyo a la gestión","Contratación directa","Prestación de servicios profesionales y de apoyo a la gestión, o para la ejecución de trabajos artísticos que sólo puedan encomendarse a determinadas personas naturales;","\tPRESTAR SUS SERVICIOS ASISTENCIALES PARA LA GESTIÓN DEL RIESGO, EN EL MARCO DE LOS VIGÍAS DEL RIESGO DE LA LOCALIDAD DE RAFAEL URIBE URIBE","Inversión","Un Nuevo Contrato Social y Ambiental para la Bogotá del Siglo XXI",30,{"$f":"IF(ISERROR(VLOOKUP(L101,Proposito_programa!$C$2:$E$59,2,FALSE)),\" \",VLOOKUP(L101,Proposito_programa!$C$2:$E$59,2,FALSE))","v":"Eficiencia en la atención de emergencias"},{"$f":"IF(ISERROR(VLOOKUP(L101,Proposito_programa!$C$2:$E$59,3,FALSE)),\" \",VLOOKUP(L101,Proposito_programa!$C$2:$E$59,3,FALSE))","v":"Propósito 2 : Cambiar Nuestros Hábitos de Vida para Reverdecer a Bogotá y Adaptarnos y Mitigar la Crisis Climática"},"133011602300000001665",1,79792466,"OMAR ALEJANDRO  BAQUERO DIAZ","Persona Natural",null,null,null,8100000,null,null,null,8100000,5760000,44427,44433,44568,135,null,null,null,null,null,null,null,null,"X",null,0.71111111111111114]
[1,239,2021,"FDLRUU-CD-239-2021 ","https://community.secop.gov.co/Public/Tendering/OpportunityDetail/Index?noticeUID=CO1.NTC.2094437&isFromPublicArea=True&isModal=False","Contratos de prestación de servicios profesionales y de apoyo a la gestión","Contratación directa","Prestación de servicios profesionales y de apoyo a la gestión, o para la ejecución de trabajos artísticos que sólo puedan encomendarse a determinadas personas naturales;","PRESTAR SERVICIOS PROFESIONALES AL DESPACHO EN LA FORMULACIÓN, IMPLEMENTACIÓN Y SEGUIMIENTO DE PLANES, PROYECTOS Y ESTRATEGIAS ECONOMICAS, SOCIALES, AMBIENTALES Y CULTURALES, EN LA LOCALIDAD RAFAEL URIBE URIBE","Inversión","Un Nuevo Contrato Social y Ambiental para la Bogotá del Siglo XXI",57,{"$f":"IF(ISERROR(VLOOKUP(L102,Proposito_programa!$C$2:$E$59,2,FALSE)),\" \",VLOOKUP(L102,Proposito_programa!$C$2:$E$59,2,FALSE))","v":"Gestión pública local"},{"$f":"IF(ISERROR(VLOOKUP(L102,Proposito_programa!$C$2:$E$59,3,FALSE)),\" \",VLOOKUP(L102,Proposito_programa!$C$2:$E$59,3,FALSE))","v":"Propósito 5: Construir Bogotá - Región con gobierno abierto, transparente y ciudadanía consciente"},"133011605570000001697",1,1020741588,"OLGA LUCIA BOHORQUEZ DUQUE ","Persona Natural",null,null,null,24000000,null,null,null,24000000,21000000,44390,44393,44500,120,null,null,null,null,null,null,null,null,null,"X",0.875]
[1,304,2021,"FDLRUU-CD-304-2021","https://community.secop.gov.co/Public/Tendering/OpportunityDetail/Index?noticeUID=CO1.NTC.2348631&isFromPublicArea=True&isModal=False\n","Contratos de prestación de servicios profesionales y de apoyo a la gestión","Contratación directa","Prestación de servicios profesionales y de apoyo a la gestión, o para la ejecución de trabajos artísticos que sólo puedan encomendarse a determinadas personas naturales;","APOYAR JURÍDICAMENTE LA EJECUCIÓN DE LAS ACCIONES REQUERIDAS PARA LA DEPURACIÓN DE LAS ACTUACIONES ADMINISTRATIVAS QUE CURSAN EN LA ALCALDÍA LOCAL","Inversión","Un Nuevo Contrato Social y Ambiental para la Bogotá del Siglo XXI",57,{"$f":"IF(ISERROR(VLOOKUP(L103,Proposito_programa!$C$2:$E$59,2,FALSE)),\" \",VLOOKUP(L103,Proposito_programa!$C$2:$E$59,2,FALSE))","v":"Gestión pública local"},{"$f":"IF(ISERROR(VLOOKUP(L103,Proposito_programa!$C$2:$E$59,3,FALSE)),\" \",VLOOKUP(L103,Proposito_programa!$C$2:$E$59,3,FALSE))","v":"Propósito 5: Construir Bogotá - Región con gobierno abierto, transparente y ciudadanía consciente"},"133011605570000001698",1,52484426,"NUBIA ESPERANZA SANTAFE CASTELLANOS ","Persona Natural",null,null,null,12653333,null,null,null,12653333,4506667,44498,44505,44578,73,null,null,null,null,null,null,null,null,"X",null,0.35616441928778764]
[1,6,2021,"FDLRUU-CD-006-2021","https://community.secop.gov.co/Public/Tendering/OpportunityDetail/Index?noticeUID=CO1.NTC.1685643&isFromPublicArea=True&isModal=False\n","Contratos de prestación de servicios profesionales y de apoyo a la gestión","Contratación directa","Prestación de servicios profesionales y de apoyo a la gestión, o para la ejecución de trabajos artísticos que sólo puedan encomendarse a determinadas personas naturales;","APOYAR JURÍDICAMENTE LA EJECUCIÓN DE LAS ACCIONES REQUERIDAS PARA LA DEPURACIÓN DE LAS ACTUACIONES ADMISNITRATIVAS QUE CURSAN EN LA ALCALDÍA LOCAL.","Inversión","Un Nuevo Contrato Social y Ambiental para la Bogotá del Siglo XXI",57,{"$f":"IF(ISERROR(VLOOKUP(L104,Proposito_programa!$C$2:$E$59,2,FALSE)),\" \",VLOOKUP(L104,Proposito_programa!$C$2:$E$59,2,FALSE))","v":"Gestión pública local"},{"$f":"IF(ISERROR(VLOOKUP(L104,Proposito_programa!$C$2:$E$59,3,FALSE)),\" \",VLOOKUP(L104,Proposito_programa!$C$2:$E$59,3,FALSE))","v":"Propósito 5: Construir Bogotá - Región con gobierno abierto, transparente y ciudadanía consciente"},"133011605570000001698",1,52484426,"NUBIA ESPERANZA SANTAFE CASTELLANOS","Persona Natural",null,null,null,31200000,null,1,15600000,46800000,46800000,44221,44225,44497,180,1,90,null,null,null,null,null,null,"X",null,1]
[1,255,2021,"FLDRUU-CD-255-2021","https://community.secop.gov.co/Public/Tendering/OpportunityDetail/Index?noticeUID=CO1.NTC.2165138&isFromPublicArea=True&isModal=False\n","Contratos de prestación de servicios profesionales y de apoyo a la gestión","Contratación directa","Prestación de servicios profesionales y de apoyo a la gestión, o para la ejecución de trabajos artísticos que sólo puedan encomendarse a determinadas personas naturales;","PRESTAR SERVICIOS DE APOYO A LA GESTIÓN LOCAL EN LOS TEMAS DE MITIGACIÓN DEL RIESGO EN CAMPO, EN EL MARCO DEL PLAN DE DESARROLLO LOCAL DE LA LOCALIDAD DE RAFAEL URIBE URIBE","Inversión","Un Nuevo Contrato Social y Ambiental para la Bogotá del Siglo XXI",30,{"$f":"IF(ISERROR(VLOOKUP(L105,Proposito_programa!$C$2:$E$59,2,FALSE)),\" \",VLOOKUP(L105,Proposito_programa!$C$2:$E$59,2,FALSE))","v":"Eficiencia en la atención de emergencias"},{"$f":"IF(ISERROR(VLOOKUP(L105,Proposito_programa!$C$2:$E$59,3,FALSE)),\" \",VLOOKUP(L105,Proposito_programa!$C$2:$E$59,3,FALSE))","v":"Propósito 2 : Cambiar Nuestros Hábitos de Vida para Reverdecer a Bogotá y Adaptarnos y Mitigar la Crisis Climática"},"133011602300000001665",1,52544480,"NINI JOHANNA VARGAS ","Persona Natural",null,null,null,8100000,null,null,null,8100000,6240000,44419,44425,44562,135,null,null,null,null,null,null,null,null,"X",null,0.77037037037037037]
[1,44,2021,"FDLRUU-CD-044-2021","https://community.secop.gov.co/Public/Tendering/OpportunityDetail/Index?noticeUID=CO1.NTC.1732456&isFromPublicArea=True&isModal=False\n","Contratos de prestación de servicios profesionales y de apoyo a la gestión","Contratación directa","Prestación de servicios profesionales y de apoyo a la gestión, o para la ejecución de trabajos artísticos que sólo puedan encomendarse a determinadas personas naturales;","APOYAR LA GESTIÓN DOCUMENTAL DE LA ALCALDÍA LOCAL PARA LA IMPLEMENTACIÓN DEL PROCESO DE VERIFICACIÓN, SOPORTE Y ACOMPAÑAMIENTO, EN EL DESARROLLO DE LAS ACTIVIDADES PROPIAS DE LOS PROCESOS Y ACTUACIONES ADMINISTRATIVAS EXISTENTES","Inversión","Un Nuevo Contrato Social y Ambiental para la Bogotá del Siglo XXI",57,{"$f":"IF(ISERROR(VLOOKUP(L106,Proposito_programa!$C$2:$E$59,2,FALSE)),\" \",VLOOKUP(L106,Proposito_programa!$C$2:$E$59,2,FALSE))","v":"Gestión pública local"},{"$f":"IF(ISERROR(VLOOKUP(L106,Proposito_programa!$C$2:$E$59,3,FALSE)),\" \",VLOOKUP(L106,Proposito_programa!$C$2:$E$59,3,FALSE))","v":"Propósito 5: Construir Bogotá - Región con gobierno abierto, transparente y ciudadanía consciente"},"133011605570000001698",1,52828741,"NINI JOHANA VALENZUELA ","Persona Natural",null,null,null,33000000,null,1,4290000,37290000,32560000,44231,44232,44574,300,1,39,null,null,null,null,null,null,"X",null,0.87315634218289084]
[1,45,2021,"FDLRUU-CD-045-2021","https://community.secop.gov.co/Public/Tendering/OpportunityDetail/Index?noticeUID=CO1.NTC.1733137&isFromPublicArea=True&isModal=False\n","Contratos de prestación de servicios profesionales y de apoyo a la gestión","Contratación directa","Prestación de servicios profesionales y de apoyo a la gestión, o para la ejecución de trabajos artísticos que sólo puedan encomendarse a determinadas personas naturales;","PRESTAR LOS SERVICIOS TECNICOS DE APOYO A LOS PROFESIONALES ENCARGADOS DE LA DEPURACION DE LAS OBLIGACIONES POR PAGAR A CARGO DEL FONDO DE DESARROLLO LOCAL DE RAFAEL URIBE URIBE","Inversión","Un Nuevo Contrato Social y Ambiental para la Bogotá del Siglo XXI",57,{"$f":"IF(ISERROR(VLOOKUP(L107,Proposito_programa!$C$2:$E$59,2,FALSE)),\" \",VLOOKUP(L107,Proposito_programa!$C$2:$E$59,2,FALSE))","v":"Gestión pública local"},{"$f":"IF(ISERROR(VLOOKUP(L107,Proposito_programa!$C$2:$E$59,3,FALSE)),\" \",VLOOKUP(L107,Proposito_programa!$C$2:$E$59,3,FALSE))","v":"Propósito 5: Construir Bogotá - Región con gobierno abierto, transparente y ciudadanía consciente"},"133011605570000001697",1,52343298,"NIDIA YANETH CHITIVA RODRIGUEZ","Persona Natural",null,null,null,39000000,null,1,3770000,42770000,37180000,44238,44242,44574,300,1,29,null,null,null,null,null,null,"X",null,0.8693009118541033]
[1,24,2021,"FDLRUU-CD-024-2021","https://community.secop.gov.co/Public/Tendering/OpportunityDetail/Index?noticeUID=CO1.NTC.1724247&isFromPublicArea=True&isModal=False\n","Contratos de prestación de servicios profesionales y de apoyo a la gestión","Contratación directa","Prestación de servicios profesionales y de apoyo a la gestión, o para la ejecución de trabajos artísticos que sólo puedan encomendarse a determinadas personas naturales;","PRESTAR SUS SERVICIOS DE APOYO ADMINISTRATIVO ASISTENCIAL AL DESPACHO DE LA ALCALDÍA LOCAL DE RAFAEL URIBE URIBE","Inversión","Un Nuevo Contrato Social y Ambiental para la Bogotá del Siglo XXI",57,{"$f":"IF(ISERROR(VLOOKUP(L108,Proposito_programa!$C$2:$E$59,2,FALSE)),\" \",VLOOKUP(L108,Proposito_programa!$C$2:$E$59,2,FALSE))","v":"Gestión pública local"},{"$f":"IF(ISERROR(VLOOKUP(L108,Proposito_programa!$C$2:$E$59,3,FALSE)),\" \",VLOOKUP(L108,Proposito_programa!$C$2:$E$59,3,FALSE))","v":"Propósito 5: Construir Bogotá - Región con gobierno abierto, transparente y ciudadanía consciente"},"133011605570000001697",1,1015465408,"NICOLE DAYAN SILVA VELASCO ","Persona Natural",null,null,null,26000000,null,null,null,26000000,22966667,44229,44230,44495,300,null,null,null,null,null,null,null,null,null,"X",0.88333334615384618]
[1,265,2021,"FDLRUU-CD-265-2021","https://community.secop.gov.co/Public/Tendering/OpportunityDetail/Index?noticeUID=CO1.NTC.2165207&isFromPublicArea=True&isModal=False\n","Contratos de prestación de servicios profesionales y de apoyo a la gestión","Contratación directa","Prestación de servicios profesionales y de apoyo a la gestión, o para la ejecución de trabajos artísticos que sólo puedan encomendarse a determinadas personas naturales;","PRESTAR SUS SERVICIOS ASISTENCIALES PARA LA GESTIÓN DEL RIESGO, EN EL MARCO DE LOS VIGÍAS DEL RIESGO DE LA LOCALIDAD DE RAFAEL URIBE URIBE","Inversión","Un Nuevo Contrato Social y Ambiental para la Bogotá del Siglo XXI",30,{"$f":"IF(ISERROR(VLOOKUP(L109,Proposito_programa!$C$2:$E$59,2,FALSE)),\" \",VLOOKUP(L109,Proposito_programa!$C$2:$E$59,2,FALSE))","v":"Eficiencia en la atención de emergencias"},{"$f":"IF(ISERROR(VLOOKUP(L109,Proposito_programa!$C$2:$E$59,3,FALSE)),\" \",VLOOKUP(L109,Proposito_programa!$C$2:$E$59,3,FALSE))","v":"Propósito 2 : Cambiar Nuestros Hábitos de Vida para Reverdecer a Bogotá y Adaptarnos y Mitigar la Crisis Climática"},"133011602300000001665",1,1032390216,"NELCY MALODY LAMPERA CARRILLO ","Persona Natural",null,null,null,8100000,null,null,null,8100000,6240000,44418,44425,44562,135,null,null,null,null,null,null,null,null,"X",null,0.77037037037037037]
[1,260,2021,"FDLRUU-CD-260-2021","https://community.secop.gov.co/Public/Tendering/OpportunityDetail/Index?noticeUID=CO1.NTC.2167124&isFromPublicArea=True&isModal=False\n","Contratos de prestación de servicios profesionales y de apoyo a la gestión","Contratación directa","Prestación de servicios profesionales y de apoyo a la gestión, o para la ejecución de trabajos artísticos que sólo puedan encomendarse a determinadas personas naturales;","PRESTAR SUS SERVICIOS ASISTENCIALES PARA LA GESTIÓN DEL RIESGO, EN EL MARCO DE LOS VIGÍAS DEL RIESGO DE LA LOCALIDAD DE RAFAEL URIBE URIBE","Inversión","Un Nuevo Contrato Social y Ambiental para la Bogotá del Siglo XXI",30,{"$f":"IF(ISERROR(VLOOKUP(L110,Proposito_programa!$C$2:$E$59,2,FALSE)),\" \",VLOOKUP(L110,Proposito_programa!$C$2:$E$59,2,FALSE))","v":"Eficiencia en la atención de emergencias"},{"$f":"IF(ISERROR(VLOOKUP(L110,Proposito_programa!$C$2:$E$59,3,FALSE)),\" \",VLOOKUP(L110,Proposito_programa!$C$2:$E$59,3,FALSE))","v":"Propósito 2 : Cambiar Nuestros Hábitos de Vida para Reverdecer a Bogotá y Adaptarnos y Mitigar la Crisis Climática"},"133011602300000001665",1,1013593717,"NANCY PAOLA BOLIVAR MACA","Persona Natural",null,null,null,8100000,null,null,null,8100000,5880000,44419,44427,44564,135,null,null,53045067,"JULIETH MARCELA GORDILLO ARIAS",44504,4560000,null,null,"X",null,0.72592592592592597]
[1,204,2021,"FDLRUU-CD-204-2021","https://community.secop.gov.co/Public/Tendering/OpportunityDetail/Index?noticeUID=CO1.NTC.1865279&isFromPublicArea=True&isModal=False\n","Contratos de prestación de servicios profesionales y de apoyo a la gestión","Contratación directa","Prestación de servicios profesionales y de apoyo a la gestión, o para la ejecución de trabajos artísticos que sólo puedan encomendarse a determinadas personas naturales;","APOYAR LA GESTIÓN DOCUMENTAL DE LA ALCALDÍA LOCAL, ACOMPAÑANDO AL EQUIPO JURÍDICO DE DEPURACIÓN EN LAS LABORES OPERATIVAS QUE GENERA EL PROCESO DE IMPULSO DE LAS ACTUACIONES ADMINISTRATIVAS EXISTENTES EN LA ALCALDÍA LOCAL DE RAFAEL URIBE URIBE\t ","Inversión","Un Nuevo Contrato Social y Ambiental para la Bogotá del Siglo XXI",57,{"$f":"IF(ISERROR(VLOOKUP(L111,Proposito_programa!$C$2:$E$59,2,FALSE)),\" \",VLOOKUP(L111,Proposito_programa!$C$2:$E$59,2,FALSE))","v":"Gestión pública local"},{"$f":"IF(ISERROR(VLOOKUP(L111,Proposito_programa!$C$2:$E$59,3,FALSE)),\" \",VLOOKUP(L111,Proposito_programa!$C$2:$E$59,3,FALSE))","v":"Propósito 5: Construir Bogotá - Región con gobierno abierto, transparente y ciudadanía consciente"},"133011605570000001698",1,52832043,"NANCY BRIGITTE RUIZ BUITRAGO","Persona Natural",null,null,null,26000000,null,null,null,26000000,20973333,44279,44284,44589,300,null,null,null,null,null,null,null,null,"X",null,0.80666665384615388]
[1,3,2021,"FDLRUU-CD-003-2021","https://community.secop.gov.co/Public/Tendering/OpportunityDetail/Index?noticeUID=CO1.NTC.1684211&isFromPublicArea=True&isModal=False\n","Contratos de prestación de servicios profesionales y de apoyo a la gestión","Contratación directa","Prestación de servicios profesionales y de apoyo a la gestión, o para la ejecución de trabajos artísticos que sólo puedan encomendarse a determinadas personas naturales;","PRESTAR LOS SERVICIOS PROFESIONALES PARA APOYAR LA REVISIÓN Y/O ELABORACIÓN DE LOS DOCUMENTOS Y GESTIONES PROVENIENTES DE LAS DIFERENTES ÁREAS RELACIONADAS CON TEMAS ADMINISTRATIVOS CONTABLES Y FINANCIEROS DE LOS PROCESOS Y CONTRATOS DEL FONDO DE DESARROLLO LOCAL DE RAFAEL URIBE URIBE.”","Inversión","Un Nuevo Contrato Social y Ambiental para la Bogotá del Siglo XXI",57,{"$f":"IF(ISERROR(VLOOKUP(L112,Proposito_programa!$C$2:$E$59,2,FALSE)),\" \",VLOOKUP(L112,Proposito_programa!$C$2:$E$59,2,FALSE))","v":"Gestión pública local"},{"$f":"IF(ISERROR(VLOOKUP(L112,Proposito_programa!$C$2:$E$59,3,FALSE)),\" \",VLOOKUP(L112,Proposito_programa!$C$2:$E$59,3,FALSE))","v":"Propósito 5: Construir Bogotá - Región con gobierno abierto, transparente y ciudadanía consciente"},"133011605570000001697",1,53077157,"MONICA YAMILE QUEVEDO CORREA","Persona Natural",null,null,null,67000000,null,1,10720000,77720000,68116667,44218,44222,44574,300,1,48,null,null,null,null,null,null,"X",null,0.8764367858980957]
[1,58,2021,"FDLRUU-CD-058-2021","https://community.secop.gov.co/Public/Tendering/OpportunityDetail/Index?noticeUID=CO1.NTC.1748327&isFromPublicArea=True&isModal=False\n","Contratos de prestación de servicios profesionales y de apoyo a la gestión","Contratación directa","Prestación de servicios profesionales y de apoyo a la gestión, o para la ejecución de trabajos artísticos que sólo puedan encomendarse a determinadas personas naturales;","PRESTAR SUS SERVICIOS DE APOYO TECNICO ADMINISTRATIVO EN EL PROCESO DE TOMA FISICA, VERIFICACIÓN, CLASIFICACIÓN Y ACTUALIZACIÓN DE LA INFORMACIÓN DE BIENES MUEBLES E INMUEBLES DE PROPIEDAD Y/O A CARGO DEL FONDO DE DESARROLLO LOCAL DE RAFAEL URIBE URIBE ASÍ COMO LA DEPURACIÓN DE LOS CONTRATOS DE COMODATO Y LAS DEMAS ACTUACIONES ADMINISTRATIVAS QUE GENERE EL AREA DE GESTIÓN PARA EL DESARROLLO LOCAL – ALMACEN DE CONFORMIDAD CON LAS DISPOSICIONES LEGALES VIGENTES”.","Inversión","Un Nuevo Contrato Social y Ambiental para la Bogotá del Siglo XXI",57,{"$f":"IF(ISERROR(VLOOKUP(L113,Proposito_programa!$C$2:$E$59,2,FALSE)),\" \",VLOOKUP(L113,Proposito_programa!$C$2:$E$59,2,FALSE))","v":"Gestión pública local"},{"$f":"IF(ISERROR(VLOOKUP(L113,Proposito_programa!$C$2:$E$59,3,FALSE)),\" \",VLOOKUP(L113,Proposito_programa!$C$2:$E$59,3,FALSE))","v":"Propósito 5: Construir Bogotá - Región con gobierno abierto, transparente y ciudadanía consciente"},"133011605570000001697",1,1026568078,"MONICA TATIANA ARIZA ","Persona Natural",null,null,null,39000000,null,1,4290000,43290000,37700000,44237,44238,44574,300,1,33,null,null,null,null,null,null,"X",null,0.87087087087087089]
[1,11,2021,"FDLRUU-CD-011-2021","https://community.secop.gov.co/Public/Tendering/OpportunityDetail/Index?noticeUID=CO1.NTC.1689714&isFromPublicArea=True&isModal=False\n","Contratos de prestación de servicios profesionales y de apoyo a la gestión","Contratación directa","Prestación de servicios profesionales y de apoyo a la gestión, o para la ejecución de trabajos artísticos que sólo puedan encomendarse a determinadas personas naturales;","APOYAR JURÍDICAMENTE LA EJECUCIÓN DE LAS ACCIONES REQUERIDAS PARA LA DEPURACIÓN DE LAS ACTUACIONES ADMINISTRATIVAS QUE CURSAN EN LA ALCALDÍA LOCAL","Inversión","Un Nuevo Contrato Social y Ambiental para la Bogotá del Siglo XXI",57,{"$f":"IF(ISERROR(VLOOKUP(L114,Proposito_programa!$C$2:$E$59,2,FALSE)),\" \",VLOOKUP(L114,Proposito_programa!$C$2:$E$59,2,FALSE))","v":"Gestión pública local"},{"$f":"IF(ISERROR(VLOOKUP(L114,Proposito_programa!$C$2:$E$59,3,FALSE)),\" \",VLOOKUP(L114,Proposito_programa!$C$2:$E$59,3,FALSE))","v":"Propósito 5: Construir Bogotá - Región con gobierno abierto, transparente y ciudadanía consciente"},"133011605570000001698",1,52857075,"MONICA GOMEZ GUZMAN ","Persona Natural",null,null,null,31200000,null,1,15600000,46800000,46800000,44221,44223,44495,180,1,90,null,null,null,null,null,null,"X",null,1]
[1,48,2021,"FDLRUU-CD-048-2021","https://community.secop.gov.co/Public/Tendering/OpportunityDetail/Index?noticeUID=CO1.NTC.1746007&isFromPublicArea=True&isModal=False\n","Contratos de prestación de servicios profesionales y de apoyo a la gestión","Contratación directa","Prestación de servicios profesionales y de apoyo a la gestión, o para la ejecución de trabajos artísticos que sólo puedan encomendarse a determinadas personas naturales;","PRESTAR LOS SERVICIOS PROFESIONALES COMO ABOGADO PARA APOYAR EN EL ANALISIS REVISION, TRAMITE Y SUSCRIPCION DE LOS ACTOS ADMINISTRATIVOS, DESPACHOS COMISORIOS, TUTELAS Y LOS CONCEPTOS JURIDICOS QUE SE LE SOLICITEN","Inversión","Un Nuevo Contrato Social y Ambiental para la Bogotá del Siglo XXI",57,{"$f":"IF(ISERROR(VLOOKUP(L115,Proposito_programa!$C$2:$E$59,2,FALSE)),\" \",VLOOKUP(L115,Proposito_programa!$C$2:$E$59,2,FALSE))","v":"Gestión pública local"},{"$f":"IF(ISERROR(VLOOKUP(L115,Proposito_programa!$C$2:$E$59,3,FALSE)),\" \",VLOOKUP(L115,Proposito_programa!$C$2:$E$59,3,FALSE))","v":"Propósito 5: Construir Bogotá - Región con gobierno abierto, transparente y ciudadanía consciente"},"133011605570000001698",1,52177304,"MONICA ELVIRA  CRUZ CORREAL","Persona Natural",null,null,null,57000000,null,null,null,57000000,55100000,44236,44238,44540,300,null,null,null,null,null,null,null,null,"X",null,0.96666666666666667]
[1,185,2021,"FDLRUU-CD-185-2021","https://community.secop.gov.co/Public/Tendering/OpportunityDetail/Index?noticeUID=CO1.NTC.1822125&isFromPublicArea=True&isModal=False\n","Contratos de prestación de servicios profesionales y de apoyo a la gestión","Contratación directa","Prestación de servicios profesionales y de apoyo a la gestión, o para la ejecución de trabajos artísticos que sólo puedan encomendarse a determinadas personas naturales;","PRESTAR LOS SERVICIOS PROFESIONALES PARA APOYAR JURIDICAMENTE LA EJECUCIÓN Y SEGUIMIENTO DE LAS ACTIVIDADES DE LOS PROCESOS ASOCIADOS CON LA PLANEACIÓN LOCAL, ASÍ COMO DE LOS PROYECTOS DE INVERSIÓN DEL PLAN DE DESARROLLO LOCAL VIGENCIA 2021 - 2024","Inversión","Un Nuevo Contrato Social y Ambiental para la Bogotá del Siglo XXI",57,{"$f":"IF(ISERROR(VLOOKUP(L116,Proposito_programa!$C$2:$E$59,2,FALSE)),\" \",VLOOKUP(L116,Proposito_programa!$C$2:$E$59,2,FALSE))","v":"Gestión pública local"},{"$f":"IF(ISERROR(VLOOKUP(L116,Proposito_programa!$C$2:$E$59,3,FALSE)),\" \",VLOOKUP(L116,Proposito_programa!$C$2:$E$59,3,FALSE))","v":"Propósito 5: Construir Bogotá - Región con gobierno abierto, transparente y ciudadanía consciente"},"133011605570000001697",1,63501879,"MONICA DUARTE ORTIZ","Persona Natural",null,null,null,65000000,-30983333,null,null,34016667,34016667,44260,44264,44424,300,null,null,null,null,null,null,null,null,null,"X",1]
[1,71,2021,"FDLRUU-CD-071-2021","https://community.secop.gov.co/Public/Tendering/OpportunityDetail/Index?noticeUID=CO1.NTC.1752265&isFromPublicArea=True&isModal=False\n","Contratos de prestación de servicios profesionales y de apoyo a la gestión","Contratación directa","Prestación de servicios profesionales y de apoyo a la gestión, o para la ejecución de trabajos artísticos que sólo puedan encomendarse a determinadas personas naturales;","PRESTAR LOS SERVICIOS ESPECIALIZADOS PARA APOYAR AL DESPACHO DE LA ALCALDÍA LOCAL DE RAFAEL URIBE URIBE EN EL DISEÑO Y ESTRATEGIAS, COORDINACIÓN Y EMISIÓN DE LINEAMIENTOS QUE COADYUVEN AL FORTALECIMIENTO INSTITUCIONAL ENTORNO A LAS ACTIVIDADES QUE REALIZA LA ALCALDÍA LOCAL EN SUS DIFERENTES DEPENDENCIAS","Inversión","Un Nuevo Contrato Social y Ambiental para la Bogotá del Siglo XXI",57,{"$f":"IF(ISERROR(VLOOKUP(L117,Proposito_programa!$C$2:$E$59,2,FALSE)),\" \",VLOOKUP(L117,Proposito_programa!$C$2:$E$59,2,FALSE))","v":"Gestión pública local"},{"$f":"IF(ISERROR(VLOOKUP(L117,Proposito_programa!$C$2:$E$59,3,FALSE)),\" \",VLOOKUP(L117,Proposito_programa!$C$2:$E$59,3,FALSE))","v":"Propósito 5: Construir Bogotá - Región con gobierno abierto, transparente y ciudadanía consciente"},"133011605570000001697",1,1023888264,"MONICA DEL PILAR PARRA RANGEL ","Persona Natural",null,null,null,75000000,null,1,8250000,83250000,72750000,44237,44237,44573,300,1,33,null,null,null,null,null,null,"X",null,0.87387387387387383]
[1,8,2021,"FDLRUU-CD-008-2021","https://community.secop.gov.co/Public/Tendering/ContractNoticePhases/View?PPI=CO1.PPI.11735260&isFromPublicArea=True&isModal=False","Contratos de prestación de servicios profesionales y de apoyo a la gestión","Contratación directa","Prestación de servicios profesionales y de apoyo a la gestión, o para la ejecución de trabajos artísticos que sólo puedan encomendarse a determinadas personas naturales;","PRESTAR LOS SERVICIOS PROFESIONALES PARA DEPURAR LAS OBLIGACIONES POR PAGAR A CARGO DEL FONDO DE DESARROLLO DE RAFAEL URIBE URIBE.","Inversión","Un Nuevo Contrato Social y Ambiental para la Bogotá del Siglo XXI",57,{"$f":"IF(ISERROR(VLOOKUP(L118,Proposito_programa!$C$2:$E$59,2,FALSE)),\" \",VLOOKUP(L118,Proposito_programa!$C$2:$E$59,2,FALSE))","v":"Gestión pública local"},{"$f":"IF(ISERROR(VLOOKUP(L118,Proposito_programa!$C$2:$E$59,3,FALSE)),\" \",VLOOKUP(L118,Proposito_programa!$C$2:$E$59,3,FALSE))","v":"Propósito 5: Construir Bogotá - Región con gobierno abierto, transparente y ciudadanía consciente"},"133011605570000001697",1,52856574,"MILENA VANEGAS LOPEZ","Persona Natural",null,null,null,52000000,null,1,7800000,59800000,52346667,44221,44225,44574,300,1,45,null,null,null,null,null,null,"X",null,0.87536232441471573]
[1,226,2021,"FDLRUU-SABM-226-2021","https://community.secop.gov.co/Public/Tendering/OpportunityDetail/Index?noticeUID=CO1.NTC.2016319&isFromPublicArea=True&isModal=False\n","Contratos de prestación de servicios","Régimen especial","Decreto 92 de 2017","CONTRATAR LA PRESTACIÓN DEL SERVICIO DE VIGILANCIA Y SEGURIDAD PRIVADA A TRAVÉS DE LA BOLSA MERCANTIL DE COLOMBIA S.A. PARA LOS PREDIOS Y/O BIENES DE PROPIEDAD Y/O TENENCIA DEL FONDO DE DESARROLLO LOCAL RAFAEL URIBE URIBE DE CONFORMIDAD CON LAS CONDICIONES TÉCNICAS QUE DESIGNE","Funcionamiento","Un Nuevo Contrato Social y Ambiental para la Bogotá del Siglo XXI","No aplica",{"$f":"IF(ISERROR(VLOOKUP(L119,Proposito_programa!$C$2:$E$59,2,FALSE)),\" \",VLOOKUP(L119,Proposito_programa!$C$2:$E$59,2,FALSE))","v":" "},{"$f":"IF(ISERROR(VLOOKUP(L119,Proposito_programa!$C$2:$E$59,3,FALSE)),\" \",VLOOKUP(L119,Proposito_programa!$C$2:$E$59,3,FALSE))","v":" "},"131020202030501",1,800095131,"MIGUEL QUIJANO Y COMPAÑIA S.A.","Persona Jurídica",null,null,null,524592088,null,1,123889969,648482057,343556142,44351,44371,44651,240,1,39,null,null,null,null,null,"X",null,null,0.52978511632126779]
[1,209,2021,"FDLRUU-CD-209-2021","https://community.secop.gov.co/Public/Tendering/OpportunityDetail/Index?noticeUID=CO1.NTC.1882421&isFromPublicArea=True&isModal=False\n","Contratos de prestación de servicios profesionales y de apoyo a la gestión","Contratación directa","Prestación de servicios profesionales y de apoyo a la gestión, o para la ejecución de trabajos artísticos que sólo puedan encomendarse a determinadas personas naturales;","PRESTAR LOS SERVICIOS PROFESIONALES COMO ABOGADO PARA APOYAR LOS PROCESOS DE CONTRATACIÓN EN SUS DIFERENTES ETAPAS AL ÁREA DE GESTIÓN DEL DESARROLLO DE LA ALCALDÍA LOCAL DE RAFAEL URIBE URIBE","Inversión","Un Nuevo Contrato Social y Ambiental para la Bogotá del Siglo XXI",57,{"$f":"IF(ISERROR(VLOOKUP(L120,Proposito_programa!$C$2:$E$59,2,FALSE)),\" \",VLOOKUP(L120,Proposito_programa!$C$2:$E$59,2,FALSE))","v":"Gestión pública local"},{"$f":"IF(ISERROR(VLOOKUP(L120,Proposito_programa!$C$2:$E$59,3,FALSE)),\" \",VLOOKUP(L120,Proposito_programa!$C$2:$E$59,3,FALSE))","v":"Propósito 5: Construir Bogotá - Región con gobierno abierto, transparente y ciudadanía consciente"},"133011605570000001697",1,80020069,"MICHEL ANDRÉS SALAMANCA RAMÍREZ.","Persona Natural",null,null,null,52000000,null,null,null,52000000,40906667,44286,44291,44596,300,null,null,52883374,"DIANA CAROLINA SANCHEZ CASTILLO",44566,19066667,null,"X",null,null,0.78666667307692306]
[1,28,2021,"FDLRUU-CD-028-2021","https://community.secop.gov.co/Public/Tendering/OpportunityDetail/Index?noticeUID=CO1.NTC.1723860&isFromPublicArea=True&isModal=False\n","Contratos de prestación de servicios profesionales y de apoyo a la gestión","Contratación directa","Prestación de servicios profesionales y de apoyo a la gestión, o para la ejecución de trabajos artísticos que sólo puedan encomendarse a determinadas personas naturales;","PRESTAR LOS SERVICIOS PROFESIONALES PARA APOYAR LA EJECUCIÓN Y SEGUIMIENTO DE LAS ACTIVIDADES DE LOS PROCESOS DE PLANEACION ASOCIADOS CON EL ÁREA DE GESTION DE DESARROLLO LOCAL, ASÍ COMO DE LOS PROYECTOS DE INVERSIÓN DEL PLAN DE DESARROLLO","Inversión","Un Nuevo Contrato Social y Ambiental para la Bogotá del Siglo XXI",57,{"$f":"IF(ISERROR(VLOOKUP(L121,Proposito_programa!$C$2:$E$59,2,FALSE)),\" \",VLOOKUP(L121,Proposito_programa!$C$2:$E$59,2,FALSE))","v":"Gestión pública local"},{"$f":"IF(ISERROR(VLOOKUP(L121,Proposito_programa!$C$2:$E$59,3,FALSE)),\" \",VLOOKUP(L121,Proposito_programa!$C$2:$E$59,3,FALSE))","v":"Propósito 5: Construir Bogotá - Región con gobierno abierto, transparente y ciudadanía consciente"},"133011605570000001697",1,52856929,"MERY JOHANNA ARIAS ROMERO ","Persona Natural",null,null,null,67000000,null,null,null,67000000,59406667,44230,44232,44534,300,null,null,null,null,null,null,null,null,"X",null,0.88666667164179103]
[1,220,2021,"FDLRUU-CD-220-2021","https://community.secop.gov.co/Public/Tendering/OpportunityDetail/Index?noticeUID=CO1.NTC.1972739&isFromPublicArea=True&isModal=False\n","Contratos de prestación de servicios profesionales y de apoyo a la gestión","Contratación directa","Prestación de servicios profesionales y de apoyo a la gestión, o para la ejecución de trabajos artísticos que sólo puedan encomendarse a determinadas personas naturales;","APOYAR JURÍDICAMENTE LA EJECUCIÓN DE LAS ACCIONES REQUERIDAS PARA EL TRÁMITE E IMPULSO PROCESAL DE LAS ACTUACIONES CONTRAVENCIONALES Y/O QUERELLAS QUE CURSEN EN LAS INSPECCIONES DE POLICÍA DE LA LOCALIDAD DE RAFAEL URIBE URIBE","Inversión","Un Nuevo Contrato Social y Ambiental para la Bogotá del Siglo XXI",57,{"$f":"IF(ISERROR(VLOOKUP(L122,Proposito_programa!$C$2:$E$59,2,FALSE)),\" \",VLOOKUP(L122,Proposito_programa!$C$2:$E$59,2,FALSE))","v":"Gestión pública local"},{"$f":"IF(ISERROR(VLOOKUP(L122,Proposito_programa!$C$2:$E$59,3,FALSE)),\" \",VLOOKUP(L122,Proposito_programa!$C$2:$E$59,3,FALSE))","v":"Propósito 5: Construir Bogotá - Región con gobierno abierto, transparente y ciudadanía consciente"},"133011605570000001698",1,52731958,"MERLY JOHANNA GARCIA LOPÉZ","Persona Natural",null,null,null,31200000,null,1,9186667,40386667,30853333,44329,44337,44574,180,1,53,null,null,null,null,null,null,"X",null,0.76394848329524201]
[1,144,2021,"FDLRUU-CD-144-2021","https://community.secop.gov.co/Public/Tendering/OpportunityDetail/Index?noticeUID=CO1.NTC.1795223&isFromPublicArea=True&isModal=False\n","Contratos de prestación de servicios profesionales y de apoyo a la gestión","Contratación directa","Prestación de servicios profesionales y de apoyo a la gestión, o para la ejecución de trabajos artísticos que sólo puedan encomendarse a determinadas personas naturales;","APOYAR LA GESTIÓN DOCUMENTAL DE LA ALCALDÍA LOCAL, ACOMPAÑANDO AL EQUIPO JURÍDICO DE DEPURACIÓN EN LAS LABORES OPERATIVAS QUE GENERA EL PROCESO DE IMPULSO DE LAS ACTUACIONES ADMINISTRATIVAS EXISTENTES EN LA ALCALDÍA LOCAL DE RAFAEL URIBE URIBE”.","Inversión","Un Nuevo Contrato Social y Ambiental para la Bogotá del Siglo XXI",57,{"$f":"IF(ISERROR(VLOOKUP(L123,Proposito_programa!$C$2:$E$59,2,FALSE)),\" \",VLOOKUP(L123,Proposito_programa!$C$2:$E$59,2,FALSE))","v":"Gestión pública local"},{"$f":"IF(ISERROR(VLOOKUP(L123,Proposito_programa!$C$2:$E$59,3,FALSE)),\" \",VLOOKUP(L123,Proposito_programa!$C$2:$E$59,3,FALSE))","v":"Propósito 5: Construir Bogotá - Región con gobierno abierto, transparente y ciudadanía consciente"},"133011605570000001698",1,79975659,"MAURICIO EDUARDO ORTEGON RODRIGUEZ","Persona Natural",null,null,null,26000000,null,null,null,26000000,16206667,44251,44256,44560,300,null,null,86040254,"ALEXANDER MORA MURILLLO",44463,8406667,null,null,"X",null,0.62333334615384617]
[1,169,2021,"FDLRUU-CD-150-2021","https://community.secop.gov.co/Public/Tendering/OpportunityDetail/Index?noticeUID=CO1.NTC.1800149&isFromPublicArea=True&isModal=False\n","Contratos de prestación de servicios profesionales y de apoyo a la gestión","Contratación directa","Prestación de servicios profesionales y de apoyo a la gestión, o para la ejecución de trabajos artísticos que sólo puedan encomendarse a determinadas personas naturales;","EL CONTRATISTA SE OBLIGA CON EL FONDO DE DESARROLLO LOCAL DE RAFAEL URIBE URIBE A PRESTAR SUS SERVICIOS DE APOYO A LA GESTION LOCAL Y TERRITORIAL DE LOS TEMAS DE SEGURIDAD Y CONVIVENCIA CIUDADANA PARA LA ALCALDIA LOCAL DE RAFAEL URIBE URIBE","Inversión","Un Nuevo Contrato Social y Ambiental para la Bogotá del Siglo XXI",43,{"$f":"IF(ISERROR(VLOOKUP(L124,Proposito_programa!$C$2:$E$59,2,FALSE)),\" \",VLOOKUP(L124,Proposito_programa!$C$2:$E$59,2,FALSE))","v":"Cultura ciudadana para la confianza, la convivencia y la participación desde la vida cotidiana"},{"$f":"IF(ISERROR(VLOOKUP(L124,Proposito_programa!$C$2:$E$59,3,FALSE)),\" \",VLOOKUP(L124,Proposito_programa!$C$2:$E$59,3,FALSE))","v":"Propósito 3: Inspirar confianza y legitimidad para vivir sin miedo y ser epicentro de cultura ciudadana, paz y reconciliación"},"133011603430000001680",1,28224210,"MATILDE RAMIREZ GUEVARA ","Persona Natural",null,null,null,19800000,null,1,3080000,22880000,19726667,44253,44257,44574,270,1,42,null,null,null,null,null,null,"X",null,0.86217950174825175]
[1,35,2021,"FDLRUU-CD-035-2021","https://community.secop.gov.co/Public/Tendering/OpportunityDetail/Index?noticeUID=CO1.NTC.1730118&isFromPublicArea=True&isModal=False\n","Contratos de prestación de servicios profesionales y de apoyo a la gestión","Contratación directa","Prestación de servicios profesionales y de apoyo a la gestión, o para la ejecución de trabajos artísticos que sólo puedan encomendarse a determinadas personas naturales;","APOYAR LA GESTIÓN DOCUMENTAL DE LA ALCALDÍA LOCAL PARA LA IMPLEMENTACIÓN DEL PROCESO DE VERIFICACIÓN, SOPORTE Y ACOMPAÑAMIENTO, EN EL DESARROLLO DE LAS ACTIVIDADES PROPIAS DE LOS PROCESOS Y ACTUACIONES ADMINISTRATIVAS EXISTENTES","Inversión","Un Nuevo Contrato Social y Ambiental para la Bogotá del Siglo XXI",57,{"$f":"IF(ISERROR(VLOOKUP(L125,Proposito_programa!$C$2:$E$59,2,FALSE)),\" \",VLOOKUP(L125,Proposito_programa!$C$2:$E$59,2,FALSE))","v":"Gestión pública local"},{"$f":"IF(ISERROR(VLOOKUP(L125,Proposito_programa!$C$2:$E$59,3,FALSE)),\" \",VLOOKUP(L125,Proposito_programa!$C$2:$E$59,3,FALSE))","v":"Propósito 5: Construir Bogotá - Región con gobierno abierto, transparente y ciudadanía consciente"},"133011605570000001698",1,52442869,"MATILDE DEL PILAR CAMARGO PINTO","Persona Natural",null,null,null,33000000,null,1,3740000,36740000,32120000,44232,44236,44574,300,1,35,null,null,null,null,null,null,"X",null,0.87425149700598803]
[1,59,2021,"FDLRUU-CD-059-2021","https://community.secop.gov.co/Public/Tendering/OpportunityDetail/Index?noticeUID=CO1.NTC.1744348&isFromPublicArea=True&isModal=False\n","Contratos de prestación de servicios profesionales y de apoyo a la gestión","Contratación directa","Prestación de servicios profesionales y de apoyo a la gestión, o para la ejecución de trabajos artísticos que sólo puedan encomendarse a determinadas personas naturales;","APOYAR LAS LABORES DE ENTREGA Y RECIBO DE LAS COMUNICACIONES EMITIDAS O RECIBIDAS POR LA ALCALDÍA LOCAL DE RAFAEL URIBE URIBE","Inversión","Un Nuevo Contrato Social y Ambiental para la Bogotá del Siglo XXI",57,{"$f":"IF(ISERROR(VLOOKUP(L126,Proposito_programa!$C$2:$E$59,2,FALSE)),\" \",VLOOKUP(L126,Proposito_programa!$C$2:$E$59,2,FALSE))","v":"Gestión pública local"},{"$f":"IF(ISERROR(VLOOKUP(L126,Proposito_programa!$C$2:$E$59,3,FALSE)),\" \",VLOOKUP(L126,Proposito_programa!$C$2:$E$59,3,FALSE))","v":"Propósito 5: Construir Bogotá - Región con gobierno abierto, transparente y ciudadanía consciente"},"133011605570000001697",1,52199191,"MARTHA YANETH PRADO SANCHEZ","Persona Natural",null,null,null,26000000,null,1,2860000,28860000,25220000,44236,44237,44573,300,1,33,null,null,null,null,null,null,"X",null,0.87387387387387383]
[1,143,2021,"FDLRUU-CD-143-2021","https://community.secop.gov.co/Public/Tendering/OpportunityDetail/Index?noticeUID=CO1.NTC.1799782&isFromPublicArea=True&isModal=False\n","Contratos de prestación de servicios profesionales y de apoyo a la gestión","Contratación directa","Prestación de servicios profesionales y de apoyo a la gestión, o para la ejecución de trabajos artísticos que sólo puedan encomendarse a determinadas personas naturales;","COORDINAR, LIDERAR Y ASESORAR LOS PLANES Y ESTRATEGIAS DE COMUNICACIÓN INTERNA Y EXTERNA PARA LA DIVULGACIÓN DE LOS PROGRAMAS, PROYECTOS Y ACTIVIDADES DE LA ALCALDÍA LOCAL DE RAFAEL URIBE URIBE","Inversión","Un Nuevo Contrato Social y Ambiental para la Bogotá del Siglo XXI",57,{"$f":"IF(ISERROR(VLOOKUP(L127,Proposito_programa!$C$2:$E$59,2,FALSE)),\" \",VLOOKUP(L127,Proposito_programa!$C$2:$E$59,2,FALSE))","v":"Gestión pública local"},{"$f":"IF(ISERROR(VLOOKUP(L127,Proposito_programa!$C$2:$E$59,3,FALSE)),\" \",VLOOKUP(L127,Proposito_programa!$C$2:$E$59,3,FALSE))","v":"Propósito 5: Construir Bogotá - Región con gobierno abierto, transparente y ciudadanía consciente"},"133011605570000001697",1,50868594,"MARTHA LUCÍA AGAMEZ VILLEGAS","Persona Natural",null,null,null,67000000,null,null,null,67000000,56503333,44265,44273,44578,300,null,null,null,null,null,null,null,null,"X",null,0.84333332835820896]
[1,84,2021,"FDLRUU-CD-084-2021","https://community.secop.gov.co/Public/Tendering/ContractNoticePhases/View?PPI=CO1.PPI.12004471&isFromPublicArea=True&isModal=False","Contratos de prestación de servicios profesionales y de apoyo a la gestión","Contratación directa","Prestación de servicios profesionales y de apoyo a la gestión, o para la ejecución de trabajos artísticos que sólo puedan encomendarse a determinadas personas naturales;","EL CONTRATISTA SE OBLIGAA PRESTAR SUS SERVICIOS PROFESIONALES EN EL ÁREA DE GESTIÓN DEL DESARROLLO LOCAL -PLANEACIÓN, REALIZANDO LAS ACTIVIDADES PROPIAS PARA LA FORMULACION, EJECUCIÓN Y SEGUIMIENTO DE LOS PROYECTOS DE INVERSIÓN DEL PLAN DE DESARROLLO LOCAL 2021 - 2024","Inversión","Un Nuevo Contrato Social y Ambiental para la Bogotá del Siglo XXI",57,{"$f":"IF(ISERROR(VLOOKUP(L128,Proposito_programa!$C$2:$E$59,2,FALSE)),\" \",VLOOKUP(L128,Proposito_programa!$C$2:$E$59,2,FALSE))","v":"Gestión pública local"},{"$f":"IF(ISERROR(VLOOKUP(L128,Proposito_programa!$C$2:$E$59,3,FALSE)),\" \",VLOOKUP(L128,Proposito_programa!$C$2:$E$59,3,FALSE))","v":"Propósito 5: Construir Bogotá - Región con gobierno abierto, transparente y ciudadanía consciente"},"133011605570000001697",1,1075267896,"MARTHA LILIANA SILVA ESQUIVEL","Persona Natural",null,null,null,52000000,null,1,5546667,57546667,50093333,44238,44239,44574,300,1,32,null,null,null,null,null,null,"X",null,0.8704819168762632]
[1,184,2021,"FDLRUU-CD-184-2021","https://community.secop.gov.co/Public/Tendering/OpportunityDetail/Index?noticeUID=CO1.NTC.1827668&isFromPublicArea=True&isModal=False\n","Contratos de prestación de servicios profesionales y de apoyo a la gestión","Contratación directa","Prestación de servicios profesionales y de apoyo a la gestión, o para la ejecución de trabajos artísticos que sólo puedan encomendarse a determinadas personas naturales;","PRESTAR LOS SERVICIOS PROFESIONALES AL DESPACHO DE LA ALCALDÍA LOCAL DE RAFAEL URIBE URIBE EN EL ANÁLISIS, TRÁMITE, CONCEPTUALIZACIÓN DE ACCIONES Y LINEAMIENTOS EN LOS PROCESOS DE LA GESTIÓN PÚBLICA QUE SE REQUIERA","Inversión","Un Nuevo Contrato Social y Ambiental para la Bogotá del Siglo XXI",57,{"$f":"IF(ISERROR(VLOOKUP(L129,Proposito_programa!$C$2:$E$59,2,FALSE)),\" \",VLOOKUP(L129,Proposito_programa!$C$2:$E$59,2,FALSE))","v":"Gestión pública local"},{"$f":"IF(ISERROR(VLOOKUP(L129,Proposito_programa!$C$2:$E$59,3,FALSE)),\" \",VLOOKUP(L129,Proposito_programa!$C$2:$E$59,3,FALSE))","v":"Propósito 5: Construir Bogotá - Región con gobierno abierto, transparente y ciudadanía consciente"},"133011605570000001697",1,51949741,"MARTHA CECILIA PRIETO LOZANO ","Persona Natural",null,null,null,31200000,null,1,15600000,46800000,45240000,44263,44265,44539,180,1,90,null,null,null,null,null,null,"X",null,0.96666666666666667]
[1,75,2021,"FDLRUU-CD-075-2021","https://community.secop.gov.co/Public/Tendering/OpportunityDetail/Index?noticeUID=CO1.NTC.1757055&isFromPublicArea=True&isModal=False\n","Contratos de prestación de servicios profesionales y de apoyo a la gestión","Contratación directa","Prestación de servicios profesionales y de apoyo a la gestión, o para la ejecución de trabajos artísticos que sólo puedan encomendarse a determinadas personas naturales;","APOYAR LAS LABORES DE ENTREGA Y RECIBO DE LAS COMUNICACIONES EMITIDAS O RECIBIDAS POR LA ALCALDÍA LOCAL DE RAFAEL URIBE URIBE","Inversión","Un Nuevo Contrato Social y Ambiental para la Bogotá del Siglo XXI",57,{"$f":"IF(ISERROR(VLOOKUP(L130,Proposito_programa!$C$2:$E$59,2,FALSE)),\" \",VLOOKUP(L130,Proposito_programa!$C$2:$E$59,2,FALSE))","v":"Gestión pública local"},{"$f":"IF(ISERROR(VLOOKUP(L130,Proposito_programa!$C$2:$E$59,3,FALSE)),\" \",VLOOKUP(L130,Proposito_programa!$C$2:$E$59,3,FALSE))","v":"Propósito 5: Construir Bogotá - Región con gobierno abierto, transparente y ciudadanía consciente"},"133011605570000001697",1,1052388338,"MARLON ALEJANDRO LEAL  PENAGOS","Persona Natural",null,null,null,26000000,null,1,2513333,28513333,24786667,44238,44242,44574,300,1,29,null,null,null,null,null,null,"X",null,0.86930093370704853]
[1,130,2021,"FDLRUU-CD-130-2021","https://community.secop.gov.co/Public/Tendering/OpportunityDetail/Index?noticeUID=CO1.NTC.1783203&isFromPublicArea=True&isModal=False\n","Contratos de prestación de servicios profesionales y de apoyo a la gestión","Contratación directa","Prestación de servicios profesionales y de apoyo a la gestión, o para la ejecución de trabajos artísticos que sólo puedan encomendarse a determinadas personas naturales;","APOYAR LA FORMULACIÓN, GESTIÓN Y SEGUIMIENTO DE ACTIVIDADES ENFOCADAS A LA GESTIÓN AMBIENTAL EXTERNA, ENCAMINADAS A LA MITIGACIÓN DE LOS DIFERENTES IMPACTOS AMBIENTALES Y LA CONSERVACIÓN DE LOS RECURSOS NATURALES DE LA LOCALIDAD","Inversión","Un Nuevo Contrato Social y Ambiental para la Bogotá del Siglo XXI",57,{"$f":"IF(ISERROR(VLOOKUP(L131,Proposito_programa!$C$2:$E$59,2,FALSE)),\" \",VLOOKUP(L131,Proposito_programa!$C$2:$E$59,2,FALSE))","v":"Gestión pública local"},{"$f":"IF(ISERROR(VLOOKUP(L131,Proposito_programa!$C$2:$E$59,3,FALSE)),\" \",VLOOKUP(L131,Proposito_programa!$C$2:$E$59,3,FALSE))","v":"Propósito 5: Construir Bogotá - Región con gobierno abierto, transparente y ciudadanía consciente"},"133011605570000001697",1,52538287,"MARIBEL PEÑA PRIETO","Persona Natural",null,null,null,52000000,null,null,null,52000000,48880000,44246,44246,44548,300,null,null,null,null,null,null,null,null,"X",null,0.94]
[1,89,2021,"FDLRUU-CD-089-2021","https://community.secop.gov.co/Public/Tendering/OpportunityDetail/Index?noticeUID=CO1.NTC.1756731&isFromPublicArea=True&isModal=False\n","Contratos de prestación de servicios profesionales y de apoyo a la gestión","Contratación directa","Prestación de servicios profesionales y de apoyo a la gestión, o para la ejecución de trabajos artísticos que sólo puedan encomendarse a determinadas personas naturales;","EL CONTRATISTA SE OBLIGA A PRESTAR SUS SERVICIOS PROFESIONALES EN EL ÁREA DE GESTIÓN DEL DESARROLLO LOCAL - PLANEACIÓN, REALIZANDO LAS ACTIVIDADES PROPIAS PARA LA FORMULACION, EJECUCIÓN Y SEGUIMIENTO DE LOS PROYECTOS DE INVERSIÓN DEL PLAN DE DESARROLLO LOCAL 2021 - 2024","Inversión","Un Nuevo Contrato Social y Ambiental para la Bogotá del Siglo XXI",57,{"$f":"IF(ISERROR(VLOOKUP(L132,Proposito_programa!$C$2:$E$59,2,FALSE)),\" \",VLOOKUP(L132,Proposito_programa!$C$2:$E$59,2,FALSE))","v":"Gestión pública local"},{"$f":"IF(ISERROR(VLOOKUP(L132,Proposito_programa!$C$2:$E$59,3,FALSE)),\" \",VLOOKUP(L132,Proposito_programa!$C$2:$E$59,3,FALSE))","v":"Propósito 5: Construir Bogotá - Región con gobierno abierto, transparente y ciudadanía consciente"},"133011605570000001697",1,1014213321,"MARIBEL NEUSA SOTELO ","Persona Natural",null,null,null,52000000,null,1,4853333,56853333,49400000,44239,44243,44574,300,1,28,null,null,null,null,null,null,"X",null,0.86890244411879947]
[1,5,2021,"FDLRUU-CD-005-2021","https://community.secop.gov.co/Public/Tendering/OpportunityDetail/Index?noticeUID=CO1.NTC.1685058&isFromPublicArea=True&isModal=False\n","Contratos de prestación de servicios profesionales y de apoyo a la gestión","Contratación directa","Prestación de servicios profesionales y de apoyo a la gestión, o para la ejecución de trabajos artísticos que sólo puedan encomendarse a determinadas personas naturales;","APOYAR JURÍDICAMENTE LA EJECUCIÓN DE LAS ACCIONES REQUERIDAS PARA LA DEPURACIÓN DE LAS ACTUACIONES ADMINISTRATIVAS QUE CURSAN EN LA ALCALDÍA LOCAL","Inversión","Un Nuevo Contrato Social y Ambiental para la Bogotá del Siglo XXI",57,{"$f":"IF(ISERROR(VLOOKUP(L133,Proposito_programa!$C$2:$E$59,2,FALSE)),\" \",VLOOKUP(L133,Proposito_programa!$C$2:$E$59,2,FALSE))","v":"Gestión pública local"},{"$f":"IF(ISERROR(VLOOKUP(L133,Proposito_programa!$C$2:$E$59,3,FALSE)),\" \",VLOOKUP(L133,Proposito_programa!$C$2:$E$59,3,FALSE))","v":"Propósito 5: Construir Bogotá - Región con gobierno abierto, transparente y ciudadanía consciente"},"133011605570000001698",1,51654246,"MARIA LUISA PARRA SANCHEZ ","Persona Natural",null,null,null,31200000,null,1,15600000,46800000,46800000,44221,44225,44497,180,1,90,null,null,null,null,null,null,"X",null,1]
[1,412,2020,"FDLRUU-CD-412-2020 ","https://community.secop.gov.co/Public/Tendering/ContractNoticePhases/View?PPI=CO1.PPI.10945304&isFromPublicArea=True&isModal=False\n","Arrendamiento de bienes inmuebles","Contratación directa","El arrendamiento o adquisición de inmuebles","CONTRATAR EL ARRENDAMIENTO DE UN ÁREA QUE SIRVA COMO ESTACIONAMIENTO DE LOS VEHÍCULOS Y LA MAQUINARIA PESADA A CARGO DEL FONDO DE DESARROLLO LOCAL RAFAEL URIBE URIBE”","Inversión","Un Nuevo Contrato Social y Ambiental para la Bogotá del Siglo XXI",49,{"$f":"IF(ISERROR(VLOOKUP(L134,Proposito_programa!$C$2:$E$59,2,FALSE)),\" \",VLOOKUP(L134,Proposito_programa!$C$2:$E$59,2,FALSE))","v":"Movilidad segura, sostenible y accesible"},{"$f":"IF(ISERROR(VLOOKUP(L134,Proposito_programa!$C$2:$E$59,3,FALSE)),\" \",VLOOKUP(L134,Proposito_programa!$C$2:$E$59,3,FALSE))","v":"Propósito 4: Hacer de Bogotá Región un modelo de movilidad multimodal, incluyente y sostenible"},"133011604490000001685",1,35489792,"MARIA HELENA ROSAS MELO ","Persona Natural",null,null,null,null,null,1,4167224,4167224,0,44406,44406,44581,400,1,40,null,null,null,null,null,"X",null,null,0]
[1,31,2021,"FDLRUU-CD-031-2021","https://community.secop.gov.co/Public/Tendering/OpportunityDetail/Index?noticeUID=CO1.NTC.1725615&isFromPublicArea=True&isModal=False\n","Contratos de prestación de servicios profesionales y de apoyo a la gestión","Contratación directa","Prestación de servicios profesionales y de apoyo a la gestión, o para la ejecución de trabajos artísticos que sólo puedan encomendarse a determinadas personas naturales;","PRESTAR LOS SERVICIOS PROFESIONALES PARA LA OPERACIÓN, PRESTACIÓN, SEGUIMIENTO Y CUMPLIMIENTO PROCEDIMIENTOS ADMINISTRATIVOS OPERATIVOS Y PROGRAMÁTICOS DEL SERVICIO APOYO ECONÓMICO TIPO C, QUE CONTRIBUYAN A LA GARANTÍA DE LOS DERECHOS DE LA POBLACIÓN MAYOR EN EL MARCO DE LA POLÍTICA PÚBLICA SOCIAL PARA EL ENVEJECIMIENTO Y LA VEJEZ EN EL DISTRITO CAPITAL A CARGO DE LA ALCALDÍA LOCAL RAFAEL URIBE URIBE","Inversión","Un Nuevo Contrato Social y Ambiental para la Bogotá del Siglo XXI",1,{"$f":"IF(ISERROR(VLOOKUP(L135,Proposito_programa!$C$2:$E$59,2,FALSE)),\" \",VLOOKUP(L135,Proposito_programa!$C$2:$E$59,2,FALSE))","v":"Subsidios y transferencias para la equidad"},{"$f":"IF(ISERROR(VLOOKUP(L135,Proposito_programa!$C$2:$E$59,3,FALSE)),\" \",VLOOKUP(L135,Proposito_programa!$C$2:$E$59,3,FALSE))","v":"Propósito 1: Hacer un nuevo contrato social para incrementar la inclusión social, productiva y política"},"133011601010000001636",1,1014187761,"MARIA DEL PILAR VARGAS TALERO ","Persona Natural",null,null,null,41600000,null,null,null,41600000,24960000,44230,44232,44630,240,null,null,null,null,null,null,null,"X",null,null,0.6]
[1,297,2021,"FDLRUU-CD-297-2021","https://community.secop.gov.co/Public/Tendering/OpportunityDetail/Index?noticeUID=CO1.NTC.2292807&isFromPublicArea=True&isModal=False","Contratos de prestación de servicios profesionales y de apoyo a la gestión","Contratación directa","Prestación de servicios profesionales y de apoyo a la gestión, o para la ejecución de trabajos artísticos que sólo puedan encomendarse a determinadas personas naturales;","PRESTAR SERVICIOS PROFESIONALES PARA REALIZAR ACUERDOS QUE PROMUEVAN LA PARTICIPACION DE LA POBLACION VULNERABLE, QUE GENEREN EMPRENDIMIENTOS FORMALIZADOS QUE COADYUVEN AL DESARROLLO ECONOMICO Y PRODUCTIVO DE ESTA POBLACION EN EL MARCO DEL PROYECTO DE INVERSION 1681","Inversión","Un Nuevo Contrato Social y Ambiental para la Bogotá del Siglo XXI",45,{"$f":"IF(ISERROR(VLOOKUP(L136,Proposito_programa!$C$2:$E$59,2,FALSE)),\" \",VLOOKUP(L136,Proposito_programa!$C$2:$E$59,2,FALSE))","v":"Espacio público más seguro y construido colectivamente"},{"$f":"IF(ISERROR(VLOOKUP(L136,Proposito_programa!$C$2:$E$59,3,FALSE)),\" \",VLOOKUP(L136,Proposito_programa!$C$2:$E$59,3,FALSE))","v":"Propósito 3: Inspirar confianza y legitimidad para vivir sin miedo y ser epicentro de cultura ciudadana, paz y reconciliación"},"133011603450000001681",1,51964213,"MARIA DE LOS ANGELES ORJUELA ","Persona Natural",null,null,null,20000000,null,null,null,20000000,8333333,44474,44480,44602,120,null,null,null,null,null,null,null,"X",null,null,0.41666665000000003]
[1,187,2021,"FDLRUU-CD-187-2021","https://community.secop.gov.co/Public/Tendering/OpportunityDetail/Index?noticeUID=CO1.NTC.1827700&isFromPublicArea=True&isModal=False\n","Contratos de prestación de servicios profesionales y de apoyo a la gestión","Contratación directa","Prestación de servicios profesionales y de apoyo a la gestión, o para la ejecución de trabajos artísticos que sólo puedan encomendarse a determinadas personas naturales;","PRESTAR LOS SERVICIOS PROFESIONALES DE APOYO JURIDICO AL AREA DE GESTION POLICIVA NORMATIVA Y JURIDICA DE LA ALCALDIA LOCAL DE RAFAEL URIBE URIBE EN EL DESEMPEÑO DE LAS FUNCIONES ASIGNADAS A\nLA ALCALDÍA LOCAL DE RAFAEL URIBE URIBE.","Inversión","Un Nuevo Contrato Social y Ambiental para la Bogotá del Siglo XXI",57,{"$f":"IF(ISERROR(VLOOKUP(L137,Proposito_programa!$C$2:$E$59,2,FALSE)),\" \",VLOOKUP(L137,Proposito_programa!$C$2:$E$59,2,FALSE))","v":"Gestión pública local"},{"$f":"IF(ISERROR(VLOOKUP(L137,Proposito_programa!$C$2:$E$59,3,FALSE)),\" \",VLOOKUP(L137,Proposito_programa!$C$2:$E$59,3,FALSE))","v":"Propósito 5: Construir Bogotá - Región con gobierno abierto, transparente y ciudadanía consciente"},"133011605570000001698",1,1121832284,"MARIA CATALINA ALVAREZ RAMIREZ","Persona Natural",null,null,null,62000000,null,null,null,62000000,52700000,44263,44271,44576,300,null,null,null,null,null,null,null,null,"X",null,0.85]
[1,118,2021,"FDLRUU-CD-118-2021","https://community.secop.gov.co/Public/Tendering/OpportunityDetail/Index?noticeUID=CO1.NTC.1776152&isFromPublicArea=True&isModal=False\n","Contratos de prestación de servicios profesionales y de apoyo a la gestión","Contratación directa","Prestación de servicios profesionales y de apoyo a la gestión, o para la ejecución de trabajos artísticos que sólo puedan encomendarse a determinadas personas naturales;","APOYAR ADMINISTRATIVA Y ASISTENCIALMENTE AL ÁREA DE GESTION DE DESARROLLO LOCAL - CONTRATACIÓN DE LA  ALCALDÍA LOCAL DE RAFAEL URIBE URIBE ","Inversión","Un Nuevo Contrato Social y Ambiental para la Bogotá del Siglo XXI",57,{"$f":"IF(ISERROR(VLOOKUP(L138,Proposito_programa!$C$2:$E$59,2,FALSE)),\" \",VLOOKUP(L138,Proposito_programa!$C$2:$E$59,2,FALSE))","v":"Gestión pública local"},{"$f":"IF(ISERROR(VLOOKUP(L138,Proposito_programa!$C$2:$E$59,3,FALSE)),\" \",VLOOKUP(L138,Proposito_programa!$C$2:$E$59,3,FALSE))","v":"Propósito 5: Construir Bogotá - Región con gobierno abierto, transparente y ciudadanía consciente"},"133011605570000001697",1,1031170465,"MARIA ANGELICA VINCHIRA SANCHEZ ","Persona Natural",null,null,null,26000000,null,null,null,26000000,24093333,44246,44250,44552,300,null,null,null,null,null,null,null,null,"X",null,0.92666665384615388]
[1,164,2021,"FDLRUU-CD-150-2021","https://community.secop.gov.co/Public/Tendering/OpportunityDetail/Index?noticeUID=CO1.NTC.1800149&isFromPublicArea=True&isModal=False\n","Contratos de prestación de servicios profesionales y de apoyo a la gestión","Contratación directa","Prestación de servicios profesionales y de apoyo a la gestión, o para la ejecución de trabajos artísticos que sólo puedan encomendarse a determinadas personas naturales;","EL CONTRATISTA SE OBLIGA CON EL FONDO DE DESARROLLO LOCAL DE RAFAEL URIBE URIBE A PRESTAR SUS SERVICIOS DE APOYO A LA GESTION LOCAL Y TERRITORIAL DE LOS TEMAS DE SEGURIDAD Y CONVIVENCIA CIUDADANA PARA LA ALCALDIA LOCAL DE RAFAEL URIBE URIBE","Inversión","Un Nuevo Contrato Social y Ambiental para la Bogotá del Siglo XXI",43,{"$f":"IF(ISERROR(VLOOKUP(L139,Proposito_programa!$C$2:$E$59,2,FALSE)),\" \",VLOOKUP(L139,Proposito_programa!$C$2:$E$59,2,FALSE))","v":"Cultura ciudadana para la confianza, la convivencia y la participación desde la vida cotidiana"},{"$f":"IF(ISERROR(VLOOKUP(L139,Proposito_programa!$C$2:$E$59,3,FALSE)),\" \",VLOOKUP(L139,Proposito_programa!$C$2:$E$59,3,FALSE))","v":"Propósito 3: Inspirar confianza y legitimidad para vivir sin miedo y ser epicentro de cultura ciudadana, paz y reconciliación"},"133011603430000001680",1,1015477634,"MARIA ALEJANDRA CARVAJAL AVELLANEDA","Persona Natural",null,null,null,19800000,null,null,null,19800000,18626667,44271,44272,44546,270,null,null,null,null,null,null,null,null,"X",null,0.94074075757575759]
[1,29,2021,"FLDRUU-CD-029-2021","https://community.secop.gov.co/Public/Tendering/OpportunityDetail/Index?noticeUID=CO1.NTC.1722938&isFromPublicArea=True&isModal=False\n","Contratos de prestación de servicios profesionales y de apoyo a la gestión","Contratación directa","Prestación de servicios profesionales y de apoyo a la gestión, o para la ejecución de trabajos artísticos que sólo puedan encomendarse a determinadas personas naturales;","PRESTAR SERVICIOS PROFESIONALES ESPECIALIZADOS AL DESPACHO DEL ALCALDE LOCAL EN LA FORMULACIÓN E IMPLEMENTACIÓN DE ESTRATEGIAS INTERINSTITUCIONALES EN ASPECTOS ECONOMICOS, SOCIALES Y CULTURALES, QUE IMPACTEN EN LA LOCALIDAD RAFAEL URIBE URIB","Inversión","Un Nuevo Contrato Social y Ambiental para la Bogotá del Siglo XXI",57,{"$f":"IF(ISERROR(VLOOKUP(L140,Proposito_programa!$C$2:$E$59,2,FALSE)),\" \",VLOOKUP(L140,Proposito_programa!$C$2:$E$59,2,FALSE))","v":"Gestión pública local"},{"$f":"IF(ISERROR(VLOOKUP(L140,Proposito_programa!$C$2:$E$59,3,FALSE)),\" \",VLOOKUP(L140,Proposito_programa!$C$2:$E$59,3,FALSE))","v":"Propósito 5: Construir Bogotá - Región con gobierno abierto, transparente y ciudadanía consciente"},"133011605570000001697",1,30237285,"MANUELITA ARIAS GIRALDO","Persona Natural",null,null,null,75000000,null,null,null,75000000,74250000,44230,44231,44533,300,null,null,1143326992,"JOSE DAVID RODRGUEZ MENDOZA","31/07/2021, -31/08/2021",23250000,null,null,"X",null,0.99]
[1,151,2021,"FDLRUU-CD-150-2021","https://community.secop.gov.co/Public/Tendering/OpportunityDetail/Index?noticeUID=CO1.NTC.1800149&isFromPublicArea=True&isModal=False\n","Contratos de prestación de servicios profesionales y de apoyo a la gestión","Contratación directa","Prestación de servicios profesionales y de apoyo a la gestión, o para la ejecución de trabajos artísticos que sólo puedan encomendarse a determinadas personas naturales;","EL CONTRATISTA SE OBLIGA CON EL FONDO DE DESARROLLO LOCAL DE RAFAEL URIBE URIBE A PRESTAR SUS SERVICIOS DE APOYO A LA GESTION LOCAL Y TERRITORIAL DE LOS TEMAS DE SEGURIDAD Y CONVIVENCIA CIUDADANA PARA LA ALCALDIA LOCAL DE RAFAEL URIBE URIBE","Inversión","Un Nuevo Contrato Social y Ambiental para la Bogotá del Siglo XXI",43,{"$f":"IF(ISERROR(VLOOKUP(L141,Proposito_programa!$C$2:$E$59,2,FALSE)),\" \",VLOOKUP(L141,Proposito_programa!$C$2:$E$59,2,FALSE))","v":"Cultura ciudadana para la confianza, la convivencia y la participación desde la vida cotidiana"},{"$f":"IF(ISERROR(VLOOKUP(L141,Proposito_programa!$C$2:$E$59,3,FALSE)),\" \",VLOOKUP(L141,Proposito_programa!$C$2:$E$59,3,FALSE))","v":"Propósito 3: Inspirar confianza y legitimidad para vivir sin miedo y ser epicentro de cultura ciudadana, paz y reconciliación"},"133011603430000001680",1,1023882603,"MANUEL DUVAN GONZALO VELASQUEZ GRACIA","Persona Natural",null,null,null,19800000,null,1,3080000,22880000,19726667,44253,44257,44574,270,1,42,null,null,null,null,null,null,"X",null,0.86217950174825175]
[1,88,2021,"FDLRUU-CD-088-2021","https://community.secop.gov.co/Public/Tendering/OpportunityDetail/Index?noticeUID=CO1.NTC.1755891&isFromPublicArea=True&isModal=False","Contratos de prestación de servicios profesionales y de apoyo a la gestión","Contratación directa","Prestación de servicios profesionales y de apoyo a la gestión, o para la ejecución de trabajos artísticos que sólo puedan encomendarse a determinadas personas naturales;","EL CONTRATISTA SE OBLIGA A PRESTAR SUS SERVICIOS PROFESIONALES EN EL ÁREA DE GESTIÓN DEL DESARROLLO LOCAL - PLANEACIÓN, REALIZANDO LAS ACTIVIDADES PROPIAS PARA LA FORMULACION, EJECUCIÓN Y SEGUIMIENTO DE LOS PROYECTOS DE INVERSIÓN DEL PLAN DE DESARROLLO LOCAL 2021 – 2024 RELACIONADOS CON LOS SECTORES HABITAT Y AMBIENTE","Inversión","Un Nuevo Contrato Social y Ambiental para la Bogotá del Siglo XXI",57,{"$f":"IF(ISERROR(VLOOKUP(L142,Proposito_programa!$C$2:$E$59,2,FALSE)),\" \",VLOOKUP(L142,Proposito_programa!$C$2:$E$59,2,FALSE))","v":"Gestión pública local"},{"$f":"IF(ISERROR(VLOOKUP(L142,Proposito_programa!$C$2:$E$59,3,FALSE)),\" \",VLOOKUP(L142,Proposito_programa!$C$2:$E$59,3,FALSE))","v":"Propósito 5: Construir Bogotá - Región con gobierno abierto, transparente y ciudadanía consciente"},"133011605570000001697",1,1018475446,"MAIRA ALEJANDRA MORENO LOZANO","Persona Natural",null,null,null,52000000,null,1,5026667,57026667,49573333,44238,44242,44574,300,1,29,null,null,null,null,null,null,"X",null,{"$f":"IF(ISERROR(AB142/AA142),\"-\",(AB142/AA142))","v":0.8693009009276309}]
[1,116,2021,"FDLRUU-CD-116-2021","https://community.secop.gov.co/Public/Tendering/OpportunityDetail/Index?noticeUID=CO1.NTC.1775977&isFromPublicArea=True&isModal=False\n","Contratos de prestación de servicios profesionales y de apoyo a la gestión","Contratación directa","Prestación de servicios profesionales y de apoyo a la gestión, o para la ejecución de trabajos artísticos que sólo puedan encomendarse a determinadas personas naturales;","EL CONTRATISTA SE OBLIGA A PRESTAR SUS SERVICIOS PROFESIONALES EN EL ÁREA DE GESTIÓN DEL DESARROLLO LOCAL - PLANEACIÓN, REALIZANDO LAS ACTIVIDADES PROPIAS PARA LA FORMULACION, EJECUCIÓN Y SEGUIMIENTO DE LOS PROYECTOS DE INVERSIÓN DEL PLAN DE DESARROLLO LOCAL 2021 - 2024","Inversión","Un Nuevo Contrato Social y Ambiental para la Bogotá del Siglo XXI",57,{"$f":"IF(ISERROR(VLOOKUP(L143,Proposito_programa!$C$2:$E$59,2,FALSE)),\" \",VLOOKUP(L143,Proposito_programa!$C$2:$E$59,2,FALSE))","v":"Gestión pública local"},{"$f":"IF(ISERROR(VLOOKUP(L143,Proposito_programa!$C$2:$E$59,3,FALSE)),\" \",VLOOKUP(L143,Proposito_programa!$C$2:$E$59,3,FALSE))","v":"Propósito 5: Construir Bogotá - Región con gobierno abierto, transparente y ciudadanía consciente"},"133011605570000001697",1,52415797,"MAGDA ISABEL NIETO CASTRO","Persona Natural",null,null,null,52000000,null,null,null,52000000,47840000,44245,44252,44554,300,null,null,1072072800,"DIEGO HERNAN CALDERON URREGO",44519,6240000,null,null,"X",null,0.92]
[1,124,2021,"FDLRUU-CD-124-2021","https://community.secop.gov.co/Public/Tendering/OpportunityDetail/Index?noticeUID=CO1.NTC.1779949&isFromPublicArea=True&isModal=False\n","Contratos de prestación de servicios profesionales y de apoyo a la gestión","Contratación directa","Prestación de servicios profesionales y de apoyo a la gestión, o para la ejecución de trabajos artísticos que sólo puedan encomendarse a determinadas personas naturales;","PRESTAR LOS SERVICIOS PROFESIONALES PARA LA OPERACIÓN, SEGUIMIENTO Y CUMPLIMIENTO DE LOS PROCESOS Y PROCEDIMIENTOS DEL SERVICIO APOYO ECONÓMICO TIPO C, REQUERIDOS PARA EL OPORTUNO Y ADECUADO REGISTRO, CRUCE Y REPORTE DE LOS DATOS EN EL SISTEMA MISIONAL – SIRBE, QUE CONTRIBUYAN A LA GARANTÍA DE LOS DERECHOS DE LA POBLACIÓN MAYOR EN EL MARCO DE LA POLÍTICA PÚBLICA SOCIAL PARA EL ENVEJECIMIENTO Y LA VEJEZ EN EL DISTRITO CAPITAL A CARGO DE LA ALCALDÍA LOCAL","Inversión","Un Nuevo Contrato Social y Ambiental para la Bogotá del Siglo XXI",1,{"$f":"IF(ISERROR(VLOOKUP(L144,Proposito_programa!$C$2:$E$59,2,FALSE)),\" \",VLOOKUP(L144,Proposito_programa!$C$2:$E$59,2,FALSE))","v":"Subsidios y transferencias para la equidad"},{"$f":"IF(ISERROR(VLOOKUP(L144,Proposito_programa!$C$2:$E$59,3,FALSE)),\" \",VLOOKUP(L144,Proposito_programa!$C$2:$E$59,3,FALSE))","v":"Propósito 1: Hacer un nuevo contrato social para incrementar la inclusión social, productiva y política"},"133011601010000001636",1,1018453055,"LUZ MAGNOLIA TIRADO CUELLAR","Persona Natural",null,null,null,41600000,null,1,14560000,56160000,48360000,44245,44249,44574,240,1,84,null,null,null,null,null,null,"X",null,0.86111111111111116]
[1,74,2021,"FDLRUU-CD-074-2021","https://community.secop.gov.co/Public/Tendering/OpportunityDetail/Index?noticeUID=CO1.NTC.1756625&isFromPublicArea=True&isModal=False\n","Contratos de prestación de servicios profesionales y de apoyo a la gestión","Contratación directa","Prestación de servicios profesionales y de apoyo a la gestión, o para la ejecución de trabajos artísticos que sólo puedan encomendarse a determinadas personas naturales;","EL CONTRATISTA SE OBLIGA A PRESTAR SUS SERVICIOS PROFESIONALES EN EL ÁREA DE GESTIÓN DEL DESARROLLO LOCAL - PLANEACIÓN, REALIZANDO LAS ACTIVIDADES PROPIAS PARA LA FORMULACION, EJECUCIÓN Y SEGUIMIENTO DE LOS PROYECTOS DE INVERSIÓN DEL PLAN DE DESARROLLO LOCAL 2021 - 2024","Inversión","Un Nuevo Contrato Social y Ambiental para la Bogotá del Siglo XXI",57,{"$f":"IF(ISERROR(VLOOKUP(L145,Proposito_programa!$C$2:$E$59,2,FALSE)),\" \",VLOOKUP(L145,Proposito_programa!$C$2:$E$59,2,FALSE))","v":"Gestión pública local"},{"$f":"IF(ISERROR(VLOOKUP(L145,Proposito_programa!$C$2:$E$59,3,FALSE)),\" \",VLOOKUP(L145,Proposito_programa!$C$2:$E$59,3,FALSE))","v":"Propósito 5: Construir Bogotá - Región con gobierno abierto, transparente y ciudadanía consciente"},"133011605570000001697",1,52540489,"LUZ ANGELA CORREA PARRADO","Persona Natural",null,null,null,52000000,null,null,null,52000000,49573333,44238,44242,44544,300,null,null,null,null,null,null,null,null,"X",null,0.95333332692307693]
[1,276,2021,"FDLRUU-CD-276-2021","https://community.secop.gov.co/Public/Tendering/OpportunityDetail/Index?noticeUID=CO1.NTC.2185517&isFromPublicArea=True&isModal=False\n","Contratos de prestación de servicios profesionales y de apoyo a la gestión","Contratación directa","Prestación de servicios profesionales y de apoyo a la gestión, o para la ejecución de trabajos artísticos que sólo puedan encomendarse a determinadas personas naturales;","PRESTAR SERVICIOS PROFESIONALES PARA REALIZAR ACUERDOS QUE PROMUEVAN LA PARTICIPACIÓN DE LA POBLACIÓN VULNERABLE, QUE GENEREN EMPRENDIMIENTOS FORMALIZADOS QUE COADYUVEN AL DESARROLLO ECONÓMICO Y PRODUCTIVO DE ESTA POBLACIÓN EN EL MARCO DEL PROYECTO DE INVERSIÓN 1681","Inversión","Un Nuevo Contrato Social y Ambiental para la Bogotá del Siglo XXI",45,{"$f":"IF(ISERROR(VLOOKUP(L146,Proposito_programa!$C$2:$E$59,2,FALSE)),\" \",VLOOKUP(L146,Proposito_programa!$C$2:$E$59,2,FALSE))","v":"Espacio público más seguro y construido colectivamente"},{"$f":"IF(ISERROR(VLOOKUP(L146,Proposito_programa!$C$2:$E$59,3,FALSE)),\" \",VLOOKUP(L146,Proposito_programa!$C$2:$E$59,3,FALSE))","v":"Propósito 3: Inspirar confianza y legitimidad para vivir sin miedo y ser epicentro de cultura ciudadana, paz y reconciliación"},"133011603450000001681",1,52169771,"LUZ ADRIANA SALAMANCA PALACIOS ","Persona Natural",null,null,null,20000000,null,null,null,20000000,15166667,44431,44438,44559,120,null,null,1016075977,"YEFERSON DANIEL PÁEZ MANCERA",44494,10833333,null,null,"X",null,0.75833335000000002]
[1,92,2021,"FDLRUU-CD-092-2021","https://community.secop.gov.co/Public/Tendering/OpportunityDetail/Index?noticeUID=CO1.NTC.1760146&isFromPublicArea=True&isModal=False\n","Contratos de prestación de servicios profesionales y de apoyo a la gestión","Contratación directa","Prestación de servicios profesionales y de apoyo a la gestión, o para la ejecución de trabajos artísticos que sólo puedan encomendarse a determinadas personas naturales;","“PRESTAR LOS SERVICIOS PROFESIONALES PARA ACOMPAÑAR LOS PROCESOS DE FORMULACION, EVALUACIÓN Y SEGUIMIENTO DE LOS PROYECTOS DE INFRAESTRUCTURA, MALLA VIAL, SALONES COMUNALES, MITIGACION ESPACIO PÚBLICO Y PARQUES DE LA LOCALIDAD DE RAFAEL URIBE URIBE”.","Inversión","Un Nuevo Contrato Social y Ambiental para la Bogotá del Siglo XXI",57,{"$f":"IF(ISERROR(VLOOKUP(L147,Proposito_programa!$C$2:$E$59,2,FALSE)),\" \",VLOOKUP(L147,Proposito_programa!$C$2:$E$59,2,FALSE))","v":"Gestión pública local"},{"$f":"IF(ISERROR(VLOOKUP(L147,Proposito_programa!$C$2:$E$59,3,FALSE)),\" \",VLOOKUP(L147,Proposito_programa!$C$2:$E$59,3,FALSE))","v":"Propósito 5: Construir Bogotá - Región con gobierno abierto, transparente y ciudadanía consciente"},"133011605570000001697",1,1020755560,"LUISA FERNANDA CHAVES MANRIQUE","Persona Natural",null,null,null,57000000,null,1,5510000,{"$f":"+W147+X147+Z147","v":62510000},54340000,44239,44242,44574,300,1,29,null,null,null,null,null,null,"X",null,0.8693009118541033]
[1,63,2021,"FDLRUU-CD-063-2021","https://community.secop.gov.co/Public/Tendering/OpportunityDetail/Index?noticeUID=CO1.NTC.1744914&isFromPublicArea=True&isModal=False\n","Contratos de prestación de servicios profesionales y de apoyo a la gestión","Contratación directa","Prestación de servicios profesionales y de apoyo a la gestión, o para la ejecución de trabajos artísticos que sólo puedan encomendarse a determinadas personas naturales;","EL CONTRATISTA SE OBLIGA A PRESTAR SUS SERVICIOS PROFESIONALES EN EL APOYO A LOS TRÁMITES Y PROCEDIMIENTOS ADELANTADOS EN EL ÁREA DE GESTIÓN DE DESARROLLO LOCAL - PRESUPUESTO- DEL FONDO DE DESARROLLO LOCAL DE RAFAEL URIBE URIBE","Inversión","Un Nuevo Contrato Social y Ambiental para la Bogotá del Siglo XXI",57,{"$f":"IF(ISERROR(VLOOKUP(L148,Proposito_programa!$C$2:$E$59,2,FALSE)),\" \",VLOOKUP(L148,Proposito_programa!$C$2:$E$59,2,FALSE))","v":"Gestión pública local"},{"$f":"IF(ISERROR(VLOOKUP(L148,Proposito_programa!$C$2:$E$59,3,FALSE)),\" \",VLOOKUP(L148,Proposito_programa!$C$2:$E$59,3,FALSE))","v":"Propósito 5: Construir Bogotá - Región con gobierno abierto, transparente y ciudadanía consciente"},"133011605570000001697",1,79489811,"LUIS JONNY CARRILLO BOMBIELA","Persona Natural",null,null,null,52000000,null,1,5720000,57720000,50440000,44236,44237,44573,300,1,33,null,null,null,null,null,null,"X",null,0.87387387387387383]
[1,149,2021,"FDLRUU-CD-149-2021","https://community.secop.gov.co/Public/Tendering/OpportunityDetail/Index?noticeUID=CO1.NTC.1801677&isFromPublicArea=True&isModal=False\n","Contratos de prestación de servicios profesionales y de apoyo a la gestión","Contratación directa","Prestación de servicios profesionales y de apoyo a la gestión, o para la ejecución de trabajos artísticos que sólo puedan encomendarse a determinadas personas naturales;","PRESTAR LOS SERVICIOS PROFESIONALES PARA ADELANTAR LAS ACCIONES TENDIENTES AL AGENCIAMIENTO E IMPLEMENTACIÓN DE LAS POLÍTICAS PÚBLICAS DEL ORDEN DISTRITAL EN LO LOCAL, SEGUIMIENTO AL PLAN DE DESARROLLO LOCAL, ACOMPAÑAR LAS INSTANCIAS DE PARTICIPACIÓN QUE LE SEAN ASIGNADAS POR EL SUPERVISOR Y APOYAR LAS DEMÁS ACTIVIDADES QUE SE GENEREN EN EL ÁREA DE GESTIÓN DEL DESARROLLO LOCAL","Inversión","Un Nuevo Contrato Social y Ambiental para la Bogotá del Siglo XXI",57,{"$f":"IF(ISERROR(VLOOKUP(L149,Proposito_programa!$C$2:$E$59,2,FALSE)),\" \",VLOOKUP(L149,Proposito_programa!$C$2:$E$59,2,FALSE))","v":"Gestión pública local"},{"$f":"IF(ISERROR(VLOOKUP(L149,Proposito_programa!$C$2:$E$59,3,FALSE)),\" \",VLOOKUP(L149,Proposito_programa!$C$2:$E$59,3,FALSE))","v":"Propósito 5: Construir Bogotá - Región con gobierno abierto, transparente y ciudadanía consciente"},"133011605570000001697",1,79443062,"LUIS FERNANDO BARRETO GONZALEZ","Persona Natural",null,null,null,52000000,null,null,null,52000000,43853333,44265,44273,44578,300,null,null,null,null,null,null,null,null,"X",null,0.84333332692307694]
[1,131,2021,"FDLRUU-CD-131-2021","https://community.secop.gov.co/Public/Tendering/OpportunityDetail/Index?noticeUID=CO1.NTC.1795227&isFromPublicArea=True&isModal=False\n","Contratos de prestación de servicios profesionales y de apoyo a la gestión","Contratación directa","Prestación de servicios profesionales y de apoyo a la gestión, o para la ejecución de trabajos artísticos que sólo puedan encomendarse a determinadas personas naturales;","PRESTAR LOS SERVICIOS COMO OPERADOR DE MAQUINARIA AMARILLA, AL SERVICIO DE LA ADMINISTRACION LOCAL DE RAFAEL URIBE URIBE EN LA REALIZACIÓN DE LA EJECUCION DEL PROYECTO NO. 1685 MOVILIDAD MULTIMODAL, INCLUYENTE Y SOSTENIBLE EN RAFAEL URIBE URIBE, ASÍ COMO APOYAR LAS DEMÁS ACTIVIDADES QUE SE GENEREN EN EL ÁREA DE GESTIÓN DEL DESARROLLO CON RELACION AL PROYECTO EN MENCION","Inversión","Un Nuevo Contrato Social y Ambiental para la Bogotá del Siglo XXI",57,{"$f":"IF(ISERROR(VLOOKUP(L150,Proposito_programa!$C$2:$E$59,2,FALSE)),\" \",VLOOKUP(L150,Proposito_programa!$C$2:$E$59,2,FALSE))","v":"Gestión pública local"},{"$f":"IF(ISERROR(VLOOKUP(L150,Proposito_programa!$C$2:$E$59,3,FALSE)),\" \",VLOOKUP(L150,Proposito_programa!$C$2:$E$59,3,FALSE))","v":"Propósito 5: Construir Bogotá - Región con gobierno abierto, transparente y ciudadanía consciente"},"133011605570000001697",1,1022955000,"LUIS EDUARO  PEREZ PATARROYO","Persona Natural",null,null,null,26000000,null,null,null,26000000,23920000,44251,44252,44554,300,null,null,null,null,null,null,null,null,"X",null,0.92]
[1,173,2021,"FDLRUU-CD-150-2021","https://community.secop.gov.co/Public/Tendering/OpportunityDetail/Index?noticeUID=CO1.NTC.1800149&isFromPublicArea=True&isModal=False\n","Contratos de prestación de servicios profesionales y de apoyo a la gestión","Contratación directa","Prestación de servicios profesionales y de apoyo a la gestión, o para la ejecución de trabajos artísticos que sólo puedan encomendarse a determinadas personas naturales;","EL CONTRATISTA SE OBLIGA CON EL FONDO DE DESARROLLO LOCAL DE RAFAEL URIBE URIBE A PRESTAR SUS SERVICIOS DE APOYO A LA GESTION LOCAL Y TERRITORIAL DE LOS TEMAS DE SEGURIDAD Y CONVIVENCIA CIUDADANA PARA LA ALCALDIA LOCAL DE RAFAEL URIBE URIBE","Inversión","Un Nuevo Contrato Social y Ambiental para la Bogotá del Siglo XXI",43,{"$f":"IF(ISERROR(VLOOKUP(L151,Proposito_programa!$C$2:$E$59,2,FALSE)),\" \",VLOOKUP(L151,Proposito_programa!$C$2:$E$59,2,FALSE))","v":"Cultura ciudadana para la confianza, la convivencia y la participación desde la vida cotidiana"},{"$f":"IF(ISERROR(VLOOKUP(L151,Proposito_programa!$C$2:$E$59,3,FALSE)),\" \",VLOOKUP(L151,Proposito_programa!$C$2:$E$59,3,FALSE))","v":"Propósito 3: Inspirar confianza y legitimidad para vivir sin miedo y ser epicentro de cultura ciudadana, paz y reconciliación"},"133011603430000001680",1,1031134259,"LUIS EDUARDO FORERO GÓMEZ","Persona Natural",null,null,null,19800000,null,1,3006667,22806667,19653333,44253,44258,44574,270,1,41,null,null,null,null,null,null,"X",null,0.86173630719473393]
[1,46,2021,"FDLRUU-CD-046-2021","https://community.secop.gov.co/Public/Tendering/OpportunityDetail/Index?noticeUID=CO1.NTC.1736809&isFromPublicArea=True&isModal=False\n","Contratos de prestación de servicios profesionales y de apoyo a la gestión","Contratación directa","Prestación de servicios profesionales y de apoyo a la gestión, o para la ejecución de trabajos artísticos que sólo puedan encomendarse a determinadas personas naturales;","PRESTAR LOS SERVICIOS PROFESIONALES COMO ABOGADO PARA APOYAR LOS PROCESOS DE CONTRATACIÓN EN SUS DIFERENTES ETAPAS AL ÁREA DE GESTIÓN DEL DESARROLLO DE LA ALCALDÍA LOCAL DE RAFAEL URIBE URIBE","Inversión","Un Nuevo Contrato Social y Ambiental para la Bogotá del Siglo XXI",57,{"$f":"IF(ISERROR(VLOOKUP(L152,Proposito_programa!$C$2:$E$59,2,FALSE)),\" \",VLOOKUP(L152,Proposito_programa!$C$2:$E$59,2,FALSE))","v":"Gestión pública local"},{"$f":"IF(ISERROR(VLOOKUP(L152,Proposito_programa!$C$2:$E$59,3,FALSE)),\" \",VLOOKUP(L152,Proposito_programa!$C$2:$E$59,3,FALSE))","v":"Propósito 5: Construir Bogotá - Región con gobierno abierto, transparente y ciudadanía consciente"},"133011605570000001697",1,80041654,"LUIS ALEJANDRO MORENO RUEDA","Persona Natural",null,null,null,52000000,null,1,6760000,58760000,51306667,44232,44232,44574,300,1,39,80188169,"HERNANDO FERNANDEZ MUÑOZ",44456,13520000,null,null,"X",null,0.87315634785568419]
[1,180,2021,"FDLRUU-CD-180-2021","https://community.secop.gov.co/Public/Tendering/OpportunityDetail/Index?noticeUID=CO1.NTC.1818796&isFromPublicArea=True&isModal=False\n","Contratos de prestación de servicios profesionales y de apoyo a la gestión","Contratación directa","Prestación de servicios profesionales y de apoyo a la gestión, o para la ejecución de trabajos artísticos que sólo puedan encomendarse a determinadas personas naturales;","PRESTAR SUS SERVICIOS PROFESIONALES PARA APOYAR JURIDICAMENTE EN EL INGRESO DE INFORMACIÓN, USO Y APROPIACIÒN DE LOS SISTEMAS DE INFORMACIÓN VIGENTES DISPUESTOS PARA EL TRAMITE DE ACTUACIONES ADMINISTRATIVAS Y JURIDICAS A CARGO DE LA ALCALDIA LOCAL DE RAFAEL URIBE URIBE","Inversión","Un Nuevo Contrato Social y Ambiental para la Bogotá del Siglo XXI",57,{"$f":"IF(ISERROR(VLOOKUP(L153,Proposito_programa!$C$2:$E$59,2,FALSE)),\" \",VLOOKUP(L153,Proposito_programa!$C$2:$E$59,2,FALSE))","v":"Gestión pública local"},{"$f":"IF(ISERROR(VLOOKUP(L153,Proposito_programa!$C$2:$E$59,3,FALSE)),\" \",VLOOKUP(L153,Proposito_programa!$C$2:$E$59,3,FALSE))","v":"Propósito 5: Construir Bogotá - Región con gobierno abierto, transparente y ciudadanía consciente"},"133011605570000001698",1,79390749,"LUIS ALBERTO SICACHA RAMIREZ ","Persona Natural",null,null,null,52000000,null,null,null,52000000,44893333,44264,44267,44572,300,null,null,null,null,null,null,null,null,"X",null,0.86333332692307696]
[1,207,2021,"FDLRUU-CD-207-2021","https://community.secop.gov.co/Public/Tendering/OpportunityDetail/Index?noticeUID=CO1.NTC.1879748&isFromPublicArea=True&isModal=False\n","Contratos de prestación de servicios profesionales y de apoyo a la gestión","Contratación directa","Prestación de servicios profesionales y de apoyo a la gestión, o para la ejecución de trabajos artísticos que sólo puedan encomendarse a determinadas personas naturales;","PRESTAR LOS SERVICIOS COMO OPERADOR DE MAQUINARIA AMARILLA, AL SERVICIO DE LA ADMINISTRACION LOCAL DE RAFAEL URIBE URIBE EN LA REALIZACIÓN DE LA EJECUCION DEL PROYECTO NO. 1685 MOVILIDAD MUL-TIMODAL, INCLUYENTE Y SOSTENIBLE EN RAFAEL URIBE URIBE, ASÍ COMO APOYAR LAS DEMÁS ACTIVIDADES QUE SE GENEREN EN EL ÁREA DE GES-TIÓN DEL DESARROLLO CON RELACION AL PROYECTO EN MENCION de acuerdo con lo contemplado en el(los) proyecto(s) 1697 ","Inversión","Un Nuevo Contrato Social y Ambiental para la Bogotá del Siglo XXI",57,{"$f":"IF(ISERROR(VLOOKUP(L154,Proposito_programa!$C$2:$E$59,2,FALSE)),\" \",VLOOKUP(L154,Proposito_programa!$C$2:$E$59,2,FALSE))","v":"Gestión pública local"},{"$f":"IF(ISERROR(VLOOKUP(L154,Proposito_programa!$C$2:$E$59,3,FALSE)),\" \",VLOOKUP(L154,Proposito_programa!$C$2:$E$59,3,FALSE))","v":"Propósito 5: Construir Bogotá - Región con gobierno abierto, transparente y ciudadanía consciente"},"133011605570000001697",1,19397700,"LUIS ALBERTO ESPINOSA PRIETO","Persona Natural",null,null,null,26000000,null,null,null,26000000,20193333,44291,44294,44599,300,null,null,null,null,null,null,null,"X",null,null,0.77666665384615385]
[1,324,2021,"FDLRUU-MC-324-2021","https://community.secop.gov.co/Public/Tendering/OpportunityDetail/Index?noticeUID=CO1.NTC.2464124&isFromPublicArea=True&isModal=False\n","Contratos de prestación de servicios","Contratación mínima cuantia","No aplica","REALIZAR EL MANTENIMIENTO PREVENTIVO Y CORRECTIVO DE LOS EQUIPOS DE CÓMPUTO, UPS, ESCÁNERES, VIDEO BEAM, AIRE ACONDICIONADO, PLOTTER, RACK, CABLEADO ESTRUCTURADO Y DEMÁS EQUIPOS TECNOLOGICOS PROPIEDAD DE LA ALCALDÍA LOCAL DE RAFAEL URIBE URIBE, INCLUYENDO EL SUMINISTRO DE REPUESTOS Y MANO DE OBRA","Funcionamiento","Un Nuevo Contrato Social y Ambiental para la Bogotá del Siglo XXI","No aplica",{"$f":"IF(ISERROR(VLOOKUP(L155,Proposito_programa!$C$2:$E$59,2,FALSE)),\" \",VLOOKUP(L155,Proposito_programa!$C$2:$E$59,2,FALSE))","v":" "},{"$f":"IF(ISERROR(VLOOKUP(L155,Proposito_programa!$C$2:$E$59,3,FALSE)),\" \",VLOOKUP(L155,Proposito_programa!$C$2:$E$59,3,FALSE))","v":" "},"131020202030602-131020202030603",8,900825387,"LINK IT\nCOMPONENTES PARA TECNOLOGÍA DE LA INFORMACIÓN, DIFUSIÓN O TELECOMUNICACIONES\n","Persona Jurídica",null,null,null,25737698,null,null,null,25737698,0,44559,"CELEBRADO SIN INICIAR","CELEBRADO SIN INICIAR",180,null,null,null,null,null,null,"X",null,null,null,0]
[1,302,2021,"FDLRUU-CD-302-2021","https://community.secop.gov.co/Public/Tendering/OpportunityDetail/Index?noticeUID=CO1.NTC.2316517&isFromPublicArea=True&isModal=False\n","Contratos de prestación de servicios profesionales y de apoyo a la gestión","Contratación directa","Prestación de servicios profesionales y de apoyo a la gestión, o para la ejecución de trabajos artísticos que sólo puedan encomendarse a determinadas personas naturales;","PRESTAR SERVICIOS DE APOYO A LA GESTIÓN PARA EL SEGUIMIENTO DEL CUMPLIMIENTO DE LOS PROCEDIMIENTOS ADMINISTRATIVOS, OPERATIVOS Y TÉCNICOS DEL PROYECTO “RETO LOCAL” Y LOS ASOCIADOS A LA INCLUSIÓN SOCIAL Y SEGURIDAD ECONÓMICA EN LA LOCALIDAD DE RAFAEL URIBE URIBE","Inversión","Un Nuevo Contrato Social y Ambiental para la Bogotá del Siglo XXI",1,{"$f":"IF(ISERROR(VLOOKUP(L156,Proposito_programa!$C$2:$E$59,2,FALSE)),\" \",VLOOKUP(L156,Proposito_programa!$C$2:$E$59,2,FALSE))","v":"Subsidios y transferencias para la equidad"},{"$f":"IF(ISERROR(VLOOKUP(L156,Proposito_programa!$C$2:$E$59,3,FALSE)),\" \",VLOOKUP(L156,Proposito_programa!$C$2:$E$59,3,FALSE))","v":"Propósito 1: Hacer un nuevo contrato social para incrementar la inclusión social, productiva y política"},"133011601010000002213",1,1026296469,"LINA MARIA MUÑOZ LUENGAS","Persona Natural",null,null,null,26438110,null,null,null,26438110,0,44483,44495,44521,300,null,null,null,null,null,null,null,null,"X",null,0]
[1,117,2021,"FDLRUU-CD-117-2021","https://community.secop.gov.co/Public/Tendering/ContractNoticePhases/View?PPI=CO1.PPI.12112077&isFromPublicArea=True&isModal=False","Contratos de prestación de servicios profesionales y de apoyo a la gestión","Contratación directa","Prestación de servicios profesionales y de apoyo a la gestión, o para la ejecución de trabajos artísticos que sólo puedan encomendarse a determinadas personas naturales;","PRESTAR LOS SERVICIOS PROFESIONALES EN EL ALMACÉN E INVENTARIOS, DESARROLLANDO LAS DIFERENTES ACTIVIDADES A CARGO DE ESTA DEPENDENCIA DE CONFORMIDAD CON LA NATURALEZA DEL SERVICIO Y LOS ESTUDIOS PREVIOS","Inversión","Un Nuevo Contrato Social y Ambiental para la Bogotá del Siglo XXI",57,{"$f":"IF(ISERROR(VLOOKUP(L157,Proposito_programa!$C$2:$E$59,2,FALSE)),\" \",VLOOKUP(L157,Proposito_programa!$C$2:$E$59,2,FALSE))","v":"Gestión pública local"},{"$f":"IF(ISERROR(VLOOKUP(L157,Proposito_programa!$C$2:$E$59,3,FALSE)),\" \",VLOOKUP(L157,Proposito_programa!$C$2:$E$59,3,FALSE))","v":"Propósito 5: Construir Bogotá - Región con gobierno abierto, transparente y ciudadanía consciente"},"133011605570000001697",1,1072921068,"LINA MARÍA MORENO RODRÍGUEZ","Persona Natural",null,null,null,43000000,null,null,null,43000000,36263333,44249,44273,44578,300,null,null,null,null,null,null,null,null,"X",null,0.8433333255813954]
[1,275,2021,"FDLRUU-CD-275-2021","https://community.secop.gov.co/Public/Tendering/OpportunityDetail/Index?noticeUID=CO1.NTC.2185657&isFromPublicArea=True&isModal=False\n","Contratos de prestación de servicios profesionales y de apoyo a la gestión","Contratación directa","Prestación de servicios profesionales y de apoyo a la gestión, o para la ejecución de trabajos artísticos que sólo puedan encomendarse a determinadas personas naturales;","PRESTAR SERVICIOS PROFESIONALES PARA REALIZAR ACUERDOS ENTRE LA ALCALDIA LOCAL DE RAFAEL URIBE URIBE Y SUS HABITANTES PARA VINCULARLOS A LOS PROGRAMAS DEL IDRD \"ESCUELA DE LA BICICLETA\" Y \"AL TRABAJO EN BICI\" QUE MOTIVEN EL USO ADECUADO DE LOS MEDIOS DE TTRANSPORTE NO MOTORIZADOS, PORMEDIO DE LA PROMOCION DE LA NORMATIVIDAD PARA SU APROPIACION Y APLICACIÓN EN EL MARCO DEL PROYECTO DE INVERSION 1681","Inversión","Un Nuevo Contrato Social y Ambiental para la Bogotá del Siglo XXI",45,{"$f":"IF(ISERROR(VLOOKUP(L158,Proposito_programa!$C$2:$E$59,2,FALSE)),\" \",VLOOKUP(L158,Proposito_programa!$C$2:$E$59,2,FALSE))","v":"Espacio público más seguro y construido colectivamente"},{"$f":"IF(ISERROR(VLOOKUP(L158,Proposito_programa!$C$2:$E$59,3,FALSE)),\" \",VLOOKUP(L158,Proposito_programa!$C$2:$E$59,3,FALSE))","v":"Propósito 3: Inspirar confianza y legitimidad para vivir sin miedo y ser epicentro de cultura ciudadana, paz y reconciliación"},"133011603450000001681",1,52501843,"LIDIA JESUSA LOPEZ DULCEY","Persona Natural",null,null,null,20000000,null,null,null,20000000,15833333,44431,44434,44555,120,null,null,null,null,null,null,null,null,"X",null,0.79166665000000003]
[1,41,2021,"FDLRUU-CD-041-2021","https://community.secop.gov.co/Public/Tendering/OpportunityDetail/Index?noticeUID=CO1.NTC.1729969&isFromPublicArea=True&isModal=False\n","Contratos de prestación de servicios profesionales y de apoyo a la gestión","Contratación directa","Prestación de servicios profesionales y de apoyo a la gestión, o para la ejecución de trabajos artísticos que sólo puedan encomendarse a determinadas personas naturales;","APOYAR JURÍDICAMENTE LA EJECUCIÓN DE LAS ACCIONES REQUERIDAS PARA LA DEPURACIÓN DE LAS ACTUACIONES ADMINISTRATIVAS QUE CURSAN EN LA ALCALDÍA LOCAL","Inversión","Un Nuevo Contrato Social y Ambiental para la Bogotá del Siglo XXI",57,{"$f":"IF(ISERROR(VLOOKUP(L159,Proposito_programa!$C$2:$E$59,2,FALSE)),\" \",VLOOKUP(L159,Proposito_programa!$C$2:$E$59,2,FALSE))","v":"Gestión pública local"},{"$f":"IF(ISERROR(VLOOKUP(L159,Proposito_programa!$C$2:$E$59,3,FALSE)),\" \",VLOOKUP(L159,Proposito_programa!$C$2:$E$59,3,FALSE))","v":"Propósito 5: Construir Bogotá - Región con gobierno abierto, transparente y ciudadanía consciente"},"133011605570000001698",1,80442207,"LEONARDO GUERRA RAMIREZ","Persona Natural",null,null,null,31200000,null,1,15600000,46800000,46800000,44232,44236,44508,180,1,90,null,null,null,null,null,null,"X",null,1]
[1,308,2021,"FDLRUU-CD-308-2021 ","https://community.secop.gov.co/Public/Tendering/OpportunityDetail/Index?noticeUID=CO1.NTC.2400171&isFromPublicArea=True&isModal=False","Contratos de prestación de servicios profesionales y de apoyo a la gestión","Contratación directa","Prestación de servicios profesionales y de apoyo a la gestión, o para la ejecución de trabajos artísticos que sólo puedan encomendarse a determinadas personas naturales;","APOYAR JURIDICAMENTE LA EJECUCIÓN DE LAS ACTUACIONES REQUERIDAS PARA LA DEPURACIÓN DE LAS ACTUACIONES ADMINISTRATIVAS QUE CURSAN EN LA ALCALDIA LOCAL","Inversión","Un Nuevo Contrato Social y Ambiental para la Bogotá del Siglo XXI",57,{"$f":"IF(ISERROR(VLOOKUP(L160,Proposito_programa!$C$2:$E$59,2,FALSE)),\" \",VLOOKUP(L160,Proposito_programa!$C$2:$E$59,2,FALSE))","v":"Gestión pública local"},{"$f":"IF(ISERROR(VLOOKUP(L160,Proposito_programa!$C$2:$E$59,3,FALSE)),\" \",VLOOKUP(L160,Proposito_programa!$C$2:$E$59,3,FALSE))","v":"Propósito 5: Construir Bogotá - Región con gobierno abierto, transparente y ciudadanía consciente"},"133011605570000001698",1,80442207,"LEONARDO GUERRA RAMIREZ","Persona Natural",null,null,null,7800000,null,null,null,7800000,2253333,44517,44518,44563,45,null,null,null,null,null,null,null,null,"X",null,0.28888884615384613]
[1,145,2021,"FDLRUU-CD-145-2021","https://community.secop.gov.co/Public/Tendering/OpportunityDetail/Index?noticeUID=CO1.NTC.1795482&isFromPublicArea=True&isModal=False\n","Contratos de prestación de servicios profesionales y de apoyo a la gestión","Contratación directa","Prestación de servicios profesionales y de apoyo a la gestión, o para la ejecución de trabajos artísticos que sólo puedan encomendarse a determinadas personas naturales;","PRESTAR LOS SERVICIOS PROFESIONALES PARA LA OPERACIÓN, SEGUIMIENTO Y CUMPLIMIENTO DE LOS PROCESOS Y PROCEDIMIENTOS DEL SERVICIO APOYO ECONÓMICO TIPO C, REQUERIDOS PARA EL OPORTUNO Y ADECUADO REGISTRO, CRUCE Y REPORTE DE LOS DATOS EN EL SISTEMA MISIONAL – SIRBE, QUE CONTRIBUYAN A LA GARANTÍA DE LOS DERECHOS DE LA POBLACIÓN MAYOR EN EL MARCO DE LA POLÍTICA PÚBLICA SOCIAL PARA EL ENVEJECIMIENTO Y LA VEJEZ EN EL DISTRITO CAPITAL A CARGO DE LA ALCALDÍA...","Inversión","Un Nuevo Contrato Social y Ambiental para la Bogotá del Siglo XXI",1,{"$f":"IF(ISERROR(VLOOKUP(L161,Proposito_programa!$C$2:$E$59,2,FALSE)),\" \",VLOOKUP(L161,Proposito_programa!$C$2:$E$59,2,FALSE))","v":"Subsidios y transferencias para la equidad"},{"$f":"IF(ISERROR(VLOOKUP(L161,Proposito_programa!$C$2:$E$59,3,FALSE)),\" \",VLOOKUP(L161,Proposito_programa!$C$2:$E$59,3,FALSE))","v":"Propósito 1: Hacer un nuevo contrato social para incrementar la inclusión social, productiva y política"},"133011601010000001636",1,52114709,"LEIDY AGATHA ROSSIASCO VELASQUEZ","Persona Natural",null,null,null,41600000,null,1,11613333,53213333,47666667,44252,44253,44561,240,1,67,null,null,null,null,null,null,"X",null,0.89576548418795721]
[1,64,2021,"FDLRUU-CD-064-2021","https://community.secop.gov.co/Public/Tendering/OpportunityDetail/Index?noticeUID=CO1.NTC.1746505&isFromPublicArea=True&isModal=False\n","Contratos de prestación de servicios profesionales y de apoyo a la gestión","Contratación directa","Prestación de servicios profesionales y de apoyo a la gestión, o para la ejecución de trabajos artísticos que sólo puedan encomendarse a determinadas personas naturales;","PRESTAR SUS SERVICIOS DE APOYO ADMINISTRATIVO ASISTENCIAL AL ÁREA DE GESTIÓN PARA EL DESARROLLO LOCAL DE LA ALCALDÍA LOCAL DE RAFAEL URIBE URIBE","Inversión","Un Nuevo Contrato Social y Ambiental para la Bogotá del Siglo XXI",57,{"$f":"IF(ISERROR(VLOOKUP(L162,Proposito_programa!$C$2:$E$59,2,FALSE)),\" \",VLOOKUP(L162,Proposito_programa!$C$2:$E$59,2,FALSE))","v":"Gestión pública local"},{"$f":"IF(ISERROR(VLOOKUP(L162,Proposito_programa!$C$2:$E$59,3,FALSE)),\" \",VLOOKUP(L162,Proposito_programa!$C$2:$E$59,3,FALSE))","v":"Propósito 5: Construir Bogotá - Región con gobierno abierto, transparente y ciudadanía consciente"},"133011605570000001697",1,1016109867,"LAURA VANESSA PAEZ LOPEZ","Persona Natural",null,null,null,26000000,null,1,2860000,28860000,25133333,44236,44238,44574,300,1,33,null,null,null,null,null,null,"X",null,0.87087085932085928]
[1,34,2021,"FDLRUU-CD-034-2021","https://community.secop.gov.co/Public/Tendering/OpportunityDetail/Index?noticeUID=CO1.NTC.1733686&isFromPublicArea=True&isModal=False\n","Contratos de prestación de servicios profesionales y de apoyo a la gestión","Contratación directa","Prestación de servicios profesionales y de apoyo a la gestión, o para la ejecución de trabajos artísticos que sólo puedan encomendarse a determinadas personas naturales;","APOYAR JURÍDICAMENTE LA EJECUCIÓN DE LAS ACCIONES REQUERIDAS PARA LA DEPURACIÓN DE LAS ACTUACIONES ADMINISTRATIVAS QUE CURSAN EN LA ALCALDÍA LOCAL","Inversión","Un Nuevo Contrato Social y Ambiental para la Bogotá del Siglo XXI",57,{"$f":"IF(ISERROR(VLOOKUP(L163,Proposito_programa!$C$2:$E$59,2,FALSE)),\" \",VLOOKUP(L163,Proposito_programa!$C$2:$E$59,2,FALSE))","v":"Gestión pública local"},{"$f":"IF(ISERROR(VLOOKUP(L163,Proposito_programa!$C$2:$E$59,3,FALSE)),\" \",VLOOKUP(L163,Proposito_programa!$C$2:$E$59,3,FALSE))","v":"Propósito 5: Construir Bogotá - Región con gobierno abierto, transparente y ciudadanía consciente"},"133011605570000001698",1,1013579410,"LAURA TERESA ESTEFANY PINEDA AVILA ","Persona Natural",null,null,null,31200000,null,null,null,31200000,31200000,44231,44232,44412,180,null,null,null,null,null,null,null,null,"X",null,1]
[1,121,2021,"FDLRUU-CD-121-2021","https://community.secop.gov.co/Public/Tendering/OpportunityDetail/Index?noticeUID=CO1.NTC.1778699&isFromPublicArea=True&isModal=False\n","Contratos de prestación de servicios profesionales y de apoyo a la gestión","Contratación directa","Prestación de servicios profesionales y de apoyo a la gestión, o para la ejecución de trabajos artísticos que sólo puedan encomendarse a determinadas personas naturales;","APOYAR LA FORMULACIÓN, EJECUCIÓN, SEGUIMIENTO Y MEJORA CONTINUA DE LAS HERRAMIENTAS QUE CONFORMAN LA GESTIÓN AMBIENTAL INSTITUCIONAL DE LA ALCALDÍA LOCAL","Inversión","Un Nuevo Contrato Social y Ambiental para la Bogotá del Siglo XXI",57,{"$f":"IF(ISERROR(VLOOKUP(L164,Proposito_programa!$C$2:$E$59,2,FALSE)),\" \",VLOOKUP(L164,Proposito_programa!$C$2:$E$59,2,FALSE))","v":"Gestión pública local"},{"$f":"IF(ISERROR(VLOOKUP(L164,Proposito_programa!$C$2:$E$59,3,FALSE)),\" \",VLOOKUP(L164,Proposito_programa!$C$2:$E$59,3,FALSE))","v":"Propósito 5: Construir Bogotá - Región con gobierno abierto, transparente y ciudadanía consciente"},"133011605570000001697",1,1020797579,"LAURA NATHALIA VALENCIA ORTIZ","Persona Natural",null,null,null,43000000,null,1,3583333,46583333,40420000,44245,44246,44574,300,1,25,null,null,null,null,null,null,"X",null,0.86769231390119728]
[1,73,2021,"FDLRUU-CD-073-2021","https://community.secop.gov.co/Public/Tendering/OpportunityDetail/Index?noticeUID=CO1.NTC.1756191&isFromPublicArea=True&isModal=False\n","Contratos de prestación de servicios profesionales y de apoyo a la gestión","Contratación directa","Prestación de servicios profesionales y de apoyo a la gestión, o para la ejecución de trabajos artísticos que sólo puedan encomendarse a determinadas personas naturales;","“PRESTAR LOS SERVICIOS PROFESIONALES A LA ALCALDÍA LOCAL DE RAFAEL URIBE URIBE, PARA LA EJECUCIÓN Y DIVULGACION DE LAS ACTIVIDADES COMUNITARIAS Y DE APOYO A LOS PROCESOS DE PARTICIPACIÓN EN EL MARCO DEL SISTEMA LOCAL Y DISTRITAL DE PARTICIPACIÓN, LAS RELACIONES INTERINSTITUCIONALES Y LA EJECUCIÓN DE LOS PROYECTOS QUE HACEN PARTE DEL PLAN DE DESARROLLO”","Inversión","Un Nuevo Contrato Social y Ambiental para la Bogotá del Siglo XXI",57,{"$f":"IF(ISERROR(VLOOKUP(L165,Proposito_programa!$C$2:$E$59,2,FALSE)),\" \",VLOOKUP(L165,Proposito_programa!$C$2:$E$59,2,FALSE))","v":"Gestión pública local"},{"$f":"IF(ISERROR(VLOOKUP(L165,Proposito_programa!$C$2:$E$59,3,FALSE)),\" \",VLOOKUP(L165,Proposito_programa!$C$2:$E$59,3,FALSE))","v":"Propósito 5: Construir Bogotá - Región con gobierno abierto, transparente y ciudadanía consciente"},"133011605570000001697",1,1014225405,"LAURA DANIELA GUERRERO ","Persona Natural",null,null,null,31200000,null,1,15600000,46800000,46800000,44238,44242,44514,180,1,90,null,null,null,null,null,null,"X",null,1]
[1,188,2021,"FDLRUU-CD-188-2021","https://community.secop.gov.co/Public/Tendering/OpportunityDetail/Index?noticeUID=CO1.NTC.1827735&isFromPublicArea=True&isModal=False\n","Contratos de prestación de servicios profesionales y de apoyo a la gestión","Contratación directa","Prestación de servicios profesionales y de apoyo a la gestión, o para la ejecución de trabajos artísticos que sólo puedan encomendarse a determinadas personas naturales;","APOYAR ADMINISTRATIVA Y ASISTENCIALMENTE A LAS INSPECCIONES DE POLICÍA DE LA LOCALIDAD DE RAFAEL URIBE URIBE","Inversión","Un Nuevo Contrato Social y Ambiental para la Bogotá del Siglo XXI",57,{"$f":"IF(ISERROR(VLOOKUP(L166,Proposito_programa!$C$2:$E$59,2,FALSE)),\" \",VLOOKUP(L166,Proposito_programa!$C$2:$E$59,2,FALSE))","v":"Gestión pública local"},{"$f":"IF(ISERROR(VLOOKUP(L166,Proposito_programa!$C$2:$E$59,3,FALSE)),\" \",VLOOKUP(L166,Proposito_programa!$C$2:$E$59,3,FALSE))","v":"Propósito 5: Construir Bogotá - Región con gobierno abierto, transparente y ciudadanía consciente"},"133011605570000001698",1,1030699005,"LAURA ALEJANDRA MUÑOZ MELO","Persona Natural",null,null,null,10500000,null,1,5250000,15750000,15108333,44264,44267,44541,180,1,90,null,null,null,null,null,null,"X",null,0.95925923809523805]
[1,309,2021,"FDLRUU-MC-303-2021","https://community.secop.gov.co/Public/Tendering/OpportunityDetail/Index?noticeUID=CO1.NTC.2353674&isFromPublicArea=True&isModal=False\n","Contratos de prestación de servicios","Contratación mínima cuantia","No aplica","CONTRATAR EL PROCESO DE MEDICIÓN POSTERIOR DE BIENES MUEBLES REGISTRADOS EN LA CUENTA PROPIEDAD PLANTA Y EQUIPO DE LOS ESTADOS FINANCIEROS DE LA ENTIDAD Y LOS BIENES INMUEBLES DE PROPIEDAD Y/O A CARGO DEL FONDO DE DESARROLLO LOCAL DE RAFAEL URIBE URIBE DETERMINANDO EL VALOR ACTUAL Y AJUSTANDO LA VIDA ÚTIL RESTANTE, EL VALOR RESIDUAL, EL MÉTODO DE DEPRECIACIÓN, ASÍ COMO EL RECONOCIMIENTO Y MEDICIÓN DEL DETERIORO DEL VALOR.\n\n","Inversión","Un Nuevo Contrato Social y Ambiental para la Bogotá del Siglo XXI",57,{"$f":"IF(ISERROR(VLOOKUP(L167,Proposito_programa!$C$2:$E$59,2,FALSE)),\" \",VLOOKUP(L167,Proposito_programa!$C$2:$E$59,2,FALSE))","v":"Gestión pública local"},{"$f":"IF(ISERROR(VLOOKUP(L167,Proposito_programa!$C$2:$E$59,3,FALSE)),\" \",VLOOKUP(L167,Proposito_programa!$C$2:$E$59,3,FALSE))","v":"Propósito 5: Construir Bogotá - Región con gobierno abierto, transparente y ciudadanía consciente"},"133011605570000001697",4,900354279,"L&Q AUDITORES EXTERNOS S.A.S","Persona Jurídica",null,null,null,16657382,null,null,null,16657382,0,44524,44530,44590,60,null,null,null,null,null,null,null,"X",null,null,0]
[1,167,2021,"FDLRUU-CD-150-2021","https://community.secop.gov.co/Public/Tendering/OpportunityDetail/Index?noticeUID=CO1.NTC.1800149&isFromPublicArea=True&isModal=False\n","Contratos de prestación de servicios profesionales y de apoyo a la gestión","Contratación directa","Prestación de servicios profesionales y de apoyo a la gestión, o para la ejecución de trabajos artísticos que sólo puedan encomendarse a determinadas personas naturales;","EL CONTRATISTA SE OBLIGA CON EL FONDO DE DESARROLLO LOCAL DE RAFAEL URIBE URIBE A PRESTAR SUS SERVICIOS DE APOYO A LA GESTION LOCAL Y TERRITORIAL DE LOS TEMAS DE SEGURIDAD Y CONVIVENCIA CIUDADANA PARA LA ALCALDIA LOCAL DE RAFAEL URIBE URIBE","Inversión","Un Nuevo Contrato Social y Ambiental para la Bogotá del Siglo XXI",43,{"$f":"IF(ISERROR(VLOOKUP(L168,Proposito_programa!$C$2:$E$59,2,FALSE)),\" \",VLOOKUP(L168,Proposito_programa!$C$2:$E$59,2,FALSE))","v":"Cultura ciudadana para la confianza, la convivencia y la participación desde la vida cotidiana"},{"$f":"IF(ISERROR(VLOOKUP(L168,Proposito_programa!$C$2:$E$59,3,FALSE)),\" \",VLOOKUP(L168,Proposito_programa!$C$2:$E$59,3,FALSE))","v":"Propósito 3: Inspirar confianza y legitimidad para vivir sin miedo y ser epicentro de cultura ciudadana, paz y reconciliación"},"133011603430000001680",1,1031150866,"KEVIN PAEZ\nUBAQUE","Persona Natural",null,null,null,19800000,null,1,3080000,22880000,19726667,44253,44257,44574,270,1,42,1023969334,"ANGELA PATRICIA CLAVIJO LONDOÑO",44459,5280000,null,null,"X",null,0.86217950174825175]
[1,256,2021,"FLDRUU-CD-256-2021","https://community.secop.gov.co/Public/Tendering/OpportunityDetail/Index?noticeUID=CO1.NTC.2165335&isFromPublicArea=True&isModal=False\n","Contratos de prestación de servicios profesionales y de apoyo a la gestión","Contratación directa","Prestación de servicios profesionales y de apoyo a la gestión, o para la ejecución de trabajos artísticos que sólo puedan encomendarse a determinadas personas naturales;"," PRESTAR SUS SERVICIOS COMO\nPROFESIONAL EN EL APOYO A LA COORDINACIÓN DE VIGÍAS DE RIESGO Y LA ASISTENCIALES\nPARA LA GESTIÓN DE EMERGENCIAS Y RIESGO, DE LA LOCALIDAD DE RAFAEL URIBE URIBE","Inversión","Un Nuevo Contrato Social y Ambiental para la Bogotá del Siglo XXI",30,{"$f":"IF(ISERROR(VLOOKUP(L169,Proposito_programa!$C$2:$E$59,2,FALSE)),\" \",VLOOKUP(L169,Proposito_programa!$C$2:$E$59,2,FALSE))","v":"Eficiencia en la atención de emergencias"},{"$f":"IF(ISERROR(VLOOKUP(L169,Proposito_programa!$C$2:$E$59,3,FALSE)),\" \",VLOOKUP(L169,Proposito_programa!$C$2:$E$59,3,FALSE))","v":"Propósito 2 : Cambiar Nuestros Hábitos de Vida para Reverdecer a Bogotá y Adaptarnos y Mitigar la Crisis Climática"},"133011602300000001665",1,1033747880,"KEVIN ORLANDO BALLESTEROS ROJAS","Persona Natural",null,null,null,19800000,null,null,null,19800000,15253333,44419,44425,44562,135,null,null,79695295,"YOVAN ALFREDO FIGUEROA",44490,10413333,null,null,"X",null,0.77037035353535355]
[1,127,2021,"FDLRUU-CD-127-2021","https://community.secop.gov.co/Public/Tendering/OpportunityDetail/Index?noticeUID=CO1.NTC.1783125&isFromPublicArea=True&isModal=False\n","Contratos de prestación de servicios profesionales y de apoyo a la gestión","Contratación directa","Prestación de servicios profesionales y de apoyo a la gestión, o para la ejecución de trabajos artísticos que sólo puedan encomendarse a determinadas personas naturales;","APOYAR ADMINISTRATIVA Y ASISTENCIALMENTE AL ÁREA DE GESTION DE DESARROLLO LOCAL - CONTRATACIÓN DE LA ALCALDÍA LOCAL DE RAFAEL URIBE URIBE","Inversión","Un Nuevo Contrato Social y Ambiental para la Bogotá del Siglo XXI",57,{"$f":"IF(ISERROR(VLOOKUP(L170,Proposito_programa!$C$2:$E$59,2,FALSE)),\" \",VLOOKUP(L170,Proposito_programa!$C$2:$E$59,2,FALSE))","v":"Gestión pública local"},{"$f":"IF(ISERROR(VLOOKUP(L170,Proposito_programa!$C$2:$E$59,3,FALSE)),\" \",VLOOKUP(L170,Proposito_programa!$C$2:$E$59,3,FALSE))","v":"Propósito 5: Construir Bogotá - Región con gobierno abierto, transparente y ciudadanía consciente"},"133011605570000001697",1,1094896721,"KARINE ROMAN PARDO","Persona Natural",null,null,null,26000000,null,null,null,26000000,21840000,44264,44274,44579,300,null,null,null,null,null,null,null,null,"X",null,0.84]
[1,159,2021,"FDLRUU-CD-150-2021","https://community.secop.gov.co/Public/Tendering/OpportunityDetail/Index?noticeUID=CO1.NTC.1800149&isFromPublicArea=True&isModal=False\n","Contratos de prestación de servicios profesionales y de apoyo a la gestión","Contratación directa","Prestación de servicios profesionales y de apoyo a la gestión, o para la ejecución de trabajos artísticos que sólo puedan encomendarse a determinadas personas naturales;","EL CONTRATISTA SE OBLIGA CON EL FONDO DE DESARROLLO LOCAL DE RAFAEL URIBE URIBE A PRESTAR SUS SERVICIOS DE APOYO A LA GESTION LOCAL Y TERRITORIAL DE LOS TEMAS DE SEGURIDAD Y CONVIVENCIA CIUDADANA PARA LA ALCALDIA LOCAL DE RAFAEL URIBE URIBE","Inversión","Un Nuevo Contrato Social y Ambiental para la Bogotá del Siglo XXI",43,{"$f":"IF(ISERROR(VLOOKUP(L171,Proposito_programa!$C$2:$E$59,2,FALSE)),\" \",VLOOKUP(L171,Proposito_programa!$C$2:$E$59,2,FALSE))","v":"Cultura ciudadana para la confianza, la convivencia y la participación desde la vida cotidiana"},{"$f":"IF(ISERROR(VLOOKUP(L171,Proposito_programa!$C$2:$E$59,3,FALSE)),\" \",VLOOKUP(L171,Proposito_programa!$C$2:$E$59,3,FALSE))","v":"Propósito 3: Inspirar confianza y legitimidad para vivir sin miedo y ser epicentro de cultura ciudadana, paz y reconciliación"},"133011603430000001680",1,1023892888,"KAREN MAYERLY MORENO MARIN","Persona Natural",null,null,null,19800000,null,1,3153333,22953333,19800000,44253,44256,44574,270,1,43,null,null,null,null,null,null,"X",null,0.86261982083386324]
[1,277,2021,"FDLRUU-CD-277-2021","https://community.secop.gov.co/Public/Tendering/OpportunityDetail/Index?noticeUID=CO1.NTC.2200901&isFromPublicArea=True&isModal=False\n","Contratos de prestación de servicios profesionales y de apoyo a la gestión","Contratación directa","Prestación de servicios profesionales y de apoyo a la gestión, o para la ejecución de trabajos artísticos que sólo puedan encomendarse a determinadas personas naturales;","PRESTAR LOS SERVICIOS PROFESIONALES PARA LA OPERACIÓN, SEGUIMIENTO Y CUMPLIMIENTO DE LOS PROCEDIMIENTOS ADMINISTRATIVOS, OPERATIVOS Y TÉCNICOS DEL PROYECTO “RETO LOCAL” Y LOS ASOCIADOS A LA INCLUSIÓN SOCIAL Y SEGURIDAD ECONÓMICA EN LA LOCALIDAD DE RAFAEL URIBE URIBE","Inversión","Un Nuevo Contrato Social y Ambiental para la Bogotá del Siglo XXI",1,{"$f":"IF(ISERROR(VLOOKUP(L172,Proposito_programa!$C$2:$E$59,2,FALSE)),\" \",VLOOKUP(L172,Proposito_programa!$C$2:$E$59,2,FALSE))","v":"Subsidios y transferencias para la equidad"},{"$f":"IF(ISERROR(VLOOKUP(L172,Proposito_programa!$C$2:$E$59,3,FALSE)),\" \",VLOOKUP(L172,Proposito_programa!$C$2:$E$59,3,FALSE))","v":"Propósito 1: Hacer un nuevo contrato social para incrementar la inclusión social, productiva y política"},"133011601010000002213",1,52848590,"JULY ANGELICA MELO QUINTERO","Persona Natural",null,null,null,45000000,null,null,null,45000000,13350000,44435,44441,44743,300,null,null,null,null,null,null,null,"X",null,null,0.29666666666666669]
[1,196,2021,"FDLRUU-CD-196-2021","https://community.secop.gov.co/Public/Tendering/OpportunityDetail/Index?noticeUID=CO1.NTC.1855162&isFromPublicArea=True&isModal=False\n","Contratos de prestación de servicios profesionales y de apoyo a la gestión","Contratación directa","Prestación de servicios profesionales y de apoyo a la gestión, o para la ejecución de trabajos artísticos que sólo puedan encomendarse a determinadas personas naturales;","COORDINAR LA ARTICULACIÓN, ASISTENCIA Y ACOMPAÑAMIENTO DE LOS PROCESOS DE PLANEACIÓN LOCAL, PARA LA PROMOCIÓN DE LA PARTICIPACIÓN DE LAS MUJERES Y DE LA EQUIDAD DE GÉNERO, PARA MATERIALIZAR EN LA LOCALIDAD LAS ESTRATEGIAS DE TERRITORIALIZACIÓN Y TRANSVERSALIZACIÓN DE LA POLÍTICA PUBLICA DE MUJERES Y EQUIDAD DE GÉNERO, PPMYEG","Inversión","Un Nuevo Contrato Social y Ambiental para la Bogotá del Siglo XXI",57,{"$f":"IF(ISERROR(VLOOKUP(L173,Proposito_programa!$C$2:$E$59,2,FALSE)),\" \",VLOOKUP(L173,Proposito_programa!$C$2:$E$59,2,FALSE))","v":"Gestión pública local"},{"$f":"IF(ISERROR(VLOOKUP(L173,Proposito_programa!$C$2:$E$59,3,FALSE)),\" \",VLOOKUP(L173,Proposito_programa!$C$2:$E$59,3,FALSE))","v":"Propósito 5: Construir Bogotá - Región con gobierno abierto, transparente y ciudadanía consciente"},"133011605570000001697",1,1012347519,"JULIETH JESENIA JIMENEZ NAVARRO","Persona Natural",null,null,null,43000000,null,null,null,43000000,17486667,44279,44284,44589,300,null,null,null,null,null,null,null,null,"X",null,0.40666667441860466]
[1,282,2021,"FLDRUU-CD-282-2021","https://community.secop.gov.co/Public/Tendering/OpportunityDetail/Index?noticeUID=CO1.NTC.2221849&isFromPublicArea=True&isModal=False\n","Contratos de prestación de servicios profesionales y de apoyo a la gestión","Contratación directa","Prestación de servicios profesionales y de apoyo a la gestión, o para la ejecución de trabajos artísticos que sólo puedan encomendarse a determinadas personas naturales;","PRESTAR SERVICIOS PROFESIONALES PARA REALIZACIÓN DE ACUERDOS QUE PROMUEVAN LA CONVIVENCIA ARMÓNICA ENTRE LA CIUDADANÍA Y LOS VENDEDORES INFORMALES Y ESTACIONARIOS, ORIENTADOS A LA SOLUCIÓN DE LOS CONFLICTOS DERIVADOS DEL USO DEL ESPACIO PÚBLICO CONTEMPLADOS EN EL PROYECTO DE INVERSIÓN 1681 CULTURA CIUDADANA Y USO OPTIMO DEL ESPACIO PUBLICO EN RAFAEL URIBE URIBE","Inversión","Un Nuevo Contrato Social y Ambiental para la Bogotá del Siglo XXI",45,{"$f":"IF(ISERROR(VLOOKUP(L174,Proposito_programa!$C$2:$E$59,2,FALSE)),\" \",VLOOKUP(L174,Proposito_programa!$C$2:$E$59,2,FALSE))","v":"Espacio público más seguro y construido colectivamente"},{"$f":"IF(ISERROR(VLOOKUP(L174,Proposito_programa!$C$2:$E$59,3,FALSE)),\" \",VLOOKUP(L174,Proposito_programa!$C$2:$E$59,3,FALSE))","v":"Propósito 3: Inspirar confianza y legitimidad para vivir sin miedo y ser epicentro de cultura ciudadana, paz y reconciliación"},"133011603450000001681",1,1140826131,"JULIETH DEL CARMEN PERNA BERDUGO","Persona Natural",null,null,null,20000000,null,null,null,20000000,13000000,44447,44452,44573,120,null,null,null,null,null,null,null,null,"X",null,0.65]
[1,195,2021,"FDLRUU-CD-195-2021","https://community.secop.gov.co/Public/Tendering/OpportunityDetail/Index?noticeUID=CO1.NTC.1840636&isFromPublicArea=True&isModal=False\n","Contratos de prestación de servicios profesionales y de apoyo a la gestión","Contratación directa","Prestación de servicios profesionales y de apoyo a la gestión, o para la ejecución de trabajos artísticos que sólo puedan encomendarse a determinadas personas naturales;","APOYAR AL EQUIPO DE PRENSA Y COMUNICACIONES DE LA ALCALDÍA LOCAL EN LA CREACIÓN, REALIZACIÓN, PRODUCCIÓN Y EDICIÓN DE VÍDEOS, ASÍ COMO EL REGISTRO, EDICIÓN Y LA PRESENTACIÓN  DE  FOTOGRAFÍAS  DE  LOS ACONTECIMIENTOS,  HECHOS  Y EVENTOS   EXTERNOS   E   INTERNOS   DE   LA   ALCALDÍA   LOCAL,   PARA   SER UTILIZADOS    COMO    INSUMOS    DE    COMUNICACIÓN    EN    LOS    MEDIOS, ESPECIALMENTE ESCRITOS, DIGITALES Y AUDIOVISUALES","Inversión","Un Nuevo Contrato Social y Ambiental para la Bogotá del Siglo XXI",57,{"$f":"IF(ISERROR(VLOOKUP(L175,Proposito_programa!$C$2:$E$59,2,FALSE)),\" \",VLOOKUP(L175,Proposito_programa!$C$2:$E$59,2,FALSE))","v":"Gestión pública local"},{"$f":"IF(ISERROR(VLOOKUP(L175,Proposito_programa!$C$2:$E$59,3,FALSE)),\" \",VLOOKUP(L175,Proposito_programa!$C$2:$E$59,3,FALSE))","v":"Propósito 5: Construir Bogotá - Región con gobierno abierto, transparente y ciudadanía consciente"},"133011605570000001697",1,79751910,"JULIÁN ANDRÉS BOHÓRQUEZ TELLEZ","Persona Natural",null,null,null,52000000,null,null,null,52000000,42813332,44271,44279,44552,300,null,null,1032390744,"MÓNICA ANDREA BASTO GUZMÁN",44462,20973334,null,null,"X",null,0.82333330769230773]
[1,38,2021,"FDLRUU-CD-038-2021","https://community.secop.gov.co/Public/Tendering/OpportunityDetail/Index?noticeUID=CO1.NTC.1733495&isFromPublicArea=True&isModal=False\n","Contratos de prestación de servicios profesionales y de apoyo a la gestión","Contratación directa","Prestación de servicios profesionales y de apoyo a la gestión, o para la ejecución de trabajos artísticos que sólo puedan encomendarse a determinadas personas naturales;","APOYAR JURÍDICAMENTE LA EJECUCIÓN DE LAS ACCIONES REQUERIDAS PARA EL TRÁMITE E IMPULSO PROCESAL DE LAS ACTUACIONES CONTRAVENCIONALES Y/O QUERELLAS QUE CURSEN EN LAS INSPECCIONES DE POLICÍA DE LA LOCALIDAD DE RAFAEL URIBE URIBE","Inversión","Un Nuevo Contrato Social y Ambiental para la Bogotá del Siglo XXI",57,{"$f":"IF(ISERROR(VLOOKUP(L176,Proposito_programa!$C$2:$E$59,2,FALSE)),\" \",VLOOKUP(L176,Proposito_programa!$C$2:$E$59,2,FALSE))","v":"Gestión pública local"},{"$f":"IF(ISERROR(VLOOKUP(L176,Proposito_programa!$C$2:$E$59,3,FALSE)),\" \",VLOOKUP(L176,Proposito_programa!$C$2:$E$59,3,FALSE))","v":"Propósito 5: Construir Bogotá - Región con gobierno abierto, transparente y ciudadanía consciente"},"133011605570000001698",1,1019086865,"JUAN SEBASTIAN MARTINEZ ROJAS ","Persona Natural",null,null,null,31200000,null,1,15600000,46800000,46800000,44232,44236,44508,180,1,90,null,null,null,null,null,null,"X",null,1]
[1,122,2021,"FDLRUU-CD-122-2021","https://community.secop.gov.co/Public/Tendering/OpportunityDetail/Index?noticeUID=CO1.NTC.1779422&isFromPublicArea=True&isModal=False\n","Contratos de prestación de servicios profesionales y de apoyo a la gestión","Contratación directa","Prestación de servicios profesionales y de apoyo a la gestión, o para la ejecución de trabajos artísticos que sólo puedan encomendarse a determinadas personas naturales;","APOYA EL CUBRIMIENTO DE LAS ACTIVIDADES, CRONOGRAMAS Y AGENDA DE LA ALCALDÍA LOCAL A NIVEL INTERNO Y EXTERNO, ASÍ COMO LA GENERACIÓN DE CONTENIDOS PERIODÍSTICOS\t ","Inversión","Un Nuevo Contrato Social y Ambiental para la Bogotá del Siglo XXI",57,{"$f":"IF(ISERROR(VLOOKUP(L177,Proposito_programa!$C$2:$E$59,2,FALSE)),\" \",VLOOKUP(L177,Proposito_programa!$C$2:$E$59,2,FALSE))","v":"Gestión pública local"},{"$f":"IF(ISERROR(VLOOKUP(L177,Proposito_programa!$C$2:$E$59,3,FALSE)),\" \",VLOOKUP(L177,Proposito_programa!$C$2:$E$59,3,FALSE))","v":"Propósito 5: Construir Bogotá - Región con gobierno abierto, transparente y ciudadanía consciente"},"133011605570000001697",1,1032457982,"JUAN MANUEL CARDENAS GARZON ","Persona Natural",null,null,null,43000000,null,null,null,43000000,39846667,44246,44250,44552,300,null,null,null,null,null,null,null,null,"X",null,0.92666667441860462]
[1,240,2021,"FDLRUU-CD-240-2021 ","https://community.secop.gov.co/Public/Tendering/OpportunityDetail/Index?noticeUID=CO1.NTC.2094094&isFromPublicArea=True&isModal=False\n","Contratos de prestación de servicios profesionales y de apoyo a la gestión","Contratación directa","Prestación de servicios profesionales y de apoyo a la gestión, o para la ejecución de trabajos artísticos que sólo puedan encomendarse a determinadas personas naturales;","PRESTAR SERVICIOS PROFESIONALES AL DESPACHO EN LA FORMULACIÓN, IMPLEMENTACIÓN Y SEGUIMIENTO DE PLANES, PROYECTOS Y ESTRATEGIAS ECONOMICAS, SOCIALES, AMBIENTALES Y CULTURALES, EN LA LOCALIDAD RAFAEL URIBE URIBE","Inversión","Un Nuevo Contrato Social y Ambiental para la Bogotá del Siglo XXI",57,{"$f":"IF(ISERROR(VLOOKUP(L178,Proposito_programa!$C$2:$E$59,2,FALSE)),\" \",VLOOKUP(L178,Proposito_programa!$C$2:$E$59,2,FALSE))","v":"Gestión pública local"},{"$f":"IF(ISERROR(VLOOKUP(L178,Proposito_programa!$C$2:$E$59,3,FALSE)),\" \",VLOOKUP(L178,Proposito_programa!$C$2:$E$59,3,FALSE))","v":"Propósito 5: Construir Bogotá - Región con gobierno abierto, transparente y ciudadanía consciente"},"133011605570000001697",1,79798180,"JUAN FERNANDO CONTRERAS ORTIZ ","Persona Natural",null,null,null,24000000,null,null,null,24000000,21200000,44390,44392,44514,120,null,null,null,null,null,null,null,null,"X",null,0.8833333333333333]
[1,147,2021,"FDLRUU-CD-147-2021","https://community.secop.gov.co/Public/Tendering/OpportunityDetail/Index?noticeUID=CO1.NTC.1795898&isFromPublicArea=True&isModal=False\n","Contratos de prestación de servicios profesionales y de apoyo a la gestión","Contratación directa","Prestación de servicios profesionales y de apoyo a la gestión, o para la ejecución de trabajos artísticos que sólo puedan encomendarse a determinadas personas naturales;","APOYAR TÉCNICAMENTE LAS DISTINTAS ETAPAS DE LOS PROCESOS DE COMPETENCIA DE LAS INSPECCIONES DE POLICÍA DE LA LOCALIDAD, SEGÚN REPARTO","Inversión","Un Nuevo Contrato Social y Ambiental para la Bogotá del Siglo XXI",57,{"$f":"IF(ISERROR(VLOOKUP(L179,Proposito_programa!$C$2:$E$59,2,FALSE)),\" \",VLOOKUP(L179,Proposito_programa!$C$2:$E$59,2,FALSE))","v":"Gestión pública local"},{"$f":"IF(ISERROR(VLOOKUP(L179,Proposito_programa!$C$2:$E$59,3,FALSE)),\" \",VLOOKUP(L179,Proposito_programa!$C$2:$E$59,3,FALSE))","v":"Propósito 5: Construir Bogotá - Región con gobierno abierto, transparente y ciudadanía consciente"},"133011605570000001698",1,79347561,"JUAN CARLOS USSA LIZARAZO","Persona Natural",null,null,null,31200000,null,1,15600000,46800000,41600000,44252,44256,44530,180,1,90,null,null,null,null,null,null,"X",null,0.88888888888888884]
[1,129,2021,"FDLRUU-CD-129-2021","https://community.secop.gov.co/Public/Tendering/OpportunityDetail/Index?noticeUID=CO1.NTC.1782687&isFromPublicArea=True&isModal=False\n","Contratos de prestación de servicios profesionales y de apoyo a la gestión","Contratación directa","Prestación de servicios profesionales y de apoyo a la gestión, o para la ejecución de trabajos artísticos que sólo puedan encomendarse a determinadas personas naturales;","PRESTAR LOS SERVICIOS COMO OPERADOR DE MAQUINARIA AMARILLA, AL SERVICIO DE LA ADMINISTRACION LOCAL DE RAFAEL URIBE URIBE EN LA REALIZACIÓN DE LA EJECUCION DEL PROYECTO NO. 1685 MOVILIDAD MULTIMODAL, INCLUYENTE Y SOSTENIBLE EN RAFAEL URIBE URIBE, ASÍ COMO APOYAR LAS DEMÁS ACTIVIDADES QUE SE GENEREN EN EL ÁREA DE GESTIÓN DEL DESARROLLO CON RELACION AL PROYECTO EN MENCION","Inversión","Un Nuevo Contrato Social y Ambiental para la Bogotá del Siglo XXI",57,{"$f":"IF(ISERROR(VLOOKUP(L180,Proposito_programa!$C$2:$E$59,2,FALSE)),\" \",VLOOKUP(L180,Proposito_programa!$C$2:$E$59,2,FALSE))","v":"Gestión pública local"},{"$f":"IF(ISERROR(VLOOKUP(L180,Proposito_programa!$C$2:$E$59,3,FALSE)),\" \",VLOOKUP(L180,Proposito_programa!$C$2:$E$59,3,FALSE))","v":"Propósito 5: Construir Bogotá - Región con gobierno abierto, transparente y ciudadanía consciente"},"133011605570000001697",1,80139417,"JUAN CARLOS OLEGUA HURTADO","Persona Natural",null,null,null,26000000,null,1,2166667,28166667,24440000,44246,44246,44574,300,1,25,null,null,null,null,null,null,"X",null,0.86769229742375975]
[1,77,2021,"FDLRUU-CD-077-2021","https://community.secop.gov.co/Public/Tendering/OpportunityDetail/Index?noticeUID=CO1.NTC.1755898&isFromPublicArea=True&isModal=False\n","Contratos de prestación de servicios profesionales y de apoyo a la gestión","Contratación directa","Prestación de servicios profesionales y de apoyo a la gestión, o para la ejecución de trabajos artísticos que sólo puedan encomendarse a determinadas personas naturales;","APOYAR LA GESTIÓN DOCUMENTAL DE LA ALCALDÍA LOCAL DE RAFAEL URIBE URIBE EN LA IMPLEMENTACIÓN DE LOS PROCESOS DE CLASIFICACIÓN, ORDENACIÓN, SELECCIÓN NATURAL, FOLIACIÓN, IDENTIFICACIÓN, LEVANTAMIENTO DE INVENTARIOS, ALMACENAMIENTO Y APLICACIÓN DE PROTOCOLOS DE ELIMINACIÓN Y TRANSFERENCIAS DOCUMENTALES","Inversión","Un Nuevo Contrato Social y Ambiental para la Bogotá del Siglo XXI",57,{"$f":"IF(ISERROR(VLOOKUP(L181,Proposito_programa!$C$2:$E$59,2,FALSE)),\" \",VLOOKUP(L181,Proposito_programa!$C$2:$E$59,2,FALSE))","v":"Gestión pública local"},{"$f":"IF(ISERROR(VLOOKUP(L181,Proposito_programa!$C$2:$E$59,3,FALSE)),\" \",VLOOKUP(L181,Proposito_programa!$C$2:$E$59,3,FALSE))","v":"Propósito 5: Construir Bogotá - Región con gobierno abierto, transparente y ciudadanía consciente"},"133011605570000001697",1,17654733,"JUAN CARLOS JIMENEZ MENESES","Persona Natural",null,null,null,26000000,null,1,1646667,27646667,25046667,44238,44239,44561,300,1,19,null,null,null,null,null,null,"X",null,0.90595611398654308]
[1,268,2021,"FDLRUU-CD-268-2021","https://community.secop.gov.co/Public/Tendering/OpportunityDetail/Index?noticeUID=CO1.NTC.2178643&isFromPublicArea=True&isModal=False\n","Contratos de prestación de servicios profesionales y de apoyo a la gestión","Contratación directa","Prestación de servicios profesionales y de apoyo a la gestión, o para la ejecución de trabajos artísticos que sólo puedan encomendarse a determinadas personas naturales;","PRESTAR SUS SERVICIOS ASISTENCIALES PARA LA GESTIÓN DEL RIESGO, EN EL MARCO DE LOS VIGÍAS DEL RIESGO DE LA LOCALIDAD DE RAFAEL URIBE URIBE","Inversión","Un Nuevo Contrato Social y Ambiental para la Bogotá del Siglo XXI",30,{"$f":"IF(ISERROR(VLOOKUP(L182,Proposito_programa!$C$2:$E$59,2,FALSE)),\" \",VLOOKUP(L182,Proposito_programa!$C$2:$E$59,2,FALSE))","v":"Eficiencia en la atención de emergencias"},{"$f":"IF(ISERROR(VLOOKUP(L182,Proposito_programa!$C$2:$E$59,3,FALSE)),\" \",VLOOKUP(L182,Proposito_programa!$C$2:$E$59,3,FALSE))","v":"Propósito 2 : Cambiar Nuestros Hábitos de Vida para Reverdecer a Bogotá y Adaptarnos y Mitigar la Crisis Climática"},"133011602300000001665",1,79515849,"JUAN CARLOS ALVAREZ SANABRIA ","Persona Natural",null,null,null,8100000,null,null,null,8100000,6060000,44425,44428,44565,135,null,null,null,null,null,null,null,null,"X",null,0.74814814814814812]
[1,208,2021,"FDLRUU-CD-208-2021","https://community.secop.gov.co/Public/Tendering/OpportunityDetail/Index?noticeUID=CO1.NTC.1882619&isFromPublicArea=True&isModal=False\n","Contratos de prestación de servicios profesionales y de apoyo a la gestión","Contratación directa","Prestación de servicios profesionales y de apoyo a la gestión, o para la ejecución de trabajos artísticos que sólo puedan encomendarse a determinadas personas naturales;","EL CONTRATISTA SE OBLIGA A PRESTAR SUS SERVICIOS PROFESIONALES EN EL ÁREA DE GESTIÓN DEL DESARROLLO LOCAL - PLANEACIÓN, REALIZANDO LAS ACTIVIDADES PROPIAS PARA LA FORMULACION, EJECUCIÓN Y SEGUIMIENTO DE LOS PROYECTOS DE INVERSIÓN DEL PLAN DE DESARROLLO LOCAL 2021 - 2024","Inversión","Un Nuevo Contrato Social y Ambiental para la Bogotá del Siglo XXI",57,{"$f":"IF(ISERROR(VLOOKUP(L183,Proposito_programa!$C$2:$E$59,2,FALSE)),\" \",VLOOKUP(L183,Proposito_programa!$C$2:$E$59,2,FALSE))","v":"Gestión pública local"},{"$f":"IF(ISERROR(VLOOKUP(L183,Proposito_programa!$C$2:$E$59,3,FALSE)),\" \",VLOOKUP(L183,Proposito_programa!$C$2:$E$59,3,FALSE))","v":"Propósito 5: Construir Bogotá - Región con gobierno abierto, transparente y ciudadanía consciente"},"133011605570000001697",1,1136887745,"JUAN CAMILO RODRIGUEZ VASQUEZ ","Persona Natural",null,null,null,52000000,null,null,null,52000000,40906667,44286,44291,44596,300,null,null,null,null,null,null,null,"X",null,null,0.78666667307692306]
[1,215,2021,"FDLRUU-CD-215-2021","https://community.secop.gov.co/Public/Tendering/OpportunityDetail/Index?noticeUID=CO1.NTC.1895358&isFromPublicArea=True&isModal=False\n","Contratos de prestación de servicios profesionales y de apoyo a la gestión","Contratación directa","Prestación de servicios profesionales y de apoyo a la gestión, o para la ejecución de trabajos artísticos que sólo puedan encomendarse a determinadas personas naturales;","EL CONTRATISTA SE OBLIGA A PRESTAR SERVICIOS PROFESIONALES EN EL ÁREA DE GESTIÓN POLICIVA JURIDICA DE LA ALCALDÍA LOCAL DE RAFAEL URIBE URIBE, PARA VIGILANCIA Y CONTROL DE LAS ZONAS DE PROTECCION AMBIENTAL, REASENTAMIENTOS, RESERVAS AMBIENTALES, HUMEDALES Y ECOSISTEMAS Y CONTROL","Inversión","Un Nuevo Contrato Social y Ambiental para la Bogotá del Siglo XXI",57,{"$f":"IF(ISERROR(VLOOKUP(L184,Proposito_programa!$C$2:$E$59,2,FALSE)),\" \",VLOOKUP(L184,Proposito_programa!$C$2:$E$59,2,FALSE))","v":"Gestión pública local"},{"$f":"IF(ISERROR(VLOOKUP(L184,Proposito_programa!$C$2:$E$59,3,FALSE)),\" \",VLOOKUP(L184,Proposito_programa!$C$2:$E$59,3,FALSE))","v":"Propósito 5: Construir Bogotá - Región con gobierno abierto, transparente y ciudadanía consciente"},"133011605570000001698",1,1030657007,"JUAN CAMILO MOLANO APONTE","Persona Natural",null,null,null,52000000,null,null,null,52000000,38480000,44293,44305,44610,300,null,null,null,null,null,null,null,"X",null,null,0.74]
[1,50,2021,"FDLRUU-CD-050-2021","https://community.secop.gov.co/Public/Tendering/OpportunityDetail/Index?noticeUID=CO1.NTC.1737611&isFromPublicArea=True&isModal=False\n","Contratos de prestación de servicios profesionales y de apoyo a la gestión","Contratación directa","Prestación de servicios profesionales y de apoyo a la gestión, o para la ejecución de trabajos artísticos que sólo puedan encomendarse a determinadas personas naturales;","APOYAR JURÍDICAMENTE LA EJECUCIÓN DE LAS ACCIONES REQUERIDAS PARA EL TRÁMITE E IMPULSO PROCESAL DE LAS ACTUACIONES CONTRAVENCIONALES Y/O QUERELLAS QUE CURSEN EN LAS INSPECCIONES DE POLICÍA DE LA LOCALIDAD DE RAFAEL URIBE URIBE”.","Inversión","Un Nuevo Contrato Social y Ambiental para la Bogotá del Siglo XXI",57,{"$f":"IF(ISERROR(VLOOKUP(L185,Proposito_programa!$C$2:$E$59,2,FALSE)),\" \",VLOOKUP(L185,Proposito_programa!$C$2:$E$59,2,FALSE))","v":"Gestión pública local"},{"$f":"IF(ISERROR(VLOOKUP(L185,Proposito_programa!$C$2:$E$59,3,FALSE)),\" \",VLOOKUP(L185,Proposito_programa!$C$2:$E$59,3,FALSE))","v":"Propósito 5: Construir Bogotá - Región con gobierno abierto, transparente y ciudadanía consciente"},"133011605570000001698",1,79450983,"JUAN ANTONIO CARDENAS ACEVEDO ","Persona Natural",null,null,null,31200000,null,1,15600000,46800000,46800000,44235,44237,44509,180,1,90,null,null,null,null,null,null,"X",null,1]
[1,250,2021,"FDLRUU-CD-250-2021 ","https://community.secop.gov.co/Public/Tendering/OpportunityDetail/Index?noticeUID=CO1.NTC.2119239&isFromPublicArea=True&isModal=False\n","Contratos de prestación de servicios profesionales y de apoyo a la gestión","Contratación directa","Prestación de servicios profesionales y de apoyo a la gestión, o para la ejecución de trabajos artísticos que sólo puedan encomendarse a determinadas personas naturales;","PRESTAR LOS SERVICIOS PROFESIONALES PARA APOYAR AL DESPACHO DE LA ALCALDÍA LOCAL DE RAFAEL URIBE URIBE EN EL DISEÑO Y ESTRATEGIAS, COORDINACIÓN Y EMISIÓN DE LINEAMIENTOS QUE COADYUVEN AL FORTALECIMIENTO INSTITUCIONAL ENTORNO A LAS ACTIVIDADES QUE REALIZA LA ALCALDÍA LOCAL EN SUS DIFERENTES DEPENDENCIAS","Inversión","Un Nuevo Contrato Social y Ambiental para la Bogotá del Siglo XXI",57,{"$f":"IF(ISERROR(VLOOKUP(L186,Proposito_programa!$C$2:$E$59,2,FALSE)),\" \",VLOOKUP(L186,Proposito_programa!$C$2:$E$59,2,FALSE))","v":"Gestión pública local"},{"$f":"IF(ISERROR(VLOOKUP(L186,Proposito_programa!$C$2:$E$59,3,FALSE)),\" \",VLOOKUP(L186,Proposito_programa!$C$2:$E$59,3,FALSE))","v":"Propósito 5: Construir Bogotá - Región con gobierno abierto, transparente y ciudadanía consciente"},"133011605570000001697",1,1100951329,"JUAN ANDRES LOPEZ RIOS ","Persona Natural",null,null,null,24000000,null,null,null,24000000,17800000,44400,44410,44500,120,null,null,null,null,null,null,null,null,null,"X",0.7416666666666667]
[1,4,2021,"FDLRUU-CD-004-2021","https://community.secop.gov.co/Public/Tendering/OpportunityDetail/Index?noticeUID=CO1.NTC.1690514&isFromPublicArea=True&isModal=False\n","Contratos de prestación de servicios profesionales y de apoyo a la gestión","Contratación directa","Prestación de servicios profesionales y de apoyo a la gestión, o para la ejecución de trabajos artísticos que sólo puedan encomendarse a determinadas personas naturales;","PRESTAR LOS SERVICIOS PROFESIONALES PARA DEPURAR LAS OBLIGACIONES POR PAGAR A CARGO DEL FONDO DE DESARROLLO DE RAFAEL URIBE URIBE","Inversión","Un Nuevo Contrato Social y Ambiental para la Bogotá del Siglo XXI",57,{"$f":"IF(ISERROR(VLOOKUP(L187,Proposito_programa!$C$2:$E$59,2,FALSE)),\" \",VLOOKUP(L187,Proposito_programa!$C$2:$E$59,2,FALSE))","v":"Gestión pública local"},{"$f":"IF(ISERROR(VLOOKUP(L187,Proposito_programa!$C$2:$E$59,3,FALSE)),\" \",VLOOKUP(L187,Proposito_programa!$C$2:$E$59,3,FALSE))","v":"Propósito 5: Construir Bogotá - Región con gobierno abierto, transparente y ciudadanía consciente"},"133011605570000001697",1,87941057,"JOSE LUIS GOMEZ GONZALEZ ","Persona Natural",null,null,null,52000000,null,1,7800000,59800000,52346667,44221,44225,44574,300,1,45,null,null,null,null,null,null,"X",null,0.87536232441471573]
[1,32,2021,"FDLRUU-CD-032-2021","https://community.secop.gov.co/Public/Tendering/OpportunityDetail/Index?noticeUID=CO1.NTC.1726165&isFromPublicArea=True&isModal=False\n","Contratos de prestación de servicios profesionales y de apoyo a la gestión","Contratación directa","Prestación de servicios profesionales y de apoyo a la gestión, o para la ejecución de trabajos artísticos que sólo puedan encomendarse a determinadas personas naturales;","APOYAR EL (LA) ALCALDE (SA)LOCAL EN LA GESTIÓN DE LOS ASUNTOS RELACIONADOS CON SEGURIDAD CIUDADANA, CONVIVENCIA Y PREVENCIÓN DE CONFLICTIVIDADES, VIOLENCIAS Y DELITOS EN LA LOCALIDAD, DE CONFORMIDAD CON EL MARCO NORMATIVO APLICABLE EN LA MATERIA","Inversión","Un Nuevo Contrato Social y Ambiental para la Bogotá del Siglo XXI",57,{"$f":"IF(ISERROR(VLOOKUP(L188,Proposito_programa!$C$2:$E$59,2,FALSE)),\" \",VLOOKUP(L188,Proposito_programa!$C$2:$E$59,2,FALSE))","v":"Gestión pública local"},{"$f":"IF(ISERROR(VLOOKUP(L188,Proposito_programa!$C$2:$E$59,3,FALSE)),\" \",VLOOKUP(L188,Proposito_programa!$C$2:$E$59,3,FALSE))","v":"Propósito 5: Construir Bogotá - Región con gobierno abierto, transparente y ciudadanía consciente"},"133011605570000001698",1,94391606,"JOSE JOAQUIN OCAMPO TEJADA ","Persona Natural",null,null,null,67000000,null,1,6253333,73253333,66553333,44229,44230,44560,300,1,28,1014218875,"JULIANA BALLESTEROS CASILIMAS",44392,30596667,null,null,"X",null,0.90853658494965683]
[1,231,2021,"FDLRUU-CD-231-2021 ","https://community.secop.gov.co/Public/Tendering/OpportunityDetail/Index?noticeUID=CO1.NTC.2035217&isFromPublicArea=True&isModal=False\n","Contratos de prestación de servicios profesionales y de apoyo a la gestión","Contratación directa","Prestación de servicios profesionales y de apoyo a la gestión, o para la ejecución de trabajos artísticos que sólo puedan encomendarse a determinadas personas naturales;","PRESTAR LOS SERVICIOS DE APOYO A LA GESTIÓN PARA LA CONDUCCIÓN DE LOS VEHÍCULOS LIVIANOS QUE LE SEAN ASIGNADOS Y QUE SE ENCUENTREN AL SERVICIO DE LA ALCALDÍA LOCAL DE RAFAEL URIBE URIBE","Inversión","Un Nuevo Contrato Social y Ambiental para la Bogotá del Siglo XXI",57,{"$f":"IF(ISERROR(VLOOKUP(L189,Proposito_programa!$C$2:$E$59,2,FALSE)),\" \",VLOOKUP(L189,Proposito_programa!$C$2:$E$59,2,FALSE))","v":"Gestión pública local"},{"$f":"IF(ISERROR(VLOOKUP(L189,Proposito_programa!$C$2:$E$59,3,FALSE)),\" \",VLOOKUP(L189,Proposito_programa!$C$2:$E$59,3,FALSE))","v":"Propósito 5: Construir Bogotá - Región con gobierno abierto, transparente y ciudadanía consciente"},"133011605570000001697",1,334775,"JOSE ALFONSO GARZON CABEZAS","Persona Natural",null,null,null,15600000,null,null,null,15600000,13520000,44363,44372,44554,180,null,null,null,null,null,null,null,null,"X",null,0.8666666666666667]
[1,10,2021,"FDLRUU-CD-010-2021","https://community.secop.gov.co/Public/Tendering/OpportunityDetail/Index?noticeUID=CO1.NTC.1684992&isFromPublicArea=True&isModal=False\n","Contratos de prestación de servicios profesionales y de apoyo a la gestión","Contratación directa","Prestación de servicios profesionales y de apoyo a la gestión, o para la ejecución de trabajos artísticos que sólo puedan encomendarse a determinadas personas naturales;","APOYAR TÉCNICAMENTE LAS DISTINTAS ETAPAS DE LOS PROCESOS DE COMPETENCIA DE LAS INSPECCIONES DE POLICÍA DE LA LOCALIDAD, SEGÚN REPARTO.","Inversión","Un Nuevo Contrato Social y Ambiental para la Bogotá del Siglo XXI",57,{"$f":"IF(ISERROR(VLOOKUP(L190,Proposito_programa!$C$2:$E$59,2,FALSE)),\" \",VLOOKUP(L190,Proposito_programa!$C$2:$E$59,2,FALSE))","v":"Gestión pública local"},{"$f":"IF(ISERROR(VLOOKUP(L190,Proposito_programa!$C$2:$E$59,3,FALSE)),\" \",VLOOKUP(L190,Proposito_programa!$C$2:$E$59,3,FALSE))","v":"Propósito 5: Construir Bogotá - Región con gobierno abierto, transparente y ciudadanía consciente"},"133011605570000001698",1,19338480,"JORGE HERNANDO RODRIGUEZ SANTANA ","Persona Natural",null,null,null,31200000,null,1,15600000,46800000,46800000,44221,44225,44497,180,1,90,null,null,null,null,null,null,"X",null,1]
[1,22,2021,"FDLRUU-CD-022-2021","https://community.secop.gov.co/Public/Tendering/OpportunityDetail/Index?noticeUID=CO1.NTC.1722173&isFromPublicArea=True&isModal=False\n","Contratos de prestación de servicios profesionales y de apoyo a la gestión","Contratación directa","Prestación de servicios profesionales y de apoyo a la gestión, o para la ejecución de trabajos artísticos que sólo puedan encomendarse a determinadas personas naturales;","“PRESTAR LOS SERVICIOS PROFESIONALES COMO INGENIERO O ARQUITECTO PARA DEPURAR LAS OBLIGACIONES POR PAGAR A CARGO DEL FONDO DE DESARROLLO LOCAL\nDE RAFEL URIBE URIBE”","Inversión","Un Nuevo Contrato Social y Ambiental para la Bogotá del Siglo XXI",57,{"$f":"IF(ISERROR(VLOOKUP(L191,Proposito_programa!$C$2:$E$59,2,FALSE)),\" \",VLOOKUP(L191,Proposito_programa!$C$2:$E$59,2,FALSE))","v":"Gestión pública local"},{"$f":"IF(ISERROR(VLOOKUP(L191,Proposito_programa!$C$2:$E$59,3,FALSE)),\" \",VLOOKUP(L191,Proposito_programa!$C$2:$E$59,3,FALSE))","v":"Propósito 5: Construir Bogotá - Región con gobierno abierto, transparente y ciudadanía consciente"},"133011605570000001697",1,79956583,"JORGE ANDRES HERNAN TORRES ","Persona Natural",null,null,null,52000000,null,1,4853333,56853333,51653333,44229,44230,44560,300,1,28,80372860,"EDISON ANGULO ARIAS",44256,47146667,null,null,"X",null,0.90853658482960009]
[1,104,2021,"FDLRUU-CD-104-2021","https://community.secop.gov.co/Public/Tendering/OpportunityDetail/Index?noticeUID=CO1.NTC.1767908&isFromPublicArea=True&isModal=False\n","Contratos de prestación de servicios profesionales y de apoyo a la gestión","Contratación directa","Prestación de servicios profesionales y de apoyo a la gestión, o para la ejecución de trabajos artísticos que sólo puedan encomendarse a determinadas personas naturales;","APOYAR LA GESTIÓN DOCUMENTAL DE LA ALCALDÍA LOCAL AL EQUIPO JURÍDICO DE DEPURACIÓN EN LAS LABORES OPERATIVAS QUE GENERA EL PROCESO DE IMPULSO DE LAS ACTUACIONES ADMINISTRATIVAS EXISTENTES EN LA ALCALDÍA LOCAL DE RAFAEL URIBE URIBE","Inversión","Un Nuevo Contrato Social y Ambiental para la Bogotá del Siglo XXI",57,{"$f":"IF(ISERROR(VLOOKUP(L192,Proposito_programa!$C$2:$E$59,2,FALSE)),\" \",VLOOKUP(L192,Proposito_programa!$C$2:$E$59,2,FALSE))","v":"Gestión pública local"},{"$f":"IF(ISERROR(VLOOKUP(L192,Proposito_programa!$C$2:$E$59,3,FALSE)),\" \",VLOOKUP(L192,Proposito_programa!$C$2:$E$59,3,FALSE))","v":"Propósito 5: Construir Bogotá - Región con gobierno abierto, transparente y ciudadanía consciente"},"133011605570000001698",1,19454960,"JORGE ALBERTO ROMERO CARDENAS ","Persona Natural",null,null,null,17500000,null,1,816667,18316667,16566667,44243,44244,44561,300,1,14,null,null,null,null,null,null,"X",null,0.90445860046481164]
[1,33,2021,"FDLRUU-CD.-033-2021","https://community.secop.gov.co/Public/Tendering/OpportunityDetail/Index?noticeUID=CO1.NTC.1728289&isFromPublicArea=True&isModal=False\n","Contratos de prestación de servicios profesionales y de apoyo a la gestión","Contratación directa","Prestación de servicios profesionales y de apoyo a la gestión, o para la ejecución de trabajos artísticos que sólo puedan encomendarse a determinadas personas naturales;","APOYAR TÉCNICAMENTE LAS DISTINTAS ETAPAS DE LOS PROCESOS DE COMPETENCIA DE LA ALCALDÍA LOCAL PARA LA DEPURACIÓN DE LAS ACTUACIONES ADMINISTRATIVAS”","Inversión","Un Nuevo Contrato Social y Ambiental para la Bogotá del Siglo XXI",57,{"$f":"IF(ISERROR(VLOOKUP(L193,Proposito_programa!$C$2:$E$59,2,FALSE)),\" \",VLOOKUP(L193,Proposito_programa!$C$2:$E$59,2,FALSE))","v":"Gestión pública local"},{"$f":"IF(ISERROR(VLOOKUP(L193,Proposito_programa!$C$2:$E$59,3,FALSE)),\" \",VLOOKUP(L193,Proposito_programa!$C$2:$E$59,3,FALSE))","v":"Propósito 5: Construir Bogotá - Región con gobierno abierto, transparente y ciudadanía consciente"},"133011605570000001698",1,79807118,"JONATHAN MORENO","Persona Natural",null,null,null,31200000,null,1,15600000,46800000,46106667,44230,44232,44504,180,1,90,null,null,null,null,null,null,"X",null,0.9851851923076923]
[1,47,2021,"FDLRUU-CD-047-2021","https://community.secop.gov.co/Public/Tendering/OpportunityDetail/Index?noticeUID=CO1.NTC.1737328&isFromPublicArea=True&isModal=False\n","Contratos de prestación de servicios profesionales y de apoyo a la gestión","Contratación directa","Prestación de servicios profesionales y de apoyo a la gestión, o para la ejecución de trabajos artísticos que sólo puedan encomendarse a determinadas personas naturales;","PRESTAR LOS SERVICIOS PROFESIONALES COMO ABOGADO PARA APOYAR LOS PROCESOS DE CONTRATACIÓN EN SUS DIFERENTES ETAPAS AL ÁREA DE GESTIÓN DEL DESARROLLO DE LA ALCALDÍA LOCAL DE RAFAEL URIBE URIBE","Inversión","Un Nuevo Contrato Social y Ambiental para la Bogotá del Siglo XXI",57,{"$f":"IF(ISERROR(VLOOKUP(L194,Proposito_programa!$C$2:$E$59,2,FALSE)),\" \",VLOOKUP(L194,Proposito_programa!$C$2:$E$59,2,FALSE))","v":"Gestión pública local"},{"$f":"IF(ISERROR(VLOOKUP(L194,Proposito_programa!$C$2:$E$59,3,FALSE)),\" \",VLOOKUP(L194,Proposito_programa!$C$2:$E$59,3,FALSE))","v":"Propósito 5: Construir Bogotá - Región con gobierno abierto, transparente y ciudadanía consciente"},"133011605570000001697",1,80811353,"JOHN HENRY BOHORQUEZ","Persona Natural",null,null,null,52000000,null,1,6760000,58760000,51306667,44232,44232,44574,300,1,39,null,null,null,null,null,null,"X",null,0.87315634785568419]
[1,321,2021,"FDLRUU-MC-321-2021","https://community.secop.gov.co/Public/Tendering/OpportunityDetail/Index?noticeUID=CO1.NTC.2454569&isFromPublicArea=True&isModal=False\n","Suministro","Contratación mínima cuantia","No aplica","ADQUIRIR LA ESTRUCTURA Y REALIZAR LA INSTALACIÓN DE UN CICLOPARQUEADERO PARA EL AVANCE EN LA IMPLEMENTACIÓN DEL PLAN INTEGRAL DE MOVILIDAD SOSTENIBLE -PIMS Y EL PLAN INSTITUCIONAL DE GESTIÓN AMBIENTAL  PIGA EN LA ALCALDÍA LOCAL DE RAFAEL URIBE URIBE","Funcionamiento","Un Nuevo Contrato Social y Ambiental para la Bogotá del Siglo XXI","No aplica",{"$f":"IF(ISERROR(VLOOKUP(L195,Proposito_programa!$C$2:$E$59,2,FALSE)),\" \",VLOOKUP(L195,Proposito_programa!$C$2:$E$59,2,FALSE))","v":" "},{"$f":"IF(ISERROR(VLOOKUP(L195,Proposito_programa!$C$2:$E$59,3,FALSE)),\" \",VLOOKUP(L195,Proposito_programa!$C$2:$E$59,3,FALSE))","v":" "},"1310201010109-1310202010302",3,79391917,"JOHN ALEJANDRO FRANCO OTERO","Persona Natural",null,null,null,10400600,null,null,null,10400600,0,44557,"CELEBRADO SIN INICIAR","CELEBRADO SIN INICIAR",90,null,null,null,null,null,null,"X",null,null,null,0]
[1,290,2021,"FDLRUU-CD-290-2021","https://community.secop.gov.co/Public/Tendering/OpportunityDetail/Index?noticeUID=CO1.NTC.2257644&isFromPublicArea=True&isModal=False\n","Contratos de prestación de servicios profesionales y de apoyo a la gestión","Contratación directa","Prestación de servicios profesionales y de apoyo a la gestión, o para la ejecución de trabajos artísticos que sólo puedan encomendarse a determinadas personas naturales;","PRESTAR LOS SERVICIOS TECNICOS PARA DESARROLLAR ACTIVIDADES TENDIENTES A GARANTIZAR LA SALUD Y LA ATENCIÓN DE LAS EMERGENCIAS Y DESASTRES QUE SE PRESENTEN EN LA LOCALIDAD RAFAEL URIBE URIBE.","Inversión","Un Nuevo Contrato Social y Ambiental para la Bogotá del Siglo XXI",30,{"$f":"IF(ISERROR(VLOOKUP(L196,Proposito_programa!$C$2:$E$59,2,FALSE)),\" \",VLOOKUP(L196,Proposito_programa!$C$2:$E$59,2,FALSE))","v":"Eficiencia en la atención de emergencias"},{"$f":"IF(ISERROR(VLOOKUP(L196,Proposito_programa!$C$2:$E$59,3,FALSE)),\" \",VLOOKUP(L196,Proposito_programa!$C$2:$E$59,3,FALSE))","v":"Propósito 2 : Cambiar Nuestros Hábitos de Vida para Reverdecer a Bogotá y Adaptarnos y Mitigar la Crisis Climática"},"133011602300000001665",1,52276920,"JOHANNA ASTRID ZORRO VARGAS","Persona Natural",null,null,null,10800000,null,null,null,10800000,5580000,44456,44468,44589,120,null,null,null,null,null,null,null,null,"X",null,0.51666666666666672]
[1,95,2021,"FDLRUU-CD-095-2021","https://community.secop.gov.co/Public/Tendering/OpportunityDetail/Index?noticeUID=CO1.NTC.1758205&isFromPublicArea=True&isModal=False\n","Contratos de prestación de servicios profesionales y de apoyo a la gestión","Contratación directa","Prestación de servicios profesionales y de apoyo a la gestión, o para la ejecución de trabajos artísticos que sólo puedan encomendarse a determinadas personas naturales;","APOYAR LA GESTIÓN DOCUMENTAL DE LA ALCALDÍA LOCAL DE RAFAEL URIBE URIBE EN LA IMPLEMENTACIÓN DE LOS PROCESOS DE CLASIFICACIÓN, ORDENACIÓN, SELECCIÓN NATURAL, FOLIACIÓN, IDENTIFICACIÓN, LEVANTAMIENTO DE INVENTARIOS, ALMACENAMIENTO Y APLICACIÓN DE PROTOCOLOS DE ELIMINACIÓN Y TRANSFERENCIAS DOCUMENTALES","Inversión","Un Nuevo Contrato Social y Ambiental para la Bogotá del Siglo XXI",57,{"$f":"IF(ISERROR(VLOOKUP(L197,Proposito_programa!$C$2:$E$59,2,FALSE)),\" \",VLOOKUP(L197,Proposito_programa!$C$2:$E$59,2,FALSE))","v":"Gestión pública local"},{"$f":"IF(ISERROR(VLOOKUP(L197,Proposito_programa!$C$2:$E$59,3,FALSE)),\" \",VLOOKUP(L197,Proposito_programa!$C$2:$E$59,3,FALSE))","v":"Propósito 5: Construir Bogotá - Región con gobierno abierto, transparente y ciudadanía consciente"},"133011605570000001697",1,53049635,"JOHANA CONSTANZA CRUZ PRIETO","Persona Natural",null,null,null,26000000,null,1,2513333,28513333,24786667,44239,44242,44574,300,1,29,null,null,null,null,null,null,"X",null,0.86930093370704853]
[1,56,2021,"FDLRUU-CD-056-2021","https://community.secop.gov.co/Public/Tendering/OpportunityDetail/Index?noticeUID=CO1.NTC.1739664&isFromPublicArea=True&isModal=False","Contratos de prestación de servicios profesionales y de apoyo a la gestión","Contratación directa","Prestación de servicios profesionales y de apoyo a la gestión, o para la ejecución de trabajos artísticos que sólo puedan encomendarse a determinadas personas naturales;","APOYAR JURÍDICAMENTE LA EJECUCIÓN DE LAS ACCIONES REQUERIDAS PARA EL TRÁMITE E IMPULSO PROCESAL DE LAS ACTUACIONES CONTRAVENCIONALES Y/O QUERELLAS QUE CURSEN EN LAS INSPECCIONES DE POLICÍA DE LA LOCALIDAD DE RAFAEL URIBE URIBE","Inversión","Un Nuevo Contrato Social y Ambiental para la Bogotá del Siglo XXI",57,{"$f":"IF(ISERROR(VLOOKUP(L198,Proposito_programa!$C$2:$E$59,2,FALSE)),\" \",VLOOKUP(L198,Proposito_programa!$C$2:$E$59,2,FALSE))","v":"Gestión pública local"},{"$f":"IF(ISERROR(VLOOKUP(L198,Proposito_programa!$C$2:$E$59,3,FALSE)),\" \",VLOOKUP(L198,Proposito_programa!$C$2:$E$59,3,FALSE))","v":"Propósito 5: Construir Bogotá - Región con gobierno abierto, transparente y ciudadanía consciente"},"133011605570000001698",1,79536725,"JHON FREDY HERRERA TORRES ","Persona Natural",null,null,null,31200000,null,1,15600000,46800000,46800000,44235,44238,44510,180,1,90,null,null,null,null,null,null,"X",null,1]
[1,79,2021,"FDLRUU-CD-079-2021","https://community.secop.gov.co/Public/Tendering/OpportunityDetail/Index?noticeUID=CO1.NTC.1761701&isFromPublicArea=True&isModal=False\n","Contratos de prestación de servicios profesionales y de apoyo a la gestión","Contratación directa","Prestación de servicios profesionales y de apoyo a la gestión, o para la ejecución de trabajos artísticos que sólo puedan encomendarse a determinadas personas naturales;","APOYAR Y DAR SOPORTE TÉCNICO AL ADMINISTRADOR Y USUARIO FINAL DE LA RED DE SISTEMAS Y TECNOLOGÍA E INFORMACIÓN DE LA ALCALDÍA LOCAL DE RAFAEL URIBE URIBE.","Inversión","Un Nuevo Contrato Social y Ambiental para la Bogotá del Siglo XXI",57,{"$f":"IF(ISERROR(VLOOKUP(L199,Proposito_programa!$C$2:$E$59,2,FALSE)),\" \",VLOOKUP(L199,Proposito_programa!$C$2:$E$59,2,FALSE))","v":"Gestión pública local"},{"$f":"IF(ISERROR(VLOOKUP(L199,Proposito_programa!$C$2:$E$59,3,FALSE)),\" \",VLOOKUP(L199,Proposito_programa!$C$2:$E$59,3,FALSE))","v":"Propósito 5: Construir Bogotá - Región con gobierno abierto, transparente y ciudadanía consciente"},"133011605570000001697",1,79910956,"JHON ALEXANDER OLAYA CUESTA ","Persona Natural",null,null,null,39000000,null,1,3640000,42640000,37050000,44239,44243,44574,300,1,32,null,null,null,null,null,null,"X",null,0.86890243902439024]
[1,214,2021,"FDLRUU-CD-214-2021","https://community.secop.gov.co/Public/Tendering/OpportunityDetail/Index?noticeUID=CO1.NTC.1890771&isFromPublicArea=True&isModal=False\n","Contratos de prestación de servicios profesionales y de apoyo a la gestión","Contratación directa","Prestación de servicios profesionales y de apoyo a la gestión, o para la ejecución de trabajos artísticos que sólo puedan encomendarse a determinadas personas naturales;","APOYAR JURÍDICAMENTE LA EJECUCIÓN DE LAS ACCIONES REQUERIDAS PARA LA DEPURACIÓN DE LAS ACTUACIONES ADMINISTRATIVAS QUE CURSAN EN LA ALCALDÍA LOCAL","Inversión","Un Nuevo Contrato Social y Ambiental para la Bogotá del Siglo XXI",57,{"$f":"IF(ISERROR(VLOOKUP(L200,Proposito_programa!$C$2:$E$59,2,FALSE)),\" \",VLOOKUP(L200,Proposito_programa!$C$2:$E$59,2,FALSE))","v":"Gestión pública local"},{"$f":"IF(ISERROR(VLOOKUP(L200,Proposito_programa!$C$2:$E$59,3,FALSE)),\" \",VLOOKUP(L200,Proposito_programa!$C$2:$E$59,3,FALSE))","v":"Propósito 5: Construir Bogotá - Región con gobierno abierto, transparente y ciudadanía consciente"},"133011605570000001698",1,53165893,"JESSICA CALDERON MUÑOZ","Persona Natural",null,null,null,31200000,null,null,null,31200000,29293333,44292,44298,44480,180,null,null,null,null,null,null,null,null,"X",null,0.93888887820512823]
[1,12,2021,"FDLRUU-CD-012-2021","https://community.secop.gov.co/Public/Tendering/OpportunityDetail/Index?noticeUID=CO1.NTC.1691034&isFromPublicArea=True&isModal=False\n","Contratos de prestación de servicios profesionales y de apoyo a la gestión","Contratación directa","Prestación de servicios profesionales y de apoyo a la gestión, o para la ejecución de trabajos artísticos que sólo puedan encomendarse a determinadas personas naturales;","APOYAR JURÍDICAMENTE LA EJECUCIÓN DE LAS ACCIONES REQUERIDAS PARA LA DEPURACIÓN DE LAS ACTUACIONES ADMINISTRATIVAS QUE CURSAN EN LA ALCALDÍA LOCAL","Inversión","Un Nuevo Contrato Social y Ambiental para la Bogotá del Siglo XXI",57,{"$f":"IF(ISERROR(VLOOKUP(L201,Proposito_programa!$C$2:$E$59,2,FALSE)),\" \",VLOOKUP(L201,Proposito_programa!$C$2:$E$59,2,FALSE))","v":"Gestión pública local"},{"$f":"IF(ISERROR(VLOOKUP(L201,Proposito_programa!$C$2:$E$59,3,FALSE)),\" \",VLOOKUP(L201,Proposito_programa!$C$2:$E$59,3,FALSE))","v":"Propósito 5: Construir Bogotá - Región con gobierno abierto, transparente y ciudadanía consciente"},"133011605570000001698",1,1101175034,"JESICA DAYANA PEÑA QUINTERO","Persona Natural",null,null,null,31200000,null,1,15600000,46800000,46800000,44223,44228,44500,180,1,90,null,null,null,null,null,null,"X",null,1]
[1,201,2021,"FDLRUU-CD-201-2021","https://community.secop.gov.co/Public/Tendering/OpportunityDetail/Index?noticeUID=CO1.NTC.1850888&isFromPublicArea=True&isModal=False\n","Contratos de prestación de servicios profesionales y de apoyo a la gestión","Contratación directa","Prestación de servicios profesionales y de apoyo a la gestión, o para la ejecución de trabajos artísticos que sólo puedan encomendarse a determinadas personas naturales;","APOYAR ADMINISTRATIVA Y ASISTENCIALMENTE A LAS INSPECCIONES DE POLICÍA DE LA LOCALIDAD DE RAFAEL URIBE URIBE","Inversión","Un Nuevo Contrato Social y Ambiental para la Bogotá del Siglo XXI",57,{"$f":"IF(ISERROR(VLOOKUP(L202,Proposito_programa!$C$2:$E$59,2,FALSE)),\" \",VLOOKUP(L202,Proposito_programa!$C$2:$E$59,2,FALSE))","v":"Gestión pública local"},{"$f":"IF(ISERROR(VLOOKUP(L202,Proposito_programa!$C$2:$E$59,3,FALSE)),\" \",VLOOKUP(L202,Proposito_programa!$C$2:$E$59,3,FALSE))","v":"Propósito 5: Construir Bogotá - Región con gobierno abierto, transparente y ciudadanía consciente"},"133011605570000001698",1,52161937,"JENNY YOLANDA SEPULVEDA SALAZAR","Persona Natural",null,null,null,10500000,null,1,5250000,15750000,14350000,44272,44279,44553,180,1,90,null,null,null,null,null,null,"X",null,0.91111111111111109]
[1,91,2021,"FDLRUU-CD-091-2021","https://community.secop.gov.co/Public/Tendering/OpportunityDetail/Index?noticeUID=CO1.NTC.1756580&isFromPublicArea=True&isModal=False\n","Contratos de prestación de servicios profesionales y de apoyo a la gestión","Contratación directa","Prestación de servicios profesionales y de apoyo a la gestión, o para la ejecución de trabajos artísticos que sólo puedan encomendarse a determinadas personas naturales;","PRESTAR LOS SERVICIOS PROFESIONALES COMO ABOGADO PARA DEPURAR LAS OBLIGACIONES POR PAGAR A CARGO DEL FONDO DESARROLLO LOCAL DE RAFAEL URIBE URIBE","Inversión","Un Nuevo Contrato Social y Ambiental para la Bogotá del Siglo XXI",57,{"$f":"IF(ISERROR(VLOOKUP(L203,Proposito_programa!$C$2:$E$59,2,FALSE)),\" \",VLOOKUP(L203,Proposito_programa!$C$2:$E$59,2,FALSE))","v":"Gestión pública local"},{"$f":"IF(ISERROR(VLOOKUP(L203,Proposito_programa!$C$2:$E$59,3,FALSE)),\" \",VLOOKUP(L203,Proposito_programa!$C$2:$E$59,3,FALSE))","v":"Propósito 5: Construir Bogotá - Región con gobierno abierto, transparente y ciudadanía consciente"},"133011605570000001697",1,1022950072,"JENNY VIVIANA SASTOQUE LOPEZ","Persona Natural",null,null,null,52000000,null,1,5026667,57026667,49573333,44239,44242,44574,300,1,29,null,null,null,null,null,null,"X",null,0.8693009009276309]
[1,39,2021,"FDLRUU-CD-039-2021","https://community.secop.gov.co/Public/Tendering/OpportunityDetail/Index?noticeUID=CO1.NTC.1728735&isFromPublicArea=True&isModal=False\n","Contratos de prestación de servicios profesionales y de apoyo a la gestión","Contratación directa","Prestación de servicios profesionales y de apoyo a la gestión, o para la ejecución de trabajos artísticos que sólo puedan encomendarse a determinadas personas naturales;","EL CONTRATISTA SE OBLIGA A PRESTAR SUS SERVICIOS DE APOYO TÉCNICO ADMINISTRATIVO PARA LA GRUPO DE PLANEACIÓN DE LA ALCALDÍA LOCAL DE RAFAEL URIBE URIBE”","Inversión","Un Nuevo Contrato Social y Ambiental para la Bogotá del Siglo XXI",57,{"$f":"IF(ISERROR(VLOOKUP(L204,Proposito_programa!$C$2:$E$59,2,FALSE)),\" \",VLOOKUP(L204,Proposito_programa!$C$2:$E$59,2,FALSE))","v":"Gestión pública local"},{"$f":"IF(ISERROR(VLOOKUP(L204,Proposito_programa!$C$2:$E$59,3,FALSE)),\" \",VLOOKUP(L204,Proposito_programa!$C$2:$E$59,3,FALSE))","v":"Propósito 5: Construir Bogotá - Región con gobierno abierto, transparente y ciudadanía consciente"},"133011605570000001697",1,1019054181,"JENNY ELVIRA PRIETO OLARTE","Persona Natural",null,null,null,39000000,null,1,5070000,44070000,38480000,44230,44232,44574,300,1,39,null,null,null,null,null,null,"X",null,0.87315634218289084]
[1,106,2021,"FDLRUU-CD-106-2021","https://community.secop.gov.co/Public/Tendering/OpportunityDetail/Index?noticeUID=CO1.NTC.1770992&isFromPublicArea=True&isModal=False\n","Contratos de prestación de servicios profesionales y de apoyo a la gestión","Contratación directa","Prestación de servicios profesionales y de apoyo a la gestión, o para la ejecución de trabajos artísticos que sólo puedan encomendarse a determinadas personas naturales;","PRESTAR LOS SERVICIOS PROFESIONALES PARA LA OPERACIÓN, PRESTACIÓN, SEGUIMIENTO Y CUMPLIMIENTO PROCEDIMIENTOS ADMINISTRATIVOS OPERATIVOS Y PROGRAMÁTICOS DEL SERVICIO APOYO ECONÓMICO TIPO C, QUE CONTRIBUYAN A LA GARANTÍA DE LOS DERECHOS DE LA POBLACIÓN MAYOR EN EL MARCO DE LA POLÍTICA PÚBLICA SOCIAL PARA EL ENVEJECIMIENTO Y LA VEJEZ EN EL DISTRITO CAPITAL A CARGO DE LA ALCALDÍA LOCAL RAFAEL URIBE URIBE.","Inversión","Un Nuevo Contrato Social y Ambiental para la Bogotá del Siglo XXI",1,{"$f":"IF(ISERROR(VLOOKUP(L205,Proposito_programa!$C$2:$E$59,2,FALSE)),\" \",VLOOKUP(L205,Proposito_programa!$C$2:$E$59,2,FALSE))","v":"Subsidios y transferencias para la equidad"},{"$f":"IF(ISERROR(VLOOKUP(L205,Proposito_programa!$C$2:$E$59,3,FALSE)),\" \",VLOOKUP(L205,Proposito_programa!$C$2:$E$59,3,FALSE))","v":"Propósito 1: Hacer un nuevo contrato social para incrementar la inclusión social, productiva y política"},"133011601010000001636",1,1033710335,"JENIFER ARIAS TAVERA ","Persona Natural",null,null,null,41600000,null,1,15253333,56853333,49053333,44244,44245,44574,240,1,88,null,null,null,null,null,null,"X",null,0.86280487724440003]
[1,267,2021,"FDLRUU-CD-267-2021","https://community.secop.gov.co/Public/Tendering/OpportunityDetail/Index?noticeUID=CO1.NTC.2187120&isFromPublicArea=True&isModal=False\n","Contratos de prestación de servicios profesionales y de apoyo a la gestión","Contratación directa","Prestación de servicios profesionales y de apoyo a la gestión, o para la ejecución de trabajos artísticos que sólo puedan encomendarse a determinadas personas naturales;","PRESTAR SUS SERVICIOS ASISTENCIALES PARA LA GESTIÓN DEL RIESGO, EN EL MARCO DE LOS VIGÍAS DEL RIESGO DE LA LOCALIDAD DE RAFAEL URIBE URIBE","Inversión","Un Nuevo Contrato Social y Ambiental para la Bogotá del Siglo XXI",30,{"$f":"IF(ISERROR(VLOOKUP(L206,Proposito_programa!$C$2:$E$59,2,FALSE)),\" \",VLOOKUP(L206,Proposito_programa!$C$2:$E$59,2,FALSE))","v":"Eficiencia en la atención de emergencias"},{"$f":"IF(ISERROR(VLOOKUP(L206,Proposito_programa!$C$2:$E$59,3,FALSE)),\" \",VLOOKUP(L206,Proposito_programa!$C$2:$E$59,3,FALSE))","v":"Propósito 2 : Cambiar Nuestros Hábitos de Vida para Reverdecer a Bogotá y Adaptarnos y Mitigar la Crisis Climática"},"133011602300000001665",1,80882081,"JEISSON CAMILO\nRAMIREZ MALAGÓN.","Persona Natural",null,null,null,8100000,null,null,null,8100000,5460000,44431,44438,44575,135,null,null,null,null,null,null,null,null,"X",null,{"$f":"IF(ISERROR(AB206/AA206),\"-\",(AB206/AA206))","v":0.67407407407407405}]
[1,183,2021,"FDLRUU-CD-183-2021","https://community.secop.gov.co/Public/Tendering/OpportunityDetail/Index?noticeUID=CO1.NTC.1822899&isFromPublicArea=True&isModal=False\n","Contratos de prestación de servicios profesionales y de apoyo a la gestión","Contratación directa","Prestación de servicios profesionales y de apoyo a la gestión, o para la ejecución de trabajos artísticos que sólo puedan encomendarse a determinadas personas naturales;","EL CONTRATISTA SE OBLIGA A PRESTAR SUS SERVICIOS PROFESIONALES EN EL ÁREA DE GESTIÓN DEL DESARROLLO LOCAL - PLANEACIÓN, REALIZANDO LAS ACTIVIDADES PROPIAS PARA LA FORMULACION, EJECUCIÓN Y SEGUIMIENTO DE LOS PROYECTOS DE INVERSIÓN DEL PLAN DE DESARROLLO LOCAL 2021 – 2024 RELACIONADOS CON LOS SECTORES DE EDUCACION Y PRIMERA INFANCIA","Inversión","Un Nuevo Contrato Social y Ambiental para la Bogotá del Siglo XXI",57,{"$f":"IF(ISERROR(VLOOKUP(L207,Proposito_programa!$C$2:$E$59,2,FALSE)),\" \",VLOOKUP(L207,Proposito_programa!$C$2:$E$59,2,FALSE))","v":"Gestión pública local"},{"$f":"IF(ISERROR(VLOOKUP(L207,Proposito_programa!$C$2:$E$59,3,FALSE)),\" \",VLOOKUP(L207,Proposito_programa!$C$2:$E$59,3,FALSE))","v":"Propósito 5: Construir Bogotá - Región con gobierno abierto, transparente y ciudadanía consciente"},"133011605570000001697",1,1033679200,"JEIMMY  ELIZABETH SANCHEZ SUAREZ ","Persona Natural",null,null,null,31200000,null,1,15600000,46800000,45240000,44263,44265,44539,180,1,90,null,null,null,null,null,null,"X",null,0.96666666666666667]
[1,66,2021,"FDLRUU-CD-066-2021","https://community.secop.gov.co/Public/Tendering/OpportunityDetail/Index?noticeUID=CO1.NTC.1745536&isFromPublicArea=True&isModal=False\n","Contratos de prestación de servicios profesionales y de apoyo a la gestión","Contratación directa","Prestación de servicios profesionales y de apoyo a la gestión, o para la ejecución de trabajos artísticos que sólo puedan encomendarse a determinadas personas naturales;","PRESTAR LOS SERVICIOS PERSONALES DE APOYO A LA GESTIÓN PARA LA CONDUCCIÓN DE LOS VEHÍCULOS LIVIANOS QUE LE SEAN ASIGNADOS Y QUE SE ENCUENTREN AL SERVICIO DE LA ALCALDÍA LOCAL DE RAFAEL URIBE URIBE","Inversión","Un Nuevo Contrato Social y Ambiental para la Bogotá del Siglo XXI",57,{"$f":"IF(ISERROR(VLOOKUP(L208,Proposito_programa!$C$2:$E$59,2,FALSE)),\" \",VLOOKUP(L208,Proposito_programa!$C$2:$E$59,2,FALSE))","v":"Gestión pública local"},{"$f":"IF(ISERROR(VLOOKUP(L208,Proposito_programa!$C$2:$E$59,3,FALSE)),\" \",VLOOKUP(L208,Proposito_programa!$C$2:$E$59,3,FALSE))","v":"Propósito 5: Construir Bogotá - Región con gobierno abierto, transparente y ciudadanía consciente"},"133011605570000001697",1,79740493,"JAVIER BASTIDAS ROMERO","Persona Natural",null,null,null,26000000,null,1,2860000,28860000,25133333,44236,44238,44574,300,1,33,null,null,null,null,null,null,"X",null,0.87087085932085928]
[1,23,2021,"FDLRUU-CD-023-2021","https://community.secop.gov.co/Public/Tendering/OpportunityDetail/Index?noticeUID=CO1.NTC.1721723&isFromPublicArea=True&isModal=False\n","Contratos de prestación de servicios profesionales y de apoyo a la gestión","Contratación directa","Prestación de servicios profesionales y de apoyo a la gestión, o para la ejecución de trabajos artísticos que sólo puedan encomendarse a determinadas personas naturales;","PRESTAR LOS SERVICIOS PROFESIONALES PARA APOYAR AL DESPACHO DE LA ALCALDIA LOCAL DE RAFAEL URIBE URIBE EN TEMAS ECONÓMICOS Y ADMINISTRATIVOS PROPIOS DE LA GESTIÓN, ASI COMO, EN EL ANALISIS DE LOS DOCUMENTOS QUE SE LE ENCOMIENDEN, SEGUIMIENTO Y COORDINACIÓN DE ESTRATEGIAS Y EMISIÓN DE LINEAMIENTOS QUE COADYUVEN AL FORTALECIMIENTO INSTITUCIONAL DE LA ALCALDIA LOCAL","Inversión","Un Nuevo Contrato Social y Ambiental para la Bogotá del Siglo XXI",57,{"$f":"IF(ISERROR(VLOOKUP(L209,Proposito_programa!$C$2:$E$59,2,FALSE)),\" \",VLOOKUP(L209,Proposito_programa!$C$2:$E$59,2,FALSE))","v":"Gestión pública local"},{"$f":"IF(ISERROR(VLOOKUP(L209,Proposito_programa!$C$2:$E$59,3,FALSE)),\" \",VLOOKUP(L209,Proposito_programa!$C$2:$E$59,3,FALSE))","v":"Propósito 5: Construir Bogotá - Región con gobierno abierto, transparente y ciudadanía consciente"},"133011605570000001697",1,1015402942,"JAVIER ALEJANDRO ZUÑIGA ROJAS ","Persona Natural",null,null,null,67000000,null,1,9603333,76603333,67000000,44228,44228,44574,300,1,43,null,null,null,null,null,null,"X",null,0.87463557231902689]
[1,234,2021,"FDLRUU-CMA-225-2021 ","https://community.secop.gov.co/Public/Tendering/OpportunityDetail/Index?noticeUID=CO1.NTC.2025332&isFromPublicArea=True&isModal=False\n","Seguros","Concurso de méritos","No aplica","SELECCIONAR UN INTERMEDIARIO DE SEGUROS LEGALMENTE CONSTITUIDO EN COLOMBIA, PARA QUE PRESTE SUS SERVICIOS PROFESIONALES DE ASESORÍA INTEGRAL EN LA INTERMEDIACIÓN, CONTRATACIÓN Y ADMINISTRACIÓN DEL PROGRAMA DE SEGUROS REQUERIDO POR EL FONDO DE DESARROLLO LOCAL DE RAFAEL URIBE URIBE; PARA LA ADECUADA PROTECCIÓN DE LOS BIENES MUEBLES, INMUEBLES E INTERESES PATRIMONIALES DE LA ENTIDAD Y LOS BIENES POR LOS CUALES SEA O LLEGARE A SER LEGALMENTE RESPONSABLE, ASÍ COMO SEGURO DE VIDA EDILES","Funcionamiento","Un Nuevo Contrato Social y Ambiental para la Bogotá del Siglo XXI","No aplica",{"$f":"IF(ISERROR(VLOOKUP(L210,Proposito_programa!$C$2:$E$59,2,FALSE)),\" \",VLOOKUP(L210,Proposito_programa!$C$2:$E$59,2,FALSE))","v":" "},{"$f":"IF(ISERROR(VLOOKUP(L210,Proposito_programa!$C$2:$E$59,3,FALSE)),\" \",VLOOKUP(L210,Proposito_programa!$C$2:$E$59,3,FALSE))","v":" "},null,1,800018165,"JARGU S.A. CORREDORES DE SEGUROS","Persona Jurídica",null,null,null,0,null,null,null,0,"-",44385,44389,44753,360,null,null,null,null,null,null,null,"X",null,null,"-"]
[1,123,2021,"FDLRUU-CD-123-2021","https://community.secop.gov.co/Public/Tendering/OpportunityDetail/Index?noticeUID=CO1.NTC.1778960&isFromPublicArea=True&isModal=False\n","Contratos de prestación de servicios profesionales y de apoyo a la gestión","Contratación directa","Prestación de servicios profesionales y de apoyo a la gestión, o para la ejecución de trabajos artísticos que sólo puedan encomendarse a determinadas personas naturales;","PRESTAR LOS SERVICIOS TÉCNICOS PARA LA OPERACIÓN, SEGUIMIENTO Y CUMPLIMIENTO DE LOS PROCESOS Y PROCEDIMIENTOS DEL SERVICIO APOYOS PARA LA SEGURIDAD ECONÓMICA TIPO C, REQUERIDOS PARA EL OPORTUNO Y ADECUADO REGISTRO, CRUCE Y REPORTE DE LOS DATOS EN EL SISTEMA MISIONAL SIRBE, QUE CONTRIBUYAN A LA GARANTÍA DE LOS DERECHOS DE LA POBLACIÓN MAYOR EN EL MARCO DE LA POLÍTICA PÚBLICA SOCIAL PARA EL ENVEJECIMIENTO Y LA VEJEZ EN EL DISTRITO CAPITAL A CARGO DE LA ALCALDÍA LOCAL.”","Inversión","Un Nuevo Contrato Social y Ambiental para la Bogotá del Siglo XXI",1,{"$f":"IF(ISERROR(VLOOKUP(L211,Proposito_programa!$C$2:$E$59,2,FALSE)),\" \",VLOOKUP(L211,Proposito_programa!$C$2:$E$59,2,FALSE))","v":"Subsidios y transferencias para la equidad"},{"$f":"IF(ISERROR(VLOOKUP(L211,Proposito_programa!$C$2:$E$59,3,FALSE)),\" \",VLOOKUP(L211,Proposito_programa!$C$2:$E$59,3,FALSE))","v":"Propósito 1: Hacer un nuevo contrato social para incrementar la inclusión social, productiva y política"},"133011601010000001636",1,52374822,"JAQUELINE GALLEGO CASTELLANOS ","Persona Natural",null,null,null,26400000,null,1,9570000,{"$f":"+W211+X211+Z211","v":35970000},31020000,44245,44246,44574,240,1,87,null,null,null,null,null,null,"X",null,0.86238532110091748]
[1,296,2021,"FDLRUU-CD-296-2021","https://community.secop.gov.co/Public/Tendering/OpportunityDetail/Index?noticeUID=CO1.NTC.2280728&isFromPublicArea=True&isModal=False\n","Contratos de prestación de servicios profesionales y de apoyo a la gestión","Contratación directa","Prestación de servicios profesionales y de apoyo a la gestión, o para la ejecución de trabajos artísticos que sólo puedan encomendarse a determinadas personas naturales;","PRESTAR SERVICIOS DE APOYO A LA GESTIÓN PARA EL SEGUIMIENTO DEL CUMPLIMIENTO DE LOS PROCEDIMIENTOS ADMINISTRATIVOS, OPERATIVOS Y TÉCNICOS DEL PROYECTO “RETO LOCAL” Y LOS ASOCIADOS A LA INCLUSIÓN SOCIAL Y SEGURIDAD ECONÓMICA EN LA LOCALIDAD DE RAFAEL URIBE URIBE","Inversión","Un Nuevo Contrato Social y Ambiental para la Bogotá del Siglo XXI",1,{"$f":"IF(ISERROR(VLOOKUP(L212,Proposito_programa!$C$2:$E$59,2,FALSE)),\" \",VLOOKUP(L212,Proposito_programa!$C$2:$E$59,2,FALSE))","v":"Subsidios y transferencias para la equidad"},{"$f":"IF(ISERROR(VLOOKUP(L212,Proposito_programa!$C$2:$E$59,3,FALSE)),\" \",VLOOKUP(L212,Proposito_programa!$C$2:$E$59,3,FALSE))","v":"Propósito 1: Hacer un nuevo contrato social para incrementar la inclusión social, productiva y política"},"133011601010000002213",1,79300027,"JAIME HERNANDO RIVERA PINZON","Persona Natural",null,null,null,26438110,null,null,null,26438110,4318225,44468,44481,44784,300,null,null,null,null,null,null,null,"X",null,null,0.16333334720220166]
[1,264,2021,"FDLRUU-CD-264-2021","https://community.secop.gov.co/Public/Tendering/OpportunityDetail/Index?noticeUID=CO1.NTC.2166603&isFromPublicArea=True&isModal=False\n","Contratos de prestación de servicios profesionales y de apoyo a la gestión","Contratación directa","Prestación de servicios profesionales y de apoyo a la gestión, o para la ejecución de trabajos artísticos que sólo puedan encomendarse a determinadas personas naturales;","PRESTAR SERVICIOS DE APOYO A LA GESTIÓN LOCAL EN LOS TEMAS DE MITIGACIÓN DEL RIESGO EN CAMPO, EN EL MARCO DEL PLAN DE DESARROLLO LOCAL DE LA LOCALIDAD DE RAFAEL URIBE URIBE","Inversión","Un Nuevo Contrato Social y Ambiental para la Bogotá del Siglo XXI",30,{"$f":"IF(ISERROR(VLOOKUP(L213,Proposito_programa!$C$2:$E$59,2,FALSE)),\" \",VLOOKUP(L213,Proposito_programa!$C$2:$E$59,2,FALSE))","v":"Eficiencia en la atención de emergencias"},{"$f":"IF(ISERROR(VLOOKUP(L213,Proposito_programa!$C$2:$E$59,3,FALSE)),\" \",VLOOKUP(L213,Proposito_programa!$C$2:$E$59,3,FALSE))","v":"Propósito 2 : Cambiar Nuestros Hábitos de Vida para Reverdecer a Bogotá y Adaptarnos y Mitigar la Crisis Climática"},"133011602300000001665",1,80229049,"JAIME CASTIBLANCO MATIZ","Persona Natural",null,null,null,8100000,null,null,null,8100000,6240000,44419,44425,44562,135,null,null,null,null,null,null,null,null,"X",null,0.77037037037037037]
[1,57,2021,"FDLRUU-CD-057-2021","https://community.secop.gov.co/Public/Tendering/OpportunityDetail/Index?noticeUID=CO1.NTC.1743476&isFromPublicArea=True&isModal=False\n","Contratos de prestación de servicios profesionales y de apoyo a la gestión","Contratación directa","Prestación de servicios profesionales y de apoyo a la gestión, o para la ejecución de trabajos artísticos que sólo puedan encomendarse a determinadas personas naturales;","EL CONTRATISTA SE OBLIGA A PRESTAR SUS SERVICIOS DE AUXILIAR ADMINISTRATIVO A LA JUNTA ADMINISTRADORA LOCAL DE LA ALCALDÍA LOCAL DE RAFAEL URIBE URIBE”  ","Inversión","Un Nuevo Contrato Social y Ambiental para la Bogotá del Siglo XXI",57,{"$f":"IF(ISERROR(VLOOKUP(L214,Proposito_programa!$C$2:$E$59,2,FALSE)),\" \",VLOOKUP(L214,Proposito_programa!$C$2:$E$59,2,FALSE))","v":"Gestión pública local"},{"$f":"IF(ISERROR(VLOOKUP(L214,Proposito_programa!$C$2:$E$59,3,FALSE)),\" \",VLOOKUP(L214,Proposito_programa!$C$2:$E$59,3,FALSE))","v":"Propósito 5: Construir Bogotá - Región con gobierno abierto, transparente y ciudadanía consciente"},"133011605570000001697",1,80071371,"JAIME ALEXANDER BARBOSA VILLALBA ","Persona Natural",null,null,null,26000000,null,1,2860000,28860000,25220000,44236,44237,44573,300,1,33,null,null,null,null,null,null,"X",null,0.87387387387387383]
[1,205,2021,"FDLRUU-CD-205-2021","https://community.secop.gov.co/Public/Tendering/OpportunityDetail/Index?noticeUID=CO1.NTC.1865885&isFromPublicArea=True&isModal=False\n","Contratos de prestación de servicios profesionales y de apoyo a la gestión","Contratación directa","Prestación de servicios profesionales y de apoyo a la gestión, o para la ejecución de trabajos artísticos que sólo puedan encomendarse a determinadas personas naturales;","PRESTAR LOS SERVICIOS COMO OPERADOR DE MAQUINARIA AMARILLA, AL SERVICIO DE LA ADMINISTRACION LOCAL DE RAFAEL URIBE URIBE EN LA REALIZACIÓN DE LA EJECUCION DEL PROYECTO NO. 1685 MOVILIDAD MULTIMODAL, INCLUYENTE Y SOSTENIBLE EN RAFAEL URIBE URIBE, ASÍ COMO APOYAR LAS DEMÁS ACTIVIDADES QUE SE GENEREN EN EL ÁREA DE GESTIÓN DEL DESARROLLO CON RELACION AL PROYECTO EN MENCION","Inversión","Un Nuevo Contrato Social y Ambiental para la Bogotá del Siglo XXI",57,{"$f":"IF(ISERROR(VLOOKUP(L215,Proposito_programa!$C$2:$E$59,2,FALSE)),\" \",VLOOKUP(L215,Proposito_programa!$C$2:$E$59,2,FALSE))","v":"Gestión pública local"},{"$f":"IF(ISERROR(VLOOKUP(L215,Proposito_programa!$C$2:$E$59,3,FALSE)),\" \",VLOOKUP(L215,Proposito_programa!$C$2:$E$59,3,FALSE))","v":"Propósito 5: Construir Bogotá - Región con gobierno abierto, transparente y ciudadanía consciente"},"133011605570000001697",1,1031154746,"JAIME ALEJANDRO QUINTERO MARTINEZ","Persona Natural",null,null,null,26000000,null,null,null,26000000,21320000,44279,44280,44585,300,null,null,null,null,null,null,null,null,"X",null,0.82]
[1,20,2021,"FDLRUU-CD-020-2021-","https://community.secop.gov.co/Public/Tendering/OpportunityDetail/Index?noticeUID=CO1.NTC.1721098&isFromPublicArea=True&isModal=False\n","Contratos de prestación de servicios profesionales y de apoyo a la gestión","Contratación directa","Prestación de servicios profesionales y de apoyo a la gestión, o para la ejecución de trabajos artísticos que sólo puedan encomendarse a determinadas personas naturales;","PRESTAR LOS SERVICIOS PROFESIONALES COMO ABOGADO PARA APOYAR LA GESTIÓN CONTRACTUAL DEL ÁREA GESTIÓN DEL DESARROLLO LOCAL DE LA ALCALDÍA LOCAL DE RAFAEL URIBE URIBE EN LOS DIFERENTES PROCESOS DE SELECCIÓN EN SUS ETAPAS PRECONTRACTUAL, CONTRACTUAL Y POSTCONTRACTUALP","Inversión","Un Nuevo Contrato Social y Ambiental para la Bogotá del Siglo XXI",57,{"$f":"IF(ISERROR(VLOOKUP(L216,Proposito_programa!$C$2:$E$59,2,FALSE)),\" \",VLOOKUP(L216,Proposito_programa!$C$2:$E$59,2,FALSE))","v":"Gestión pública local"},{"$f":"IF(ISERROR(VLOOKUP(L216,Proposito_programa!$C$2:$E$59,3,FALSE)),\" \",VLOOKUP(L216,Proposito_programa!$C$2:$E$59,3,FALSE))","v":"Propósito 5: Construir Bogotá - Región con gobierno abierto, transparente y ciudadanía consciente"},"133011605570000001697",1,1033734844,"IVAN DARIO PACHON BARRETO ","Persona Natural",null,null,null,67000000,null,1,9603333,76603333,67000000,44228,44228,44574,300,1,43,null,null,null,null,null,null,"X",null,0.87463557231902689]
[1,73844,2021,"OC-73844"," https://colombiacompra.gov.co/tienda-virtual-del-estado-colombiano/ordenes-compra/73844","Compraventa de bienes muebles","Selección abreviada","Acuerdo marco de precios ","ELEMENTOS DE BIOSEGURIDAD PARA EL\nMANEJO DE LA EMERGENCIA SANITARIA,\nSOCIAL y ECOLOGICA PRODUCTO DEL COVID19 ALCALDIA LOCAL RAFAEL URIBE URIBE","Funcionamiento","Un Nuevo Contrato Social y Ambiental para la Bogotá del Siglo XXI","No aplica",{"$f":"IF(ISERROR(VLOOKUP(L217,Proposito_programa!$C$2:$E$59,2,FALSE)),\" \",VLOOKUP(L217,Proposito_programa!$C$2:$E$59,2,FALSE))","v":" "},{"$f":"IF(ISERROR(VLOOKUP(L217,Proposito_programa!$C$2:$E$59,3,FALSE)),\" \",VLOOKUP(L217,Proposito_programa!$C$2:$E$59,3,FALSE))","v":" "},"13102020208",1,900167135,"INVERSIONES LA VICTORIA INTERNACIONAL LTDA ","Persona Jurídica",null,null,null,828700,null,null,null,828700,0,44413,44414,44444,30,null,null,null,null,null,null,null,null,"X",null,0]
[1,320,2019,"CI-320-2019","https://community.secop.gov.co/Public/Tendering/OpportunityDetail/Index?noticeUID=CO1.NTC.996014&isFromPublicArea=True&isModal=False","Interventoría","Concurso de méritos","No aplica","REALIZAR LA INTERVENTORÍA TÉCNICA, ADMINISTRATIVA, LEGAL, FINANCIERA, SOCIAL, AMBIENTAL Y DE SEGURIDAD Y SALUD EN EL TRABAJO (SST), DEL CONTRATO DE OBRA PÚBLICA QUE TIENE POR OBJETO: “EJECUTAR LAS OBRAS Y ACTIVIDADES PARA LA CONSERVACIÓN DE LA MALLA VIAL Y ESPACIO PÚBLICO DE LA LOCALIDAD DE RAFAEL URIBE URIBE EN BOGOTÁ, D. C.” DERIVADO DEL PROCESO DE LA LICITACIÓN PUBLICA No. FDLRUU-LP-224-2019","Inversión","Un Nuevo Contrato Social y Ambiental para la Bogotá del Siglo XXI",49,{"$f":"IF(ISERROR(VLOOKUP(L218,Proposito_programa!$C$2:$E$59,2,FALSE)),\" \",VLOOKUP(L218,Proposito_programa!$C$2:$E$59,2,FALSE))","v":"Movilidad segura, sostenible y accesible"},{"$f":"IF(ISERROR(VLOOKUP(L218,Proposito_programa!$C$2:$E$59,3,FALSE)),\" \",VLOOKUP(L218,Proposito_programa!$C$2:$E$59,3,FALSE))","v":"Propósito 4: Hacer de Bogotá Región un modelo de movilidad multimodal, incluyente y sostenible"},"133011604490000001685",1,900107376,"INTERVENTORIA Y CONSTRUCIVILES SAS","Persona Jurídica",null,null,null,null,null,2,245100000,245100000,13782288,44328,44328,44603,660,5,660,null,null,null,null,null,"X",null,null,5.6231285189718483E-2]
[1,286,2021,"FDLRUU-CD-286-2021","https://www.contratos.gov.co/consultas/detalleProceso.do?numConstancia=21-22-29059","Contratos interadministrativos","Contratación directa","Contratos interadministrativos","AUNAR ESFUERZOS, TÉCNICOS, ADMINISTRATIVOS Y FINANCIEROS ENTRE EL IDRD Y LOS FONDOS DE DESARROLLO LOCAL, PARA LA EJECUCIÓN DE LAS LÍNEAS DE INVERSIÓN; FORMACIÓN Y EVENTOS RECREODEPORTIVOS.","Inversión","Un Nuevo Contrato Social y Ambiental para la Bogotá del Siglo XXI",20,{"$f":"IF(ISERROR(VLOOKUP(L219,Proposito_programa!$C$2:$E$59,2,FALSE)),\" \",VLOOKUP(L219,Proposito_programa!$C$2:$E$59,2,FALSE))","v":"Bogotá, referente en cultura, deporte, recreación y actividad física, con parques para el desarrollo y la salud"},{"$f":"IF(ISERROR(VLOOKUP(L219,Proposito_programa!$C$2:$E$59,3,FALSE)),\" \",VLOOKUP(L219,Proposito_programa!$C$2:$E$59,3,FALSE))","v":"Propósito 1: Hacer un nuevo contrato social para incrementar la inclusión social, productiva y política"},"133011601200000001646",1,860061099,"INSTITUTO DISTRITAL DE RECREACION Y DEPORTE- CONVENIO INTERADMINISTRATIVO IDRD CONVENIO MARCO  002590-2021","Persona Jurídica",null,null,null,227201686,null,null,null,227201686,181761349,44439,44460,44651,191,null,null,null,null,null,null,null,"X",null,null,0.80000000088027512]
[1,119,2021,"FDLRUU-CD-119-2021","https://community.secop.gov.co/Public/Tendering/OpportunityDetail/Index?noticeUID=CO1.NTC.1779563&isFromPublicArea=True&isModal=False\n","Contratos de prestación de servicios profesionales y de apoyo a la gestión","Contratación directa","Prestación de servicios profesionales y de apoyo a la gestión, o para la ejecución de trabajos artísticos que sólo puedan encomendarse a determinadas personas naturales;","PRESTAR LOS SERVICIOS PROFESIONALES PARA LA OPERACIÓN, PRESTACIÓN, SEGUIMIENTO Y CUMPLIMIENTO PROCEDIMIENTOS ADMINISTRATIVOS OPERATIVOS Y PROGRAMÁTICOS DEL SERVICIO APOYO ECONÓMICO TIPO C, QUE CONTRIBUYAN A LA GARANTÍA DE LOS DERECHOS DE LA POBLACIÓN MAYOR EN EL MARCO DE LA POLÍTICA PÚBLICA SOCIAL PARA EL ENVEJECIMIENTO Y LA VEJEZ EN EL DISTRITO CAPITAL A CARGO DE LA ALCALDÍA LOCAL RAFAEL URIBE URIBE","Inversión","Un Nuevo Contrato Social y Ambiental para la Bogotá del Siglo XXI",1,{"$f":"IF(ISERROR(VLOOKUP(L220,Proposito_programa!$C$2:$E$59,2,FALSE)),\" \",VLOOKUP(L220,Proposito_programa!$C$2:$E$59,2,FALSE))","v":"Subsidios y transferencias para la equidad"},{"$f":"IF(ISERROR(VLOOKUP(L220,Proposito_programa!$C$2:$E$59,3,FALSE)),\" \",VLOOKUP(L220,Proposito_programa!$C$2:$E$59,3,FALSE))","v":"Propósito 1: Hacer un nuevo contrato social para incrementar la inclusión social, productiva y política"},"133011601010000001636",1,1026277883,"INGRID MAYERLY BOLIVAR PAEZ","Persona Natural",null,null,null,41600000,null,1,14560000,56160000,48360000,44245,44249,44574,240,1,84,null,null,null,null,null,null,"X",null,0.86111111111111116]
[1,7,2021,"FDLRUU-CD-007-2021","https://community.secop.gov.co/Public/Tendering/ContractNoticePhases/View?PPI=CO1.PPI.11734052&isFromPublicArea=True&isModal=False","Contratos de prestación de servicios profesionales y de apoyo a la gestión","Contratación directa","Prestación de servicios profesionales y de apoyo a la gestión, o para la ejecución de trabajos artísticos que sólo puedan encomendarse a determinadas personas naturales;","APOYAR JURÍDICAMENTE LA EJECUCIÓN DE LAS ACCIONES REQUERIDAS PARA LA DEPURACIÓN DE LAS ACTUACIONES ADMISNITRATIVAS QUE CURSAN EN LA ALCALDÍA LOCAL.","Inversión","Un Nuevo Contrato Social y Ambiental para la Bogotá del Siglo XXI",57,{"$f":"IF(ISERROR(VLOOKUP(L221,Proposito_programa!$C$2:$E$59,2,FALSE)),\" \",VLOOKUP(L221,Proposito_programa!$C$2:$E$59,2,FALSE))","v":"Gestión pública local"},{"$f":"IF(ISERROR(VLOOKUP(L221,Proposito_programa!$C$2:$E$59,3,FALSE)),\" \",VLOOKUP(L221,Proposito_programa!$C$2:$E$59,3,FALSE))","v":"Propósito 5: Construir Bogotá - Región con gobierno abierto, transparente y ciudadanía consciente"},"133011605570000001698",1,1090394855,"INÉS\nANDREA PÉREZ MANTILLA.","Persona Natural",null,null,null,31200000,null,1,15600000,46800000,41600000,44225,44228,44500,180,1,90,79455376,"FELIPE ANDRES BARRAGAN MANTINEZ ",44439,10400000,null,null,"X",null,0.88888888888888884]
[1,278,2021,"FDLRUU-CD-278-2021","https://community.secop.gov.co/Public/Tendering/OpportunityDetail/Index?noticeUID=CO1.NTC.2201005&isFromPublicArea=True&isModal=False\n","Contratos de prestación de servicios profesionales y de apoyo a la gestión","Contratación directa","Prestación de servicios profesionales y de apoyo a la gestión, o para la ejecución de trabajos artísticos que sólo puedan encomendarse a determinadas personas naturales;","PRESTAR SERVICIOS PROFESIONALES PARA APOYAR EL DESARROLLO, IMPLEMENTACIÓN Y SEGUIMIENTO DEL PROYECTO 1681 CULTURA CIUDADANA Y USO ÓPTIMO DEL ESPACIO PÚBLICO EN LA LOCALIDAD RAFAEL URIBE URIBE ","Inversión","Un Nuevo Contrato Social y Ambiental para la Bogotá del Siglo XXI",45,{"$f":"IF(ISERROR(VLOOKUP(L222,Proposito_programa!$C$2:$E$59,2,FALSE)),\" \",VLOOKUP(L222,Proposito_programa!$C$2:$E$59,2,FALSE))","v":"Espacio público más seguro y construido colectivamente"},{"$f":"IF(ISERROR(VLOOKUP(L222,Proposito_programa!$C$2:$E$59,3,FALSE)),\" \",VLOOKUP(L222,Proposito_programa!$C$2:$E$59,3,FALSE))","v":"Propósito 3: Inspirar confianza y legitimidad para vivir sin miedo y ser epicentro de cultura ciudadana, paz y reconciliación"},"133011603450000001681",1,1088264048,"INDIRA CRISTINA PORTOCARREÑO OSPINA ","Persona Natural",null,null,null,20800000,null,null,null,20800000,15773333,44434,44439,44560,120,null,null,null,null,null,null,null,null,"X",null,0.75833331730769227]
[1,315,2021,"FDLRUU-LP-288-2021","https://community.secop.gov.co/Public/Tendering/OpportunityDetail/Index?noticeUID=CO1.NTC.2373811&isFromPublicArea=True&isModal=False\n","Obra pública","Licitación pública","No aplica","EJECUTAR A PRECIOS UNITARIOS FIJOS SIN FORMULA DE REAJUSTE LA CONSTRUCCIÓN DE PARQUES VECINALES Y DE BOLSILLO, EN LA LOCALIDAD DE RAFAEL URIBE URIBE, DE CONFORMIDAD CON LOS ESTUDIOS Y DISEÑOS, ANEXOS TECNICOS Y DEMÁS DOCUMENTOS QUE HACEN PARTE INTEGRAL DEL PROCESO DEL CONTRATO.","Inversión","Un Nuevo Contrato Social y Ambiental para la Bogotá del Siglo XXI",33,{"$f":"IF(ISERROR(VLOOKUP(L223,Proposito_programa!$C$2:$E$59,2,FALSE)),\" \",VLOOKUP(L223,Proposito_programa!$C$2:$E$59,2,FALSE))","v":"Más árboles y más y mejor espacio público"},{"$f":"IF(ISERROR(VLOOKUP(L223,Proposito_programa!$C$2:$E$59,3,FALSE)),\" \",VLOOKUP(L223,Proposito_programa!$C$2:$E$59,3,FALSE))","v":"Propósito 2 : Cambiar Nuestros Hábitos de Vida para Reverdecer a Bogotá y Adaptarnos y Mitigar la Crisis Climática"},"133011602330000001670",2,800104214,"INCITECO S.A.S.","Persona Jurídica",null,null,null,907000000,null,null,null,907000000,0,44539,"CELEBRADO SIN INICIAR","CELEBRADO SIN INICIAR",150,null,null,null,null,null,null,"X",null,null,null,0]
[1,261,2021,"FDLRUU-CD-261-2021","https://community.secop.gov.co/Public/Tendering/OpportunityDetail/Index?noticeUID=CO1.NTC.2165067&isFromPublicArea=True&isModal=False","Contratos de prestación de servicios profesionales y de apoyo a la gestión","Contratación directa","Prestación de servicios profesionales y de apoyo a la gestión, o para la ejecución de trabajos artísticos que sólo puedan encomendarse a determinadas personas naturales;","PRESTAR SUS SERVICIOS ASISTENCIALES PARA LA GESTIÓN DEL RIESGO, EN EL MARCO DE LOS VIGÍAS DEL RIESGO DE LA LOCALIDAD DE RAFAEL URIBE URIBE","Inversión","Un Nuevo Contrato Social y Ambiental para la Bogotá del Siglo XXI",30,{"$f":"IF(ISERROR(VLOOKUP(L224,Proposito_programa!$C$2:$E$59,2,FALSE)),\" \",VLOOKUP(L224,Proposito_programa!$C$2:$E$59,2,FALSE))","v":"Eficiencia en la atención de emergencias"},{"$f":"IF(ISERROR(VLOOKUP(L224,Proposito_programa!$C$2:$E$59,3,FALSE)),\" \",VLOOKUP(L224,Proposito_programa!$C$2:$E$59,3,FALSE))","v":"Propósito 2 : Cambiar Nuestros Hábitos de Vida para Reverdecer a Bogotá y Adaptarnos y Mitigar la Crisis Climática"},"133011602300000001665",1,1000785337,"HILDA JULIANA SOLORZANO RODRIGUEZ","Persona Natural",null,null,null,8100000,null,null,null,8100000,5520000,44419,44425,44518,135,null,null,null,null,null,null,null,null,null,"X",0.68148148148148147]
[1,43,2021,"FDLRUU-CD-043-2021","https://community.secop.gov.co/Public/Tendering/OpportunityDetail/Index?noticeUID=CO1.NTC.1729606&isFromPublicArea=True&isModal=False\n","Contratos de prestación de servicios profesionales y de apoyo a la gestión","Contratación directa","Prestación de servicios profesionales y de apoyo a la gestión, o para la ejecución de trabajos artísticos que sólo puedan encomendarse a determinadas personas naturales;","APOYAR TÉCNICAMENTE LAS DISTINTAS ETAPAS DE LOS PROCESOS DE COMPETENCIA DE LA ALCALDÍA LOCAL PARA LA DEPURACIÓN DE LAS ACTUACIONES ADMINISTRATIVAS","Inversión","Un Nuevo Contrato Social y Ambiental para la Bogotá del Siglo XXI",57,{"$f":"IF(ISERROR(VLOOKUP(L225,Proposito_programa!$C$2:$E$59,2,FALSE)),\" \",VLOOKUP(L225,Proposito_programa!$C$2:$E$59,2,FALSE))","v":"Gestión pública local"},{"$f":"IF(ISERROR(VLOOKUP(L225,Proposito_programa!$C$2:$E$59,3,FALSE)),\" \",VLOOKUP(L225,Proposito_programa!$C$2:$E$59,3,FALSE))","v":"Propósito 5: Construir Bogotá - Región con gobierno abierto, transparente y ciudadanía consciente"},"133011605570000001698",1,1023886101,"HEYDY MILENA RAMIREZ CARDENAS","Persona Natural",null,null,null,31200000,null,1,15600000,46800000,46800000,44231,44232,44504,180,1,90,null,null,null,null,null,null,"X",null,1]
[1,135,2021,"FDLRUU-CD-135-2021","https://community.secop.gov.co/Public/Tendering/OpportunityDetail/Index?noticeUID=CO1.NTC.1791628&isFromPublicArea=True&isModal=False\n","Contratos de prestación de servicios profesionales y de apoyo a la gestión","Contratación directa","Prestación de servicios profesionales y de apoyo a la gestión, o para la ejecución de trabajos artísticos que sólo puedan encomendarse a determinadas personas naturales;","APOYAR JURIDICAMENTE EN EL ACOMPAÑAMIENTO A LOS OPERATIVOS Y JORNADAS RELACIONADAS CON ASUNTOS DE SEGURIDAD CIUDADANA, CONVIVENCIA Y PREVENCIÓN DE CONFLICTIVIDADES PARA LA INSPECCION VIGILANCIA Y CONTROL DEL AREA DE GESTION POLICIVA DE LA ALCALDIA LOCAL DE RAFAEL URIBE URIBE","Inversión","Un Nuevo Contrato Social y Ambiental para la Bogotá del Siglo XXI",57,{"$f":"IF(ISERROR(VLOOKUP(L226,Proposito_programa!$C$2:$E$59,2,FALSE)),\" \",VLOOKUP(L226,Proposito_programa!$C$2:$E$59,2,FALSE))","v":"Gestión pública local"},{"$f":"IF(ISERROR(VLOOKUP(L226,Proposito_programa!$C$2:$E$59,3,FALSE)),\" \",VLOOKUP(L226,Proposito_programa!$C$2:$E$59,3,FALSE))","v":"Propósito 5: Construir Bogotá - Región con gobierno abierto, transparente y ciudadanía consciente"},"133011605570000001698",1,79650934,"HERNAN FABIO PALMAR CONTRERAS ","Persona Natural",null,null,null,52000000,null,null,null,52000000,46800000,44251,44256,44561,300,null,null,null,null,null,null,null,null,"X",null,0.9]
[1,1,2021,"FDLRUU-CD-001-2021","https://community.secop.gov.co/Public/Tendering/OpportunityDetail/Index?noticeUID=CO1.NTC.1685298&isFromPublicArea=True&isModal=False\n","Contratos de prestación de servicios profesionales y de apoyo a la gestión","Contratación directa","Prestación de servicios profesionales y de apoyo a la gestión, o para la ejecución de trabajos artísticos que sólo puedan encomendarse a determinadas personas naturales;","PRESTAR LOS SERVICIOS PROFESIONALES PARA APOYAR EL SEGUIMIENTO Y APOYO A LA SUPERVISION DE LOS PROYECTOS DE PARQUES SOBRE LAS METAS ESTABLECIDAS EN EL PLAN DE DESARROLLO LOCAL","Inversión","Un Nuevo Contrato Social y Ambiental para la Bogotá del Siglo XXI",57,{"$f":"IF(ISERROR(VLOOKUP(L227,Proposito_programa!$C$2:$E$59,2,FALSE)),\" \",VLOOKUP(L227,Proposito_programa!$C$2:$E$59,2,FALSE))","v":"Gestión pública local"},{"$f":"IF(ISERROR(VLOOKUP(L227,Proposito_programa!$C$2:$E$59,3,FALSE)),\" \",VLOOKUP(L227,Proposito_programa!$C$2:$E$59,3,FALSE))","v":"Propósito 5: Construir Bogotá - Región con gobierno abierto, transparente y ciudadanía consciente"},"133011605570000001697",1,79594955,"HECTOR ENRIQUE  ERIRA MORENO","Persona Natural",null,null,null,67000000,null,1,10050000,77050000,67446667,44224,44225,44574,300,1,45,null,null,null,null,null,null,"X",null,0.87536232316677487]
[1,283,2021,"FLDRUU-CD-283-2021","https://community.secop.gov.co/Public/Tendering/OpportunityDetail/Index?noticeUID=CO1.NTC.2221781&isFromPublicArea=True&isModal=False\n","Contratos de prestación de servicios profesionales y de apoyo a la gestión","Contratación directa","Prestación de servicios profesionales y de apoyo a la gestión, o para la ejecución de trabajos artísticos que sólo puedan encomendarse a determinadas personas naturales;","PRESTAR SERVICIOS PROFESIONALES PARA REALIZACIÓN DE ACUERDOS QUE PROMUEVAN LA CONVIVENCIA ARMÓNICA ENTRE LA CIUDADANÍA Y LOS VENDEDORES INFORMALES Y ESTACIONARIOS, ORIENTADOS A LA SOLUCIÓN DE LOS CONFLICTOS DERIVADOS DEL USO DEL ESPACIO PÚBLICO CONTEMPLADOS EN EL PROYECTO DE INVERSIÓN 1681 CULTURA CIUDADANA Y USO OPTIMO DEL ESPACIO PUBLICO EN RAFAEL URIBE URIBE","Inversión","Un Nuevo Contrato Social y Ambiental para la Bogotá del Siglo XXI",45,{"$f":"IF(ISERROR(VLOOKUP(L228,Proposito_programa!$C$2:$E$59,2,FALSE)),\" \",VLOOKUP(L228,Proposito_programa!$C$2:$E$59,2,FALSE))","v":"Espacio público más seguro y construido colectivamente"},{"$f":"IF(ISERROR(VLOOKUP(L228,Proposito_programa!$C$2:$E$59,3,FALSE)),\" \",VLOOKUP(L228,Proposito_programa!$C$2:$E$59,3,FALSE))","v":"Propósito 3: Inspirar confianza y legitimidad para vivir sin miedo y ser epicentro de cultura ciudadana, paz y reconciliación"},"133011603450000001681",1,79656191,"HECTOR ADOLFO CASTIBLANCO RAMIREZ ","Persona Natural",null,null,null,20000000,null,null,null,20000000,13000000,44442,44452,44573,120,null,null,null,null,null,null,null,null,"X",null,0.65]
[1,172,2021,"FDLRUU-CD-150-2021","https://community.secop.gov.co/Public/Tendering/OpportunityDetail/Index?noticeUID=CO1.NTC.1800149&isFromPublicArea=True&isModal=False\n","Contratos de prestación de servicios profesionales y de apoyo a la gestión","Contratación directa","Prestación de servicios profesionales y de apoyo a la gestión, o para la ejecución de trabajos artísticos que sólo puedan encomendarse a determinadas personas naturales;","EL CONTRATISTA SE OBLIGA CON EL FONDO DE DESARROLLO LOCAL DE RAFAEL URIBE URIBE A PRESTAR SUS SERVICIOS DE APOYO A LA GESTION LOCAL Y TERRITORIAL DE LOS TEMAS DE SEGURIDAD Y CONVIVENCIA CIUDADANA PARA LA ALCALDIA LOCAL DE RAFAEL URIBE URIBE","Inversión","Un Nuevo Contrato Social y Ambiental para la Bogotá del Siglo XXI",43,{"$f":"IF(ISERROR(VLOOKUP(L229,Proposito_programa!$C$2:$E$59,2,FALSE)),\" \",VLOOKUP(L229,Proposito_programa!$C$2:$E$59,2,FALSE))","v":"Cultura ciudadana para la confianza, la convivencia y la participación desde la vida cotidiana"},{"$f":"IF(ISERROR(VLOOKUP(L229,Proposito_programa!$C$2:$E$59,3,FALSE)),\" \",VLOOKUP(L229,Proposito_programa!$C$2:$E$59,3,FALSE))","v":"Propósito 3: Inspirar confianza y legitimidad para vivir sin miedo y ser epicentro de cultura ciudadana, paz y reconciliación"},"133011603430000001680",1,80808223,"HAYDUK RODRIGUEZ UBAQUE","Persona Natural",null,null,null,19800000,null,1,3080000,22880000,19726667,44253,44257,44574,270,1,42,null,null,null,null,null,null,"X",null,0.86217950174825175]
[1,83980,2021,"OC-83980","https://colombiacompra.gov.co/tienda-virtual-del-estado-colombiano/ordenes-compra/83980","Compraventa de bienes muebles","Selección abreviada","Acuerdo marco de precios ","ADQUISICION DE EQUIPOS DE COMPUTO PARA LAS JUNTAS DE ACCION COMUNAL DE LA LOCAIDAD DE RAFAEL URIBE URIBE","Inversión","Un Nuevo Contrato Social y Ambiental para la Bogotá del Siglo XXI",55,{"$f":"IF(ISERROR(VLOOKUP(L230,Proposito_programa!$C$2:$E$59,2,FALSE)),\" \",VLOOKUP(L230,Proposito_programa!$C$2:$E$59,2,FALSE))","v":"Fortalecimiento de cultura ciudadana y su institucionalidad"},{"$f":"IF(ISERROR(VLOOKUP(L230,Proposito_programa!$C$2:$E$59,3,FALSE)),\" \",VLOOKUP(L230,Proposito_programa!$C$2:$E$59,3,FALSE))","v":"Propósito 5: Construir Bogotá - Región con gobierno abierto, transparente y ciudadanía consciente"},"133011605550000001689",1,804000673,"HARDWARE ASESORIAS SOFTWARE LTDA","Persona Jurídica",null,null,null,32216394,null,null,null,32216394,0,44560,44560,44592,32,null,null,null,null,null,null,null,"X",null,null,0]
[1,162,2021,"FDLRUU-CD-150-2021","https://community.secop.gov.co/Public/Tendering/OpportunityDetail/Index?noticeUID=CO1.NTC.1800149&isFromPublicArea=True&isModal=False\n","Contratos de prestación de servicios profesionales y de apoyo a la gestión","Contratación directa","Prestación de servicios profesionales y de apoyo a la gestión, o para la ejecución de trabajos artísticos que sólo puedan encomendarse a determinadas personas naturales;","EL CONTRATISTA SE OBLIGA CON EL FONDO DE DESARROLLO LOCAL DE RAFAEL URIBE URIBE A PRESTAR SUS SERVICIOS DE APOYO A LA GESTION LOCAL Y TERRITORIAL DE LOS TEMAS DE SEGURIDAD Y CONVIVENCIA CIUDADANA PARA LA ALCALDIA LOCAL DE RAFAEL URIBE URIBE","Inversión","Un Nuevo Contrato Social y Ambiental para la Bogotá del Siglo XXI",43,{"$f":"IF(ISERROR(VLOOKUP(L231,Proposito_programa!$C$2:$E$59,2,FALSE)),\" \",VLOOKUP(L231,Proposito_programa!$C$2:$E$59,2,FALSE))","v":"Cultura ciudadana para la confianza, la convivencia y la participación desde la vida cotidiana"},{"$f":"IF(ISERROR(VLOOKUP(L231,Proposito_programa!$C$2:$E$59,3,FALSE)),\" \",VLOOKUP(L231,Proposito_programa!$C$2:$E$59,3,FALSE))","v":"Propósito 3: Inspirar confianza y legitimidad para vivir sin miedo y ser epicentro de cultura ciudadana, paz y reconciliación"},"133011603430000001680",1,80029346,"GUSTAVO ALEXANDER CAMARGO REYES","Persona Natural",null,null,null,19800000,null,1,3080000,22880000,19726667,44253,44257,44574,270,1,42,null,null,null,null,null,null,"X",null,0.86217950174825175]
[1,161,2021,"FDLRUU-CD-150-2021","https://community.secop.gov.co/Public/Tendering/OpportunityDetail/Index?noticeUID=CO1.NTC.1800149&isFromPublicArea=True&isModal=False\n","Contratos de prestación de servicios profesionales y de apoyo a la gestión","Contratación directa","Prestación de servicios profesionales y de apoyo a la gestión, o para la ejecución de trabajos artísticos que sólo puedan encomendarse a determinadas personas naturales;","EL CONTRATISTA SE OBLIGA CON EL FONDO DE DESARROLLO LOCAL DE RAFAEL URIBE URIBE A PRESTAR SUS SERVICIOS DE APOYO A LA GESTION LOCAL Y TERRITORIAL DE LOS TEMAS DE SEGURIDAD Y CONVIVENCIA CIUDADANA PARA LA ALCALDIA LOCAL DE RAFAEL URIBE URIBE","Inversión","Un Nuevo Contrato Social y Ambiental para la Bogotá del Siglo XXI",43,{"$f":"IF(ISERROR(VLOOKUP(L232,Proposito_programa!$C$2:$E$59,2,FALSE)),\" \",VLOOKUP(L232,Proposito_programa!$C$2:$E$59,2,FALSE))","v":"Cultura ciudadana para la confianza, la convivencia y la participación desde la vida cotidiana"},{"$f":"IF(ISERROR(VLOOKUP(L232,Proposito_programa!$C$2:$E$59,3,FALSE)),\" \",VLOOKUP(L232,Proposito_programa!$C$2:$E$59,3,FALSE))","v":"Propósito 3: Inspirar confianza y legitimidad para vivir sin miedo y ser epicentro de cultura ciudadana, paz y reconciliación"},"133011603430000001680",1,2970813,"GUILLERMO MORENO","Persona Natural",null,null,null,19800000,null,1,3153333,22953333,19800000,44253,44256,44574,270,1,43,79263823,"CARLOS ARTURO SULVARAN",44473,4033333,null,null,"X",null,0.86261982083386324]
[1,223,2021,"FDLRUU-CD-223.2021","https://community.secop.gov.co/Public/Tendering/OpportunityDetail/Index?noticeUID=CO1.NTC.1986437&isFromPublicArea=True&isModal=False\n","Contratos de prestación de servicios profesionales y de apoyo a la gestión","Contratación directa","Prestación de servicios profesionales y de apoyo a la gestión, o para la ejecución de trabajos artísticos que sólo puedan encomendarse a determinadas personas naturales;","APOYAR TÉCNICAMENTE LAS DISTINTAS ETAPAS DE LOS PROCESOS DE COMPETENCIA DE LA ALCALDÍA LOCAL PARA LA DEPURACIÓN DE LAS ACTUACIONES ADMINISTRATIVAS","Inversión","Un Nuevo Contrato Social y Ambiental para la Bogotá del Siglo XXI",57,{"$f":"IF(ISERROR(VLOOKUP(L233,Proposito_programa!$C$2:$E$59,2,FALSE)),\" \",VLOOKUP(L233,Proposito_programa!$C$2:$E$59,2,FALSE))","v":"Gestión pública local"},{"$f":"IF(ISERROR(VLOOKUP(L233,Proposito_programa!$C$2:$E$59,3,FALSE)),\" \",VLOOKUP(L233,Proposito_programa!$C$2:$E$59,3,FALSE))","v":"Propósito 5: Construir Bogotá - Región con gobierno abierto, transparente y ciudadanía consciente"},"133011605570000001698",1,79041777,"GUILLERMO FORERO APONTE","Persona Natural",null,null,null,31200000,null,null,null,31200000,0,44337,44343,44526,180,null,null,null,null,null,null,null,null,"X",null,0]
[1,51,2021,"FDLRUU-CD-051-2021","https://community.secop.gov.co/Public/Tendering/OpportunityDetail/Index?noticeUID=CO1.NTC.1738845&isFromPublicArea=True&isModal=False\n","Contratos de prestación de servicios profesionales y de apoyo a la gestión","Contratación directa","Prestación de servicios profesionales y de apoyo a la gestión, o para la ejecución de trabajos artísticos que sólo puedan encomendarse a determinadas personas naturales;","PRESTAR LOS SERVICIOS PROFESIONALES COMO ABOGADO PARA APOYAR LA GESTIÓN CONTRACTUAL DEL ÁREA GESTIÓN DEL DESARROLLO LOCAL DE LA ALCALDÍA LOCAL DE RAFAEL URIBE URIBE EN LOS DIFERENTES PROCESOS DE SELECCIÓN EN SUS ETAPAS PRECONTRACTUAL, CONTRACTUAL Y POSTCONTRACTUAL","Inversión","Un Nuevo Contrato Social y Ambiental para la Bogotá del Siglo XXI",57,{"$f":"IF(ISERROR(VLOOKUP(L234,Proposito_programa!$C$2:$E$59,2,FALSE)),\" \",VLOOKUP(L234,Proposito_programa!$C$2:$E$59,2,FALSE))","v":"Gestión pública local"},{"$f":"IF(ISERROR(VLOOKUP(L234,Proposito_programa!$C$2:$E$59,3,FALSE)),\" \",VLOOKUP(L234,Proposito_programa!$C$2:$E$59,3,FALSE))","v":"Propósito 5: Construir Bogotá - Región con gobierno abierto, transparente y ciudadanía consciente"},"133011605570000001697",1,1053329645,"GUILLERMO ANDRES ROJAS FORERO","Persona Natural",null,null,null,67000000,null,null,null,67000000,44443333,44236,44239,44444,300,null,null,null,null,null,null,null,null,null,"X",0.66333332835820891]
[1,310,2021,"FDLRUU-MC-305-2021","https://community.secop.gov.co/Public/Tendering/OpportunityDetail/Index?noticeUID=CO1.NTC.2360412&isFromPublicArea=True&isModal=False\n","Suministro","Contratación mínima cuantia","No aplica","SUMINISTRO DE ELEMENTOS Y MATERIALES DE FERRETERIA EN GENERAL A MONTO AGOTABLE PARA EL MANTENIMIENTO, LAS ADECUACIONES O LAS MEJORAS DE TIPO LOCATIVO DE LOS BIENES MUEBLES E INMUEBLES DE PROPIEDAD DEL FONDO DE DESARROLLO LOCAL DE RAFAEL URIBE","Funcionamiento","Un Nuevo Contrato Social y Ambiental para la Bogotá del Siglo XXI","No aplica",{"$f":"IF(ISERROR(VLOOKUP(L235,Proposito_programa!$C$2:$E$59,2,FALSE)),\" \",VLOOKUP(L235,Proposito_programa!$C$2:$E$59,2,FALSE))","v":" "},{"$f":"IF(ISERROR(VLOOKUP(L235,Proposito_programa!$C$2:$E$59,3,FALSE)),\" \",VLOOKUP(L235,Proposito_programa!$C$2:$E$59,3,FALSE))","v":" "},"1310201010106 -1310201010109-1310202010205-1310202010301-1310202010302",7,901044822,"GRUPO EMPRESARIAL LCS S.A.S","Persona Jurídica",null,null,null,18500000,null,null,null,18500000,0,44523,44529,44893,360,null,null,null,null,null,null,null,"X",null,null,0]
[1,83979,2021,"OC-83979","https://colombiacompra.gov.co/tienda-virtual-del-estado-colombiano/ordenes-compra/83979","Compraventa de bienes muebles","Selección abreviada","Acuerdo marco de precios ","ADQUISICION DE EQUIPOS DE IMPRESORAS PARA LAS JUNTAS DE ACCION COMUNAL DE LA LOCAIDAD DE RAFAEL URIBE URIBE","Inversión","Un Nuevo Contrato Social y Ambiental para la Bogotá del Siglo XXI",55,{"$f":"IF(ISERROR(VLOOKUP(L236,Proposito_programa!$C$2:$E$59,2,FALSE)),\" \",VLOOKUP(L236,Proposito_programa!$C$2:$E$59,2,FALSE))","v":"Fortalecimiento de cultura ciudadana y su institucionalidad"},{"$f":"IF(ISERROR(VLOOKUP(L236,Proposito_programa!$C$2:$E$59,3,FALSE)),\" \",VLOOKUP(L236,Proposito_programa!$C$2:$E$59,3,FALSE))","v":"Propósito 5: Construir Bogotá - Región con gobierno abierto, transparente y ciudadanía consciente"},"133011605550000001689",1,900564459,"GRUPO EMPRESARIAL CREAR DE COLOMBIA S A S","Persona Jurídica",null,null,null,13201181,null,null,null,13201181,0,44560,44560,44591,30,null,null,null,null,null,null,null,"X",null,null,0]
[1,82202,2021,"OC-82202","https://colombiacompra.gov.co/tienda-virtual-del-estado-colombiano/ordenes-compra/82202","Suministro","Selección abreviada","Acuerdo marco de precios ","CONTRATAR SUMINISTRO DE COMBUSTIBLE A MONTO AGOTABLE DE GASOLINA CORRIENTE Y ACPM PARA EL PARQUE AUTOMOTOR (VEHICULOS LIVIANOS Y MAQUINARIA AMARILLA) A CARGO DEL FONDO DE DESARROLLO LOCAL DE RAFAEL URIBE URIBE A TRAVES DEL ACUERDO MARCO DE PRECIOS DE SUMINISTRO DE COMBUSTIBLE CON SISTEMA DE CONTROL EDS EN BOGOTA CELEBRADAS ENTRE COLOMBIA COMPRA EFICIENTE Y DISTRACOM S.A., GLOBO LLANTAS LTDA., GRUPO EDS AUTOGAS S.A.S. ORGANIZACIÓN TERPEL S.A., DISTRIBUIDORA NACIONAL DE COMBUSTIBLE LTDA., SODEXO SERVICIOS DE BENEFICIOS E INCENTIVOS COLOMBIA S.A. Y BIG PASS S.A.S””","Inversión","Un Nuevo Contrato Social y Ambiental para la Bogotá del Siglo XXI",49,{"$f":"IF(ISERROR(VLOOKUP(L237,Proposito_programa!$C$2:$E$59,2,FALSE)),\" \",VLOOKUP(L237,Proposito_programa!$C$2:$E$59,2,FALSE))","v":"Movilidad segura, sostenible y accesible"},{"$f":"IF(ISERROR(VLOOKUP(L237,Proposito_programa!$C$2:$E$59,3,FALSE)),\" \",VLOOKUP(L237,Proposito_programa!$C$2:$E$59,3,FALSE))","v":"Propósito 4: Hacer de Bogotá Región un modelo de movilidad multimodal, incluyente y sostenible"},"133011604490000001685",1,900459737,"GRUPO EDS AUTOGAS S.A.S.","Persona Jurídica",null,null,null,11500000,null,null,null,11500000,0,44539,44539,44721,180,null,null,null,null,null,null,null,"X",null,null,0]
[0,82202,2021,"OC-82202","https://colombiacompra.gov.co/tienda-virtual-del-estado-colombiano/ordenes-compra/82202","Suministro","Selección abreviada","Acuerdo marco de precios ","CONTRATAR SUMINISTRO DE COMBUSTIBLE A MONTO AGOTABLE DE GASOLINA CORRIENTE Y ACPM PARA EL PARQUE AUTOMOTOR (VEHICULOS LIVIANOS Y MAQUINARIA AMARILLA) A CARGO DEL FONDO DE DESARROLLO LOCAL DE RAFAEL URIBE URIBE A TRAVES DEL ACUERDO MARCO DE PRECIOS DE SUMINISTRO DE COMBUSTIBLE CON SISTEMA DE CONTROL EDS EN BOGOTA CELEBRADAS ENTRE COLOMBIA COMPRA EFICIENTE Y DISTRACOM S.A., GLOBO LLANTAS LTDA., GRUPO EDS AUTOGAS S.A.S. ORGANIZACIÓN TERPEL S.A., DISTRIBUIDORA NACIONAL DE COMBUSTIBLE LTDA., SODEXO SERVICIOS DE BENEFICIOS E INCENTIVOS COLOMBIA S.A. Y BIG PASS S.A.S””","Funcionamiento","Un Nuevo Contrato Social y Ambiental para la Bogotá del Siglo XXI","No aplica",{"$f":"IF(ISERROR(VLOOKUP(L238,Proposito_programa!$C$2:$E$59,2,FALSE)),\" \",VLOOKUP(L238,Proposito_programa!$C$2:$E$59,2,FALSE))","v":" "},{"$f":"IF(ISERROR(VLOOKUP(L238,Proposito_programa!$C$2:$E$59,3,FALSE)),\" \",VLOOKUP(L238,Proposito_programa!$C$2:$E$59,3,FALSE))","v":" "},"1310202010203",1,900459737,"GRUPO EDS AUTOGAS S.A.S.","Persona Jurídica",null,null,null,12000000,null,null,null,12000000,0,44539,44539,44721,180,null,null,null,null,null,null,null,"X",null,null,0]
[1,219,2018,31487,"https://colombiacompra.gov.co/tienda-virtual-del-estado-colombiano/ordenes-compra/?number_order=31487&state=&entity=&tool=&date_to&date_from","Suministro","Selección abreviada","Acuerdo marco de precios ","Contratar el suministro de combustible a monto agotable de gasolina corriente y acpm para el parque automotor (vehiculos livianos y maquinaria amarilla) a cargo del fondo de Desarrollo Local de Rafel Uribe Uribe a traves del acuerdo marco de precios suministro de combustible con sistema de control EDS en Bogota, celebradas entre Colombia Compra Eficiente y Distracom S:A Globollantas Ltda, Grupo EDS Autogas SAS , Organizacion Terpel  SA.A, Distribuidora Nacional de Combustible Ltda, Sodexo Servicios de beneficios e incentivos Colombia S.A y Big Pass S.A.S ","Funcionamiento","Un Nuevo Contrato Social y Ambiental para la Bogotá del Siglo XXI","No aplica",{"$f":"IF(ISERROR(VLOOKUP(L239,Proposito_programa!$C$2:$E$59,2,FALSE)),\" \",VLOOKUP(L239,Proposito_programa!$C$2:$E$59,2,FALSE))","v":" "},{"$f":"IF(ISERROR(VLOOKUP(L239,Proposito_programa!$C$2:$E$59,3,FALSE)),\" \",VLOOKUP(L239,Proposito_programa!$C$2:$E$59,3,FALSE))","v":" "},"1310202010203",1,900459737,"GRUPO EDS AUTOGAS S.A.S","Persona Jurídica",null,null,null,null,null,1,2000000,2000000,230186,44373,44373,44530,780,2,180,null,null,null,null,null,null,"X",null,0.115093]
[1,163,2021,"FDLRUU-CD-150-2021","https://community.secop.gov.co/Public/Tendering/OpportunityDetail/Index?noticeUID=CO1.NTC.1800149&isFromPublicArea=True&isModal=False\n","Contratos de prestación de servicios profesionales y de apoyo a la gestión","Contratación directa","Prestación de servicios profesionales y de apoyo a la gestión, o para la ejecución de trabajos artísticos que sólo puedan encomendarse a determinadas personas naturales;","EL CONTRATISTA SE OBLIGA CON EL FONDO DE DESARROLLO LOCAL DE RAFAEL URIBE URIBE A PRESTAR SUS SERVICIOS DE APOYO A LA GESTION LOCAL Y TERRITORIAL DE LOS TEMAS DE SEGURIDAD Y CONVIVENCIA CIUDADANA PARA LA ALCALDIA LOCAL DE RAFAEL URIBE URIBE","Inversión","Un Nuevo Contrato Social y Ambiental para la Bogotá del Siglo XXI",43,{"$f":"IF(ISERROR(VLOOKUP(L240,Proposito_programa!$C$2:$E$59,2,FALSE)),\" \",VLOOKUP(L240,Proposito_programa!$C$2:$E$59,2,FALSE))","v":"Cultura ciudadana para la confianza, la convivencia y la participación desde la vida cotidiana"},{"$f":"IF(ISERROR(VLOOKUP(L240,Proposito_programa!$C$2:$E$59,3,FALSE)),\" \",VLOOKUP(L240,Proposito_programa!$C$2:$E$59,3,FALSE))","v":"Propósito 3: Inspirar confianza y legitimidad para vivir sin miedo y ser epicentro de cultura ciudadana, paz y reconciliación"},"133011603430000001680",1,52538269,"GLORIA YISED RINCON","Persona Natural",null,null,null,19800000,null,1,3080000,22880000,19726667,44253,44257,44574,270,1,42,null,null,null,null,null,null,"X",null,0.86217950174825175]
[1,259,2021,"FDLRUU-CD-259-2021","https://community.secop.gov.co/Public/Tendering/OpportunityDetail/Index?noticeUID=CO1.NTC.2165619&isFromPublicArea=True&isModal=False\n","Contratos de prestación de servicios profesionales y de apoyo a la gestión","Contratación directa","Prestación de servicios profesionales y de apoyo a la gestión, o para la ejecución de trabajos artísticos que sólo puedan encomendarse a determinadas personas naturales;","PRESTAR SUS SERVICIOS ASISTENCIALES PARA LA GESTIÓN DEL RIESGO, EN EL MARCO DE LOS VIGÍAS DEL RIESGO DE LA LOCALIDAD DE RAFAEL URIBE URIBE","Inversión","Un Nuevo Contrato Social y Ambiental para la Bogotá del Siglo XXI",30,{"$f":"IF(ISERROR(VLOOKUP(L241,Proposito_programa!$C$2:$E$59,2,FALSE)),\" \",VLOOKUP(L241,Proposito_programa!$C$2:$E$59,2,FALSE))","v":"Eficiencia en la atención de emergencias"},{"$f":"IF(ISERROR(VLOOKUP(L241,Proposito_programa!$C$2:$E$59,3,FALSE)),\" \",VLOOKUP(L241,Proposito_programa!$C$2:$E$59,3,FALSE))","v":"Propósito 2 : Cambiar Nuestros Hábitos de Vida para Reverdecer a Bogotá y Adaptarnos y Mitigar la Crisis Climática"},"133011602300000001665",1,52526629,"GINA PAOLA MARTINEZ JIMENEZ","Persona Natural",null,null,null,8100000,null,null,null,8100000,6060000,44419,44428,44565,135,null,null,null,null,null,null,null,null,"X",null,0.74814814814814812]
[null,null,2021,null,null,"Otros gastos","Otros gastos","Otros gastos","FIRMAS ELECTRONICAS","Funcionamiento","Un Nuevo Contrato Social y Ambiental para la Bogotá del Siglo XXI","No aplica",{"$f":"IF(ISERROR(VLOOKUP(L242,Proposito_programa!$C$2:$E$59,2,FALSE)),\" \",VLOOKUP(L242,Proposito_programa!$C$2:$E$59,2,FALSE))","v":" "},{"$f":"IF(ISERROR(VLOOKUP(L242,Proposito_programa!$C$2:$E$59,3,FALSE)),\" \",VLOOKUP(L242,Proposito_programa!$C$2:$E$59,3,FALSE))","v":" "},"1310201010102",null,900204272,"GESTION DE SEGURIDAD ELECTRONICA S.A",null,null,null,null,452200,null,null,null,452200,452200,44197,44197,44561,360,null,null,null,null,null,null,null,null,"X",null,1]
[1,229,2021,"FDLRUU-CD-229-2021","https://community.secop.gov.co/Public/Tendering/OpportunityDetail/Index?noticeUID=CO1.NTC.2016632&isFromPublicArea=True&isModal=False\n","Contratos de prestación de servicios profesionales y de apoyo a la gestión","Contratación directa","Prestación de servicios profesionales y de apoyo a la gestión, o para la ejecución de trabajos artísticos que sólo puedan encomendarse a determinadas personas naturales;","PRESTAR SERVICIOS ESPECIALIZADOS PARA LA IMPLEMENTACION DE PROCESOS DE FORMACIÒN Y CAPACITACION VINCULANDO A LOS CIUDADANOS DE LA LOCALIDAD DE RAFAEL URIBE URIBE EN EJERCICIOS PARA EL FORTALECIMIENTO DE LA SEGURIDAD COMUNITARIA Y LA IMPLEMENTACION DE ACCIONES PEDAGOGICAS TERRITORIALES QUE PROMUEVAN LA DISMINUCION DE LA OCURRENCIA DE DELITOS EN EL MARCO DEL PROYECTO DE INVERSION 1680","Inversión","Un Nuevo Contrato Social y Ambiental para la Bogotá del Siglo XXI",43,{"$f":"IF(ISERROR(VLOOKUP(L243,Proposito_programa!$C$2:$E$59,2,FALSE)),\" \",VLOOKUP(L243,Proposito_programa!$C$2:$E$59,2,FALSE))","v":"Cultura ciudadana para la confianza, la convivencia y la participación desde la vida cotidiana"},{"$f":"IF(ISERROR(VLOOKUP(L243,Proposito_programa!$C$2:$E$59,3,FALSE)),\" \",VLOOKUP(L243,Proposito_programa!$C$2:$E$59,3,FALSE))","v":"Propósito 3: Inspirar confianza y legitimidad para vivir sin miedo y ser epicentro de cultura ciudadana, paz y reconciliación"},"133011603430000001680",1,79402871,"GERMAN DAVID CASTRO DÍAZ","Persona Natural",null,null,null,60270994,null,null,null,60270994,47642786,44355,44362,44575,210,null,null,null,null,null,null,null,null,"X",null,0.79047619490065157]
[1,298,2021,"FDLRUU-CD-298-2021","https://community.secop.gov.co/Public/Tendering/OpportunityDetail/Index?noticeUID=CO1.NTC.2295133&isFromPublicArea=True&isModal=False","Contratos de prestación de servicios profesionales y de apoyo a la gestión","Contratación directa","Prestación de servicios profesionales y de apoyo a la gestión, o para la ejecución de trabajos artísticos que sólo puedan encomendarse a determinadas personas naturales;","CONTRATAR SERVICIOS PROFESIONALES PARA REALIZAR ACUERDOS QUE PROMUEVAN LA PARTICIPACIÓN DE LA POBLACIÓN VULNERABLE, QUE GENEREN EMPRENDIMIENTOS FORMALIZADOS QUE COADYUVEN AL DESARROLLO ECONÓMICO Y PRODUCTIVO DE ESTA POBLACIÓN EN EL MARCO DEL PROYECTO DE INVERSIÓN 1681","Inversión","Un Nuevo Contrato Social y Ambiental para la Bogotá del Siglo XXI",45,{"$f":"IF(ISERROR(VLOOKUP(L244,Proposito_programa!$C$2:$E$59,2,FALSE)),\" \",VLOOKUP(L244,Proposito_programa!$C$2:$E$59,2,FALSE))","v":"Espacio público más seguro y construido colectivamente"},{"$f":"IF(ISERROR(VLOOKUP(L244,Proposito_programa!$C$2:$E$59,3,FALSE)),\" \",VLOOKUP(L244,Proposito_programa!$C$2:$E$59,3,FALSE))","v":"Propósito 3: Inspirar confianza y legitimidad para vivir sin miedo y ser epicentro de cultura ciudadana, paz y reconciliación"},"133011603450000001681",1,1030660190,"GERARDO ZULUAGA FRANCO ","Persona Natural",null,null,null,20000000,null,null,null,20000000,8333333,44474,44480,44602,120,null,null,null,null,null,null,null,"X",null,null,0.41666665000000003]
[1,108,2021,"FDLRUU-CD-108-2021","https://community.secop.gov.co/Public/Tendering/OpportunityDetail/Index?noticeUID=CO1.NTC.1774475&isFromPublicArea=True&isModal=False\n","Contratos de prestación de servicios profesionales y de apoyo a la gestión","Contratación directa","Prestación de servicios profesionales y de apoyo a la gestión, o para la ejecución de trabajos artísticos que sólo puedan encomendarse a determinadas personas naturales;","PRESTAR LOS SERVICIOS TECNICOS COMO GESTOR COMUNITARIO EN LOS ESPACIOS DE PARTICIPACIÓN DE RAFAEL URIBE URIBE CON ENFOQUE EN LA COMUNIDAD","Inversión","Un Nuevo Contrato Social y Ambiental para la Bogotá del Siglo XXI",57,{"$f":"IF(ISERROR(VLOOKUP(L245,Proposito_programa!$C$2:$E$59,2,FALSE)),\" \",VLOOKUP(L245,Proposito_programa!$C$2:$E$59,2,FALSE))","v":"Gestión pública local"},{"$f":"IF(ISERROR(VLOOKUP(L245,Proposito_programa!$C$2:$E$59,3,FALSE)),\" \",VLOOKUP(L245,Proposito_programa!$C$2:$E$59,3,FALSE))","v":"Propósito 5: Construir Bogotá - Región con gobierno abierto, transparente y ciudadanía consciente"},"133011605570000001697",1,80220208,"GABRIEL ENRIQUE MACHADO SANTOS.","Persona Natural",null,null,null,30000000,null,null,null,30000000,28200000,44244,44246,44548,300,null,null,1031146087,"JUAN SEBASTIAN MACHADO SANTOS",44392,15300000,null,null,"X",null,0.94]
[1,332,2021,"FDLRUU-LP-301-2021","https://community.secop.gov.co/Public/Tendering/ContractNoticePhases/View?PPI=CO1.PPI.15818414&isFromPublicArea=True&isModal=False\n","Contratos de prestación de servicios","Licitación pública","No aplica","REALIZAR ACCIONES DE PREVENCIÓN Y ATENCIÓN DE VIOLENCIA INTRAFAMILIAR Y SEXUAL PARA POBLACIONES EN SITUACIONES DE RIESGO Y VULNERACIÓN DE DERECHOS EN LA LOCALIDAD DE RAFAEL URIBE URIBE DEL PROYECTO DE INVERSIÓN 1656.","Inversión","Un Nuevo Contrato Social y Ambiental para la Bogotá del Siglo XXI",6,{"$f":"IF(ISERROR(VLOOKUP(L246,Proposito_programa!$C$2:$E$59,2,FALSE)),\" \",VLOOKUP(L246,Proposito_programa!$C$2:$E$59,2,FALSE))","v":"Sistema Distrital de Cuidado"},{"$f":"IF(ISERROR(VLOOKUP(L246,Proposito_programa!$C$2:$E$59,3,FALSE)),\" \",VLOOKUP(L246,Proposito_programa!$C$2:$E$59,3,FALSE))","v":"Propósito 1: Hacer un nuevo contrato social para incrementar la inclusión social, productiva y política"},"133011601060000001656",8,900693739,"G&D GERENCIA Y DIRECCION DE PROYECTOS S.A.S","Persona Jurídica",null,null,null,528478000,null,null,null,528478000,0,44560,"CELEBRADO SIN INICIAR","CELEBRADO SIN INICIAR",180,null,null,null,null,null,null,"X",null,null,null,0]
[1,301,2021,"FDLRUU-SAMC-248-2021 ","https://community.secop.gov.co/Public/Tendering/OpportunityDetail/Index?noticeUID=CO1.NTC.2231672&isFromPublicArea=True&isModal=False\n","Contratos de prestación de servicios","Selección abreviada","Selección abreviada por menor cuantía ","REALIZAR ACTIVIDADES ALTERNAS DE SALUD DIRIGIDAS A PERSONAS CON DISCAPACIDAD, CUIDADORES Y CUIDADORAS RESIDENTES EN LA LOCALIDAD, QUE DEN RESPUESTA A SUS NECESIDADES TERRITORIALES Y QUE FAVOREZCAN EL DESARROLLO DE SU DEPENDENCIA E INTEGRACIÓN SOCIAL EN EL MARCO DEL PROYECTO DE INVERSIÓN 1658","Inversión","Un Nuevo Contrato Social y Ambiental para la Bogotá del Siglo XXI",6,{"$f":"IF(ISERROR(VLOOKUP(L247,Proposito_programa!$C$2:$E$59,2,FALSE)),\" \",VLOOKUP(L247,Proposito_programa!$C$2:$E$59,2,FALSE))","v":"Sistema Distrital de Cuidado"},{"$f":"IF(ISERROR(VLOOKUP(L247,Proposito_programa!$C$2:$E$59,3,FALSE)),\" \",VLOOKUP(L247,Proposito_programa!$C$2:$E$59,3,FALSE))","v":"Propósito 1: Hacer un nuevo contrato social para incrementar la inclusión social, productiva y política"},"133011601060000001658",4,830095614,"FUNDACIÓN SOCIAL VIVE COLOMBIA – FUNVIVE 2.0","Persona Jurídica",null,null,null,298388260,null,null,null,298388260,0,44481,44491,44672,180,null,null,null,null,null,null,null,"X",null,null,0]
[1,316,2021,"FDLRUU-SAMC-310-2021","https://community.secop.gov.co/Public/Tendering/OpportunityDetail/Index?noticeUID=CO1.NTC.2430118&isFromPublicArea=True&isModal=False\n","Contratos de prestación de servicios","Selección abreviada","Selección abreviada por menor cuantía ","CONTRATAR LA REALIZACIÒN DEL EVENTO CULTURAL Y ARTÌSTICO CORREDOR NAVIDEÑO DE LA LOCALIDAD RAFAEL URIBE URIBE.","Inversión","Un Nuevo Contrato Social y Ambiental para la Bogotá del Siglo XXI",21,{"$f":"IF(ISERROR(VLOOKUP(L248,Proposito_programa!$C$2:$E$59,2,FALSE)),\" \",VLOOKUP(L248,Proposito_programa!$C$2:$E$59,2,FALSE))","v":"Creación y vida cotidiana: Apropiación ciudadana del arte, la cultura y el patrimonio, para la democracia cultural"},{"$f":"IF(ISERROR(VLOOKUP(L248,Proposito_programa!$C$2:$E$59,3,FALSE)),\" \",VLOOKUP(L248,Proposito_programa!$C$2:$E$59,3,FALSE))","v":"Propósito 1: Hacer un nuevo contrato social para incrementar la inclusión social, productiva y política"},"133011601210000001647",4,830133329,"FUNDACION PARA EL DESARROLLO\nSOCIOCULTURAL DEPORTIVO Y COMUNITARIO FUNDESCO\r","Persona Jurídica",null,null,null,397207207,null,null,null,397207207,0,44543,44545,44575,30,null,null,null,null,null,null,null,"X",null,null,0]
[1,326,2021,"FDLRUU-SAMC-315-2021 ","https://community.secop.gov.co/Public/Tendering/OpportunityDetail/Index?noticeUID=CO1.NTC.2458047&isFromPublicArea=True&isModal=False\n","Contratos de prestación de servicios","Selección abreviada","Selección abreviada por menor cuantía ","PRESTAR SERVICIOS DEPORTIVOS PARA REALIZAR LA 1ER COPA DE FÚTBOL DE SALON EN RAFAEL URIBE URIBE, EN EL MARCO DEL PROYECTO 1646 CULTURA DEPORTE, RECREACIÓN PARA EL BIENESTAR DE LA CIUDADANIA","Inversión","Un Nuevo Contrato Social y Ambiental para la Bogotá del Siglo XXI",20,{"$f":"IF(ISERROR(VLOOKUP(L249,Proposito_programa!$C$2:$E$59,2,FALSE)),\" \",VLOOKUP(L249,Proposito_programa!$C$2:$E$59,2,FALSE))","v":"Bogotá, referente en cultura, deporte, recreación y actividad física, con parques para el desarrollo y la salud"},{"$f":"IF(ISERROR(VLOOKUP(L249,Proposito_programa!$C$2:$E$59,3,FALSE)),\" \",VLOOKUP(L249,Proposito_programa!$C$2:$E$59,3,FALSE))","v":"Propósito 1: Hacer un nuevo contrato social para incrementar la inclusión social, productiva y política"},"133011601200000001646",7,900572437,"FUNDACIÓN PAÍS HUMANO","Persona Jurídica",null,null,null,87262085,null,null,null,87262085,0,44559,"CELEBRADO SIN INICIAR","CELEBRADO SIN INICIAR",90,null,null,null,null,null,null,"X",null,null,null,0]
[1,288,2021,"FDLRUU-SAMC-252-2021","https://community.secop.gov.co/Public/Tendering/OpportunityDetail/Index?noticeUID=CO1.NTC.2179356&isFromPublicArea=True&isModal=False\n","Suministro","Selección abreviada","Selección abreviada por menor cuantía ","CONTRATAR A MONTO AGOTABLE EL SUMINISTRO DE ELEMENTOS DE MERCHANDISING Y DEMÁS SERVICIOS REQUERIDOS PARA EL DESARROLLO LOGÍSTICO Y OPERATIVO DEL PROGRAMA RETO LOCAL JÓVENES Y ENTORNOS SEGUROS EN LA LOCALIDAD RAFAEL URIBE URIBE","Inversión","Un Nuevo Contrato Social y Ambiental para la Bogotá del Siglo XXI",1,{"$f":"IF(ISERROR(VLOOKUP(L250,Proposito_programa!$C$2:$E$59,2,FALSE)),\" \",VLOOKUP(L250,Proposito_programa!$C$2:$E$59,2,FALSE))","v":"Subsidios y transferencias para la equidad"},{"$f":"IF(ISERROR(VLOOKUP(L250,Proposito_programa!$C$2:$E$59,3,FALSE)),\" \",VLOOKUP(L250,Proposito_programa!$C$2:$E$59,3,FALSE))","v":"Propósito 1: Hacer un nuevo contrato social para incrementar la inclusión social, productiva y política"},"133011601010000002213",20,900572437,"FUNDACION PAIS HUMANO","Persona Jurídica",null,null,null,214509306,null,null,null,214509306,51107432,44452,44454,44818,360,null,null,null,null,null,null,null,"X",null,null,0.23825274974317431]
[1,320,2021,"FDLRUU-SAMC-314-2021","https://community.secop.gov.co/Public/Tendering/OpportunityDetail/Index?noticeUID=CO1.NTC.2449270&isFromPublicArea=True&isModal=False\n","Contratos de prestación de servicios","Selección abreviada","Selección abreviada por menor cuantía ","IMPLEMENTAR ACCIONES DE SALUD BUCAL COMPLEMENTARIAS A LA ESTRATEGIA TERRITORIAL DE SALUD Y A LAS OFRECIDAS POR EL PLAN DE BENEFICIOS DE SALUD- PBS, QUE FAVOREZCAN LA POBLACIÓN MÁS VULNERABLE RESIDENTE EN LA LOCALIDAD RAFAEL URIBE URIBE, EN EL MARCO DEL PROYECTO DE INVERSIÓN 1658","Inversión","Un Nuevo Contrato Social y Ambiental para la Bogotá del Siglo XXI",6,{"$f":"IF(ISERROR(VLOOKUP(L251,Proposito_programa!$C$2:$E$59,2,FALSE)),\" \",VLOOKUP(L251,Proposito_programa!$C$2:$E$59,2,FALSE))","v":"Sistema Distrital de Cuidado"},{"$f":"IF(ISERROR(VLOOKUP(L251,Proposito_programa!$C$2:$E$59,3,FALSE)),\" \",VLOOKUP(L251,Proposito_programa!$C$2:$E$59,3,FALSE))","v":"Propósito 1: Hacer un nuevo contrato social para incrementar la inclusión social, productiva y política"},"133011601060000001658",2,830044030,"FUNDACION FORO CIVICO ","Persona Jurídica",null,null,null,270159248,null,null,null,270159248,0,44557,"CELEBRADO SIN INICIAR","CELEBRADO SIN INICIAR",180,null,null,null,null,null,null,"X",null,null,null,0]
[1,166,2021,"FDLRUU-CD-150-2021","https://community.secop.gov.co/Public/Tendering/OpportunityDetail/Index?noticeUID=CO1.NTC.1800149&isFromPublicArea=True&isModal=False\n","Contratos de prestación de servicios profesionales y de apoyo a la gestión","Contratación directa","Prestación de servicios profesionales y de apoyo a la gestión, o para la ejecución de trabajos artísticos que sólo puedan encomendarse a determinadas personas naturales;","EL CONTRATISTA SE OBLIGA CON EL FONDO DE DESARROLLO LOCAL DE RAFAEL URIBE URIBE A PRESTAR SUS SERVICIOS DE APOYO A LA GESTION LOCAL Y TERRITORIAL DE LOS TEMAS DE SEGURIDAD Y CONVIVENCIA CIUDADANA PARA LA ALCALDIA LOCAL DE RAFAEL URIBE URIBE","Inversión","Un Nuevo Contrato Social y Ambiental para la Bogotá del Siglo XXI",43,{"$f":"IF(ISERROR(VLOOKUP(L252,Proposito_programa!$C$2:$E$59,2,FALSE)),\" \",VLOOKUP(L252,Proposito_programa!$C$2:$E$59,2,FALSE))","v":"Cultura ciudadana para la confianza, la convivencia y la participación desde la vida cotidiana"},{"$f":"IF(ISERROR(VLOOKUP(L252,Proposito_programa!$C$2:$E$59,3,FALSE)),\" \",VLOOKUP(L252,Proposito_programa!$C$2:$E$59,3,FALSE))","v":"Propósito 3: Inspirar confianza y legitimidad para vivir sin miedo y ser epicentro de cultura ciudadana, paz y reconciliación"},"133011603430000001680",1,1031150465,"FREDY ALEJANDRO MONROY ARDILA","Persona Natural",null,null,null,19800000,null,1,3153333,22953333,19800000,44253,44256,44574,270,1,43,null,null,null,null,null,null,"X",null,0.86261982083386324]
[1,182,2021,"FDLRUU-CD-182-2021","https://community.secop.gov.co/Public/Tendering/OpportunityDetail/Index?noticeUID=CO1.NTC.1824332&isFromPublicArea=True&isModal=False\n","Contratos de prestación de servicios profesionales y de apoyo a la gestión","Contratación directa","Prestación de servicios profesionales y de apoyo a la gestión, o para la ejecución de trabajos artísticos que sólo puedan encomendarse a determinadas personas naturales;","PRESTAR LOS SERVICIOS PROFESIONALES PARA ADELANTAR LAS ACCIONES TENDIENTES AL AGENCIAMIENTO E IMPLEMENTACIÓN DE LAS POLÍTICAS PÚBLICAS DEL ORDEN DISTRITAL EN LO LOCAL, SEGUIMIENTO AL PLAN DE DESARROLLO LOCAL, ACOMPAÑAR LAS INSTANCIAS DE PARTICIPACIÓN QUE LE SEAN ASIGNADAS POR EL SUPERVISOR Y APOYAR LAS DEMÁS ACTIVIDADES QUE SE GENEREN EN EL ÁREA DE GESTIÓN DEL DESARROLLO LOCAL\t ","Inversión","Un Nuevo Contrato Social y Ambiental para la Bogotá del Siglo XXI",57,{"$f":"IF(ISERROR(VLOOKUP(L253,Proposito_programa!$C$2:$E$59,2,FALSE)),\" \",VLOOKUP(L253,Proposito_programa!$C$2:$E$59,2,FALSE))","v":"Gestión pública local"},{"$f":"IF(ISERROR(VLOOKUP(L253,Proposito_programa!$C$2:$E$59,3,FALSE)),\" \",VLOOKUP(L253,Proposito_programa!$C$2:$E$59,3,FALSE))","v":"Propósito 5: Construir Bogotá - Región con gobierno abierto, transparente y ciudadanía consciente"},"133011605570000001697",1,88234955,"FRANCISCO JAVIER TOLOZA FUENTES","Persona Natural",null,null,null,52000000,null,null,null,52000000,18026667,44265,44272,44454,300,null,null,null,null,null,null,null,null,null,"X",0.34666667307692306]
[1,203,2021,"FDLRUU-CD-203-2021","https://community.secop.gov.co/Public/Tendering/OpportunityDetail/Index?noticeUID=CO1.NTC.1855447&isFromPublicArea=True&isModal=False\n","Contratos de prestación de servicios profesionales y de apoyo a la gestión","Contratación directa","Prestación de servicios profesionales y de apoyo a la gestión, o para la ejecución de trabajos artísticos que sólo puedan encomendarse a determinadas personas naturales;","APOYAR TÉCNICAMENTE LAS DISTINTAS ETAPAS DE LOS PROCESOS DE COMPETENCIA DE LA ALCALDÍA LOCAL PARA LA DEPURACIÓN DE LAS ACTUACIONES ADMINISTRATIVAS”","Inversión","Un Nuevo Contrato Social y Ambiental para la Bogotá del Siglo XXI",57,{"$f":"IF(ISERROR(VLOOKUP(L254,Proposito_programa!$C$2:$E$59,2,FALSE)),\" \",VLOOKUP(L254,Proposito_programa!$C$2:$E$59,2,FALSE))","v":"Gestión pública local"},{"$f":"IF(ISERROR(VLOOKUP(L254,Proposito_programa!$C$2:$E$59,3,FALSE)),\" \",VLOOKUP(L254,Proposito_programa!$C$2:$E$59,3,FALSE))","v":"Propósito 5: Construir Bogotá - Región con gobierno abierto, transparente y ciudadanía consciente"},"133011605570000001698",1,17650535,"FRANCISCO ALBERTO BERMEO DUARTE","Persona Natural",null,null,null,31200000,null,1,15600000,46800000,16466667,44274,44281,44555,180,1,90,null,null,null,null,null,null,"X",null,0.351851858974359]
[null,null,2021,null,null,"Otros gastos","Otros gastos","Otros gastos","POR EL CUAL SE AUTORIZA LA TRANSFERENCIA DE RECURSOS DEL FONDO DE DESARROLLO LOCAL DE RAFAEL URIBE URIBE, CON DESTINO AL SISTEMA DISTRITAL BOGOTA SOLIDARIA A TRAVES DE LA DIRECCION DISTRITAL DE TESORERIA - SECRETARIA DE HACIENDA DISTRITAL. PARA ENTREGAR APOYOS QUE CONTRIBUYAN AL INGRESO MINIMO GARANTIZADO A LOS HOGARES POBRES DE LA LOCALIDAD.","Inversión","Un Nuevo Contrato Social y Ambiental para la Bogotá del Siglo XXI",1,{"$f":"IF(ISERROR(VLOOKUP(L255,Proposito_programa!$C$2:$E$59,2,FALSE)),\" \",VLOOKUP(L255,Proposito_programa!$C$2:$E$59,2,FALSE))","v":"Subsidios y transferencias para la equidad"},{"$f":"IF(ISERROR(VLOOKUP(L255,Proposito_programa!$C$2:$E$59,3,FALSE)),\" \",VLOOKUP(L255,Proposito_programa!$C$2:$E$59,3,FALSE))","v":"Propósito 1: Hacer un nuevo contrato social para incrementar la inclusión social, productiva y política"},"133011601010000002213",null,899999061,"FONDO DE DESARROLLO LOCAL DE RAFAEL URIB E","Persona Jurídica",null,null,null,9673318037,null,null,null,9673318037,9673318037,44197,44197,44561,360,null,null,null,null,null,null,null,null,"X",null,1]
[1,152,2021,"FDLRUU-CD-150-2021","https://community.secop.gov.co/Public/Tendering/OpportunityDetail/Index?noticeUID=CO1.NTC.1800149&isFromPublicArea=True&isModal=False\n","Contratos de prestación de servicios profesionales y de apoyo a la gestión","Contratación directa","Prestación de servicios profesionales y de apoyo a la gestión, o para la ejecución de trabajos artísticos que sólo puedan encomendarse a determinadas personas naturales;","EL CONTRATISTA SE OBLIGA CON EL FONDO DE DESARROLLO LOCAL DE RAFAEL URIBE URIBE A PRESTAR SUS SERVICIOS DE APOYO A LA GESTION LOCAL Y TERRITORIAL DE LOS TEMAS DE SEGURIDAD Y CONVIVENCIA CIUDADANA PARA LA ALCALDIA LOCAL DE RAFAEL URIBE URIBE","Inversión","Un Nuevo Contrato Social y Ambiental para la Bogotá del Siglo XXI",43,{"$f":"IF(ISERROR(VLOOKUP(L256,Proposito_programa!$C$2:$E$59,2,FALSE)),\" \",VLOOKUP(L256,Proposito_programa!$C$2:$E$59,2,FALSE))","v":"Cultura ciudadana para la confianza, la convivencia y la participación desde la vida cotidiana"},{"$f":"IF(ISERROR(VLOOKUP(L256,Proposito_programa!$C$2:$E$59,3,FALSE)),\" \",VLOOKUP(L256,Proposito_programa!$C$2:$E$59,3,FALSE))","v":"Propósito 3: Inspirar confianza y legitimidad para vivir sin miedo y ser epicentro de cultura ciudadana, paz y reconciliación"},"133011603430000001680",1,3232660,"FERNANDO PEDRAZA","Persona Natural",null,null,null,19800000,null,1,3080000,22880000,19726667,44253,44257,44574,270,1,42,null,null,null,null,null,null,"X",null,0.86217950174825175]
[1,25,2021,"FDLRUU-CD-025-2021","https://community.secop.gov.co/Public/Tendering/OpportunityDetail/Index?noticeUID=CO1.NTC.1723337&isFromPublicArea=True&isModal=False\n","Contratos de prestación de servicios profesionales y de apoyo a la gestión","Contratación directa","Prestación de servicios profesionales y de apoyo a la gestión, o para la ejecución de trabajos artísticos que sólo puedan encomendarse a determinadas personas naturales;","PRESTAR LOS SERVICIOS PERSONALES DE APOYO A LA GESTIÓN PARA LA CONDUCCIÓN DE LOS VEHÍCULOS LIVIANOS QUE LE SEAN ASIGNADOS Y QUE SE ENCUENTREN AL SERVICIO DE LA ALCALDÍA LOCAL DE RAFAEL URIBE URIBE","Inversión","Un Nuevo Contrato Social y Ambiental para la Bogotá del Siglo XXI",57,{"$f":"IF(ISERROR(VLOOKUP(L257,Proposito_programa!$C$2:$E$59,2,FALSE)),\" \",VLOOKUP(L257,Proposito_programa!$C$2:$E$59,2,FALSE))","v":"Gestión pública local"},{"$f":"IF(ISERROR(VLOOKUP(L257,Proposito_programa!$C$2:$E$59,3,FALSE)),\" \",VLOOKUP(L257,Proposito_programa!$C$2:$E$59,3,FALSE))","v":"Propósito 5: Construir Bogotá - Región con gobierno abierto, transparente y ciudadanía consciente"},"133011605570000001697",1,5970959,"FERNANDO ENRIQUE YAIMA OYOLA","Persona Natural",null,null,null,26000000,null,1,3640000,29640000,25913333,44229,44229,44574,300,1,42,null,null,null,null,null,null,"X",null,0.87426899460188934]
[1,192,2021,"FDLRUU-CD-192-2021","https://community.secop.gov.co/Public/Tendering/OpportunityDetail/Index?noticeUID=CO1.NTC.1837450&isFromPublicArea=True&isModal=False\n","Contratos de prestación de servicios profesionales y de apoyo a la gestión","Contratación directa","Prestación de servicios profesionales y de apoyo a la gestión, o para la ejecución de trabajos artísticos que sólo puedan encomendarse a determinadas personas naturales;","PRESTAR SUS SERVICIOS PROFESIONALES COMO ABOGADO PARA APOYAR EL PROCESO DE TOMA FISICA, VERIFICACION, CLASIFICACION Y ACTUALIZACION DE LA INFORMACION DE BIENES MUEBLES E INMUEBLES DE PROPIEDAD Y/O A CARGO DEL FONDO DE DESARROLLO LOCAL DE RAFAEL URIBE URIBE Y DEPURACION DE LOS CONTRATOS DE COMODATO EN EL AREA DE GESTIÓN PARA EL DESARROLLO LOCAL – ALMACEN DE CONFORMIDAD CON LAS DISPOSICIONES LEGALES VIGENTES","Inversión","Un Nuevo Contrato Social y Ambiental para la Bogotá del Siglo XXI",57,{"$f":"IF(ISERROR(VLOOKUP(L258,Proposito_programa!$C$2:$E$59,2,FALSE)),\" \",VLOOKUP(L258,Proposito_programa!$C$2:$E$59,2,FALSE))","v":"Gestión pública local"},{"$f":"IF(ISERROR(VLOOKUP(L258,Proposito_programa!$C$2:$E$59,3,FALSE)),\" \",VLOOKUP(L258,Proposito_programa!$C$2:$E$59,3,FALSE))","v":"Propósito 5: Construir Bogotá - Región con gobierno abierto, transparente y ciudadanía consciente"},"133011605570000001697",1,14321634,"FERNANDO ANTONIO ORTIZ CALDERON","Persona Natural",null,null,null,52000000,null,null,null,52000000,44026667,44266,44272,44577,300,null,null,null,null,null,null,null,null,"X",null,0.84666667307692312]
[1,49,2021,"FDLRUU-CD-049-2021","https://community.secop.gov.co/Public/Tendering/OpportunityDetail/Index?noticeUID=CO1.NTC.1736709&isFromPublicArea=True&isModal=False\n","Contratos de prestación de servicios profesionales y de apoyo a la gestión","Contratación directa","Prestación de servicios profesionales y de apoyo a la gestión, o para la ejecución de trabajos artísticos que sólo puedan encomendarse a determinadas personas naturales;","PRESTAR LOS SERVICIOS PROFESIONALES COMO ABOGADO PARA APOYAR AL DESPACHO DEL ALCALDE LOCAL EN EL ANÁLISIS, REVISIÓN, TRÁMITE Y SUSCRIPCIÓN DE LOS ACTOS ADMINISTRATIVOS, DESPACHOS COMISORIOS, TUTELAS, SOLICITUDES DE ENTES DE CONTROL Y LOS CONCEPTOS JURÍDICOS QUE SE LE SOLICITEN","Inversión","Un Nuevo Contrato Social y Ambiental para la Bogotá del Siglo XXI",57,{"$f":"IF(ISERROR(VLOOKUP(L259,Proposito_programa!$C$2:$E$59,2,FALSE)),\" \",VLOOKUP(L259,Proposito_programa!$C$2:$E$59,2,FALSE))","v":"Gestión pública local"},{"$f":"IF(ISERROR(VLOOKUP(L259,Proposito_programa!$C$2:$E$59,3,FALSE)),\" \",VLOOKUP(L259,Proposito_programa!$C$2:$E$59,3,FALSE))","v":"Propósito 5: Construir Bogotá - Región con gobierno abierto, transparente y ciudadanía consciente"},"133011605570000001698",1,1111791373,"FELIX EDUARDO MURILLO PLATA","Persona Natural",null,null,null,62000000,null,1,7026667,69026667,60346667,44232,44236,44574,300,1,35,null,null,null,null,null,null,"X",null,0.87425149761323406]
[1,198,2021,"FDLRUU-CD-198-2021","https://community.secop.gov.co/Public/Tendering/OpportunityDetail/Index?noticeUID=CO1.NTC.1850883&isFromPublicArea=True&isModal=False\n","Contratos de prestación de servicios profesionales y de apoyo a la gestión","Contratación directa","Prestación de servicios profesionales y de apoyo a la gestión, o para la ejecución de trabajos artísticos que sólo puedan encomendarse a determinadas personas naturales;","PRESTAR LOS SERVICIOS PROFESIONALES PARA APOYAR EL ÁREA GESTIÓN POLICIVA DE LA ALCALDIA LOCAL DE RAFAEL URIBE URIBE, EN EL SEGUIMIENTO Y REVISIÓN DE LOS REQUERIMIENTOS QUE SURJAN EN EL DESARROLLO DE LA GESTIÓN DEL FONDO DE DESARROLLO LOCAL, EN CUMPLIMIENTO DE LOS PROCESOS Y PROCEDIMIENTOS DE LA SECRETARÍA DISTRITAL DE GOBIERNO Y LAS NORMAS APLICABLES SOBRE LA MATERIA”\t ","Inversión","Un Nuevo Contrato Social y Ambiental para la Bogotá del Siglo XXI",57,{"$f":"IF(ISERROR(VLOOKUP(L260,Proposito_programa!$C$2:$E$59,2,FALSE)),\" \",VLOOKUP(L260,Proposito_programa!$C$2:$E$59,2,FALSE))","v":"Gestión pública local"},{"$f":"IF(ISERROR(VLOOKUP(L260,Proposito_programa!$C$2:$E$59,3,FALSE)),\" \",VLOOKUP(L260,Proposito_programa!$C$2:$E$59,3,FALSE))","v":"Propósito 5: Construir Bogotá - Región con gobierno abierto, transparente y ciudadanía consciente"},"133011605570000001698",1,79455376,"FELIPE ANDRES BARRAGAN\nMARTINEZ","Persona Natural",null,null,null,33000000,null,1,16500000,49500000,35200000,44272,44274,44548,180,1,90,80111170,"VADITH OLANDO GOMEZ REYES",44440,3300000,null,null,"X",null,0.71111111111111114]
[1,281,2021,"FDLRUU-CD-281-2021","https://community.secop.gov.co/Public/Tendering/OpportunityDetail/Index?noticeUID=CO1.NTC.2213257&isFromPublicArea=True&isModal=False\n","Contratos de prestación de servicios profesionales y de apoyo a la gestión","Contratación directa","Prestación de servicios profesionales y de apoyo a la gestión, o para la ejecución de trabajos artísticos que sólo puedan encomendarse a determinadas personas naturales;","PRESTAR SERVICIOS PROFESIONALES PARA REALIZAR ACUERDOS ENTRE LA ALCALDÍA LOCAL DE RAFAEL URIBE URIBE Y SUS HABITANTES PARA VINCULARLOS A LOS PROGRAMAS DEL IDRD \"ESCUELA DE LA BICICLETA\" Y \"AL TRABAJO EN BICI\" QUE MOTIVEN EL USO ADECUADO DE LOS MEDIOS DE TRANSPORTE NO MOTORIZADOS, POR MEDIO DE LA PROMOCIÓN DE LA NORMATIVIDAD PARA SU APROPIACIÓN Y APLICACIÓN EN EL MARCO DEL PROYECTO DE INVERSIÓN 1681","Inversión","Un Nuevo Contrato Social y Ambiental para la Bogotá del Siglo XXI",45,{"$f":"IF(ISERROR(VLOOKUP(L261,Proposito_programa!$C$2:$E$59,2,FALSE)),\" \",VLOOKUP(L261,Proposito_programa!$C$2:$E$59,2,FALSE))","v":"Espacio público más seguro y construido colectivamente"},{"$f":"IF(ISERROR(VLOOKUP(L261,Proposito_programa!$C$2:$E$59,3,FALSE)),\" \",VLOOKUP(L261,Proposito_programa!$C$2:$E$59,3,FALSE))","v":"Propósito 3: Inspirar confianza y legitimidad para vivir sin miedo y ser epicentro de cultura ciudadana, paz y reconciliación"},"133011603450000001681",1,19346699,"FEDERICO ALEJANDRO CASTAÑEDA VARGAS ","Persona Natural",null,null,null,20000000,null,null,null,20000000,12666667,44448,44454,44575,120,null,null,null,null,null,null,null,null,"X",null,0.63333335000000002]
[null,null,2021,null,null,"Otros gastos","Otros gastos","Otros gastos","FACTURAS RECIBOS PUBLICOS","Funcionamiento","Un Nuevo Contrato Social y Ambiental para la Bogotá del Siglo XXI","No aplica",{"$f":"IF(ISERROR(VLOOKUP(L262,Proposito_programa!$C$2:$E$59,2,FALSE)),\" \",VLOOKUP(L262,Proposito_programa!$C$2:$E$59,2,FALSE))","v":" "},{"$f":"IF(ISERROR(VLOOKUP(L262,Proposito_programa!$C$2:$E$59,3,FALSE)),\" \",VLOOKUP(L262,Proposito_programa!$C$2:$E$59,3,FALSE))","v":" "},"131020202040101-131020202040103-131020202040102 -131020202030401",null,null,"FACTURAS RECIBOS PUBLICOS","Persona Jurídica",null,null,null,135299409,null,null,null,135299409,135299409,44197,44197,44561,360,null,null,null,null,null,null,null,null,"X",null,1]
[1,70,2021,"FDLRUU-CD-070-2021","https://community.secop.gov.co/Public/Tendering/OpportunityDetail/Index?noticeUID=CO1.NTC.1748947&isFromPublicArea=True&isModal=False\n","Contratos de prestación de servicios profesionales y de apoyo a la gestión","Contratación directa","Prestación de servicios profesionales y de apoyo a la gestión, o para la ejecución de trabajos artísticos que sólo puedan encomendarse a determinadas personas naturales;","PRESTAR LOS SERVICIOS PROFESIONALES EN LA CONSOLIDACION DE LA INFORMACION CONTRACTUAL A CARGO DEL ÁREA DE GESTION DE DESARROLLO LOCAL DE LA ALCALDÍA LOCAL DE RAFAEL URIBE URIBE”","Inversión","Un Nuevo Contrato Social y Ambiental para la Bogotá del Siglo XXI",57,{"$f":"IF(ISERROR(VLOOKUP(L263,Proposito_programa!$C$2:$E$59,2,FALSE)),\" \",VLOOKUP(L263,Proposito_programa!$C$2:$E$59,2,FALSE))","v":"Gestión pública local"},{"$f":"IF(ISERROR(VLOOKUP(L263,Proposito_programa!$C$2:$E$59,3,FALSE)),\" \",VLOOKUP(L263,Proposito_programa!$C$2:$E$59,3,FALSE))","v":"Propósito 5: Construir Bogotá - Región con gobierno abierto, transparente y ciudadanía consciente"},"133011605570000001697",1,1018463623,"FABIO ALEXANDER ALZATE FRANCO ","Persona Natural",null,null,null,43000000,null,1,4586667,47586667,41423333,44238,44239,44574,300,1,32,null,null,null,null,null,null,"X",null,0.87048191460856039]
[1,96,2021,"FDLRUU-CD-096-2021","https://community.secop.gov.co/Public/Tendering/OpportunityDetail/Index?noticeUID=CO1.NTC.1760539&isFromPublicArea=True&isModal=False\n","Contratos de prestación de servicios profesionales y de apoyo a la gestión","Contratación directa","Prestación de servicios profesionales y de apoyo a la gestión, o para la ejecución de trabajos artísticos que sólo puedan encomendarse a determinadas personas naturales;","APOYAR LA GESTIÓN DOCUMENTAL DE LA ALCALDÍA LOCAL DE RAFAEL URIBE URIBE EN LA IMPLEMENTACIÓN DE LOS PROCESOS DE CLASIFICACIÓN, ORDENACIÓN, SELECCIÓN NATURAL, FOLIACIÓN, IDENTIFICACIÓN, LEVANTAMIENTO DE INVENTARIOS, ALMACENAMIENTO Y APLICACIÓN DE PROTOCOLOS DE ELIMINACIÓN Y TRANSFERENCIAS DOCUMENTALES","Inversión","Un Nuevo Contrato Social y Ambiental para la Bogotá del Siglo XXI",57,{"$f":"IF(ISERROR(VLOOKUP(L264,Proposito_programa!$C$2:$E$59,2,FALSE)),\" \",VLOOKUP(L264,Proposito_programa!$C$2:$E$59,2,FALSE))","v":"Gestión pública local"},{"$f":"IF(ISERROR(VLOOKUP(L264,Proposito_programa!$C$2:$E$59,3,FALSE)),\" \",VLOOKUP(L264,Proposito_programa!$C$2:$E$59,3,FALSE))","v":"Propósito 5: Construir Bogotá - Región con gobierno abierto, transparente y ciudadanía consciente"},"133011605570000001697",1,19234849,"FABIO ALBERTO RINCON RUIZ","Persona Natural",null,null,null,26000000,null,1,2513333,28513333,24786667,44239,44242,44574,300,1,29,null,null,null,null,null,null,"X",null,0.86930093370704853]
[1,157,2021,"FDLRUU-CD-150-2021","https://community.secop.gov.co/Public/Tendering/OpportunityDetail/Index?noticeUID=CO1.NTC.1800149&isFromPublicArea=True&isModal=False\n","Contratos de prestación de servicios profesionales y de apoyo a la gestión","Contratación directa","Prestación de servicios profesionales y de apoyo a la gestión, o para la ejecución de trabajos artísticos que sólo puedan encomendarse a determinadas personas naturales;","EL CONTRATISTA SE OBLIGA CON EL FONDO DE DESARROLLO LOCAL DE RAFAEL URIBE URIBE A PRESTAR SUS SERVICIOS DE APOYO A LA GESTION LOCAL Y TERRITORIAL DE LOS TEMAS DE SEGURIDAD Y CONVIVENCIA CIUDADANA PARA LA ALCALDIA LOCAL DE RAFAEL URIBE URIBE","Inversión","Un Nuevo Contrato Social y Ambiental para la Bogotá del Siglo XXI",43,{"$f":"IF(ISERROR(VLOOKUP(L265,Proposito_programa!$C$2:$E$59,2,FALSE)),\" \",VLOOKUP(L265,Proposito_programa!$C$2:$E$59,2,FALSE))","v":"Cultura ciudadana para la confianza, la convivencia y la participación desde la vida cotidiana"},{"$f":"IF(ISERROR(VLOOKUP(L265,Proposito_programa!$C$2:$E$59,3,FALSE)),\" \",VLOOKUP(L265,Proposito_programa!$C$2:$E$59,3,FALSE))","v":"Propósito 3: Inspirar confianza y legitimidad para vivir sin miedo y ser epicentro de cultura ciudadana, paz y reconciliación"},"133011603430000001680",1,1013643216,"EVELYN ESTEFANY MOSQUERA DAVILA ","Persona Natural",null,null,null,19800000,null,1,3153333,22953333,19800000,44253,44256,44574,270,1,43,null,null,null,null,null,null,"X",null,0.86261982083386324]
[1,247,2021,"FDLRUU-CD-247-2021 ","https://community.secop.gov.co/Public/Tendering/OpportunityDetail/Index?noticeUID=CO1.NTC.2116651&isFromPublicArea=True&isModal=False\n","Contratos de prestación de servicios profesionales y de apoyo a la gestión","Contratación directa","Prestación de servicios profesionales y de apoyo a la gestión, o para la ejecución de trabajos artísticos que sólo puedan encomendarse a determinadas personas naturales;","PRESTAR LOS SERVICIOS PROFESIONALES PARA APOYAR AL DESPACHO DE LA ALCALDÍA LOCAL DE RAFAEL URIBE URIBE EN EL DISEÑO Y ESTRATEGIAS, COORDINACIÓN Y EMISIÓN DE LINEAMIENTOS QUE COADYUVEN AL FORTALECIMIENTO INSTITUCIONAL ENTORNO A LAS ACTIVIDADES QUE REALIZA LA ALCALDÍA LOCAL EN SUS DIFERENTES DEPENDENCIAS","Inversión","Un Nuevo Contrato Social y Ambiental para la Bogotá del Siglo XXI",57,{"$f":"IF(ISERROR(VLOOKUP(L266,Proposito_programa!$C$2:$E$59,2,FALSE)),\" \",VLOOKUP(L266,Proposito_programa!$C$2:$E$59,2,FALSE))","v":"Gestión pública local"},{"$f":"IF(ISERROR(VLOOKUP(L266,Proposito_programa!$C$2:$E$59,3,FALSE)),\" \",VLOOKUP(L266,Proposito_programa!$C$2:$E$59,3,FALSE))","v":"Propósito 5: Construir Bogotá - Región con gobierno abierto, transparente y ciudadanía consciente"},"133011605570000001697",1,84451166,"ERNESTO FRANCISCO FORERO FERNANDEZ DE\nCASTRO,","Persona Natural",null,null,null,24000000,null,null,null,24000000,18600000,44404,44405,44527,120,null,null,null,null,null,null,null,null,"X",null,0.77500000000000002]
[1,128,2021,"FDLRUU-CD-128-2021","https://community.secop.gov.co/Public/Tendering/OpportunityDetail/Index?noticeUID=CO1.NTC.1783518&isFromPublicArea=True&isModal=False\n","Contratos de prestación de servicios profesionales y de apoyo a la gestión","Contratación directa","Prestación de servicios profesionales y de apoyo a la gestión, o para la ejecución de trabajos artísticos que sólo puedan encomendarse a determinadas personas naturales;","PRESTAR LOS SERVICIOS PROFESIONALES PARA LA OPERACIÓN, PRESTACIÓN, SEGUIMIENTO Y CUMPLIMIENTO PROCEDIMIENTOS ADMINISTRATIVOS OPERATIVOS Y PROGRAMÁTICOS DEL SERVICIO APOYO ECONÓMICO TIPO C, QUE CONTRIBUYAN A LA GARANTÍA DE LOS DERECHOS DE LA POBLACIÓN MAYOR EN EL MARCO DE LA POLÍTICA PÚBLICA SOCIAL PARA EL ENVEJECIMIENTO Y LA VEJEZ EN EL DISTRITO CAPITAL A CARGO DE LA ALCALDÍA LOCAL RAFAELURIBE URIBE","Inversión","Un Nuevo Contrato Social y Ambiental para la Bogotá del Siglo XXI",1,{"$f":"IF(ISERROR(VLOOKUP(L267,Proposito_programa!$C$2:$E$59,2,FALSE)),\" \",VLOOKUP(L267,Proposito_programa!$C$2:$E$59,2,FALSE))","v":"Subsidios y transferencias para la equidad"},{"$f":"IF(ISERROR(VLOOKUP(L267,Proposito_programa!$C$2:$E$59,3,FALSE)),\" \",VLOOKUP(L267,Proposito_programa!$C$2:$E$59,3,FALSE))","v":"Propósito 1: Hacer un nuevo contrato social para incrementar la inclusión social, productiva y política"},"133011601010000001636",1,52363835,"ERIKA YOLIMA GELVEZ  RUIZ ","Persona Natural",null,null,null,41600000,null,1,11960000,53560000,48013333,44249,44251,44561,240,1,69,null,null,null,null,null,null,"X",null,0.8964401232262883]
[1,218,2021,"FDLRUU-CD-218-2021","https://community.secop.gov.co/Public/Tendering/OpportunityDetail/Index?noticeUID=CO1.NTC.1971462&isFromPublicArea=True&isModal=False\n","Contratos de prestación de servicios profesionales y de apoyo a la gestión","Contratación directa","Prestación de servicios profesionales y de apoyo a la gestión, o para la ejecución de trabajos artísticos que sólo puedan encomendarse a determinadas personas naturales;","APOYAR JURÍDICAMENTE LA EJECUCIÓN DE LAS ACCIONES REQUERIDAS PARA EL TRÁMITE E IMPULSO PROCESAL DE LAS ACTUACIONES CONTRAVENCIONALES Y/O QUERELLAS QUE CURSEN EN LAS INSPECCIONES DE POLICÍA DE LA LOCALIDAD DE RAFAEL URIBE URIBE","Inversión","Un Nuevo Contrato Social y Ambiental para la Bogotá del Siglo XXI",57,{"$f":"IF(ISERROR(VLOOKUP(L268,Proposito_programa!$C$2:$E$59,2,FALSE)),\" \",VLOOKUP(L268,Proposito_programa!$C$2:$E$59,2,FALSE))","v":"Gestión pública local"},{"$f":"IF(ISERROR(VLOOKUP(L268,Proposito_programa!$C$2:$E$59,3,FALSE)),\" \",VLOOKUP(L268,Proposito_programa!$C$2:$E$59,3,FALSE))","v":"Propósito 5: Construir Bogotá - Región con gobierno abierto, transparente y ciudadanía consciente"},"133011605570000001698",1,52249114,"ERIKA MERCEDES GOMEZ RIVERA","Persona Natural",null,null,null,31200000,null,1,7626666,38826666,31200000,44336,44340,44574,180,1,44,null,null,null,null,null,null,"X",null,0.80357144236901512]
[1,181,2021,"FDLRUU-CD-181-2021","https://community.secop.gov.co/Public/Tendering/OpportunityDetail/Index?noticeUID=CO1.NTC.1816502&isFromPublicArea=True&isModal=False\n","Contratos de prestación de servicios profesionales y de apoyo a la gestión","Contratación directa","Prestación de servicios profesionales y de apoyo a la gestión, o para la ejecución de trabajos artísticos que sólo puedan encomendarse a determinadas personas naturales;","PRESTAR SUS SERVICIOS PROFESIONALES EN EL PROCESO DE TOMA FISICA, VERIFICACION, CLASIFICACION Y ACTUALIZACION DE LA INFORMACION DE BIENES MUEBLES E INMUEBLES DE PROPIEDAD Y/O A CARGO DEL FONDO DE DESARROLLO LOCAL DE RAFAEL URIBE URIBE Y DEPURACION DE LOS CONTRATOS DE COMODATO EN EL AREA DE GESTIÓN PARA EL DESARROLLO LOCAL – ALMACEN DE CONFORMIDAD CON LAS DISPOSICIONES LEGALES VIGENTES","Inversión","Un Nuevo Contrato Social y Ambiental para la Bogotá del Siglo XXI",57,{"$f":"IF(ISERROR(VLOOKUP(L269,Proposito_programa!$C$2:$E$59,2,FALSE)),\" \",VLOOKUP(L269,Proposito_programa!$C$2:$E$59,2,FALSE))","v":"Gestión pública local"},{"$f":"IF(ISERROR(VLOOKUP(L269,Proposito_programa!$C$2:$E$59,3,FALSE)),\" \",VLOOKUP(L269,Proposito_programa!$C$2:$E$59,3,FALSE))","v":"Propósito 5: Construir Bogotá - Región con gobierno abierto, transparente y ciudadanía consciente"},"133011605570000001697",1,1026276229,"ERIKA LIZETH ROJAS RONDON ","Persona Natural",null,null,null,43000000,null,null,null,43000000,37123333,44265,44267,44572,300,null,null,null,null,null,null,null,null,"X",null,0.86333332558139531]
[1,317,2021,"FDLRUU-MC-312-2021","https://community.secop.gov.co/Public/Tendering/OpportunityDetail/Index?noticeUID=CO1.NTC.2415037&isFromPublicArea=True&isModal=False\n","Suministro","Contratación mínima cuantia","No aplica","CONTRATAR EL SUMINISTRO DE PUBLICIDAD IMPRESA Y ELEMENTOS P.O.P. PARA EL FORTALECIMIENTO DE LA IMAGEN INSTITUCIONAL DE LA ALCALDÍA LOCAL DE RA-FAEL URIBE URIBE\"\n\n","Funcionamiento","Un Nuevo Contrato Social y Ambiental para la Bogotá del Siglo XXI","No aplica",{"$f":"IF(ISERROR(VLOOKUP(L270,Proposito_programa!$C$2:$E$59,2,FALSE)),\" \",VLOOKUP(L270,Proposito_programa!$C$2:$E$59,2,FALSE))","v":" "},{"$f":"IF(ISERROR(VLOOKUP(L270,Proposito_programa!$C$2:$E$59,3,FALSE)),\" \",VLOOKUP(L270,Proposito_programa!$C$2:$E$59,3,FALSE))","v":" "},"131020202030310-131020202030701",13,900605957,"EN ALIANZAS SAS","Persona Jurídica",null,null,null,40000000,null,null,null,40000000,0,44544,44557,44799,240,null,null,null,null,null,null,null,"X",null,null,{"$f":"IF(ISERROR(AB270/AA270),\"-\",(AB270/AA270))","v":0}]
[1,202,2021,"FDLRUU-CD-202-2021","https://community.secop.gov.co/Public/Tendering/OpportunityDetail/Index?noticeUID=CO1.NTC.1859804&isFromPublicArea=True&isModal=False\n","Contratos interadministrativos","Contratación directa","Contratos interadministrativos","INSTALACIÓN, CONFIGURACIÓN Y PUESTA EN FUNCIONAMIENTO DEL SERVICIO DE CONECTIVIDAD WIFI E INTERNET PARA LA ALCALDÍA LOCAL DE RAFAEL URIBE URIBE","Funcionamiento","Un Nuevo Contrato Social y Ambiental para la Bogotá del Siglo XXI","No aplica",{"$f":"IF(ISERROR(VLOOKUP(L271,Proposito_programa!$C$2:$E$59,2,FALSE)),\" \",VLOOKUP(L271,Proposito_programa!$C$2:$E$59,2,FALSE))","v":" "},{"$f":"IF(ISERROR(VLOOKUP(L271,Proposito_programa!$C$2:$E$59,3,FALSE)),\" \",VLOOKUP(L271,Proposito_programa!$C$2:$E$59,3,FALSE))","v":" "},"131020202030404",1,899999115,"EMPRESA DE TELECOMUNICACIONES DE BOGOTA   ETB SA ESP","Persona Jurídica",null,null,null,27538873,null,null,null,27538873,16522502,44274,44279,44643,360,null,null,null,null,null,null,null,"X",null,null,0.59997015854642999]
[1,319,2021,"FDLRUU-SAMC-308-2021","https://community.secop.gov.co/Public/Tendering/OpportunityDetail/Index?noticeUID=CO1.NTC.2426928&isFromPublicArea=True&isModal=False\n","Obra pública","Selección abreviada","No aplica","CONTRATAR A PRECIOS UNITARIOS FIJOS, LAS OBRAS REFERENTES AL MANTENIMIENTO Y REPARACIONES LOCATIVAS DE LOS SALONES COMUNALES BOSQUE DE LOS MOLINOS, PRINCIPE DE BOCHICA, VILLA GLADYS, DIANA TURBAY SECTOR EL VALLE Y CLARET, DESTINADO AL USO DOTACIONAL EQUIPAMENTO COLECTIVO CULTURAL DE ESCALA VECINAL, UBICADO EN LA LOCALIDAD DE RAFAEL URIBE URIBE","Inversión","Un Nuevo Contrato Social y Ambiental para la Bogotá del Siglo XXI",55,{"$f":"IF(ISERROR(VLOOKUP(L272,Proposito_programa!$C$2:$E$59,2,FALSE)),\" \",VLOOKUP(L272,Proposito_programa!$C$2:$E$59,2,FALSE))","v":"Fortalecimiento de cultura ciudadana y su institucionalidad"},{"$f":"IF(ISERROR(VLOOKUP(L272,Proposito_programa!$C$2:$E$59,3,FALSE)),\" \",VLOOKUP(L272,Proposito_programa!$C$2:$E$59,3,FALSE))","v":"Propósito 5: Construir Bogotá - Región con gobierno abierto, transparente y ciudadanía consciente"},"133011605550000001689",15,900419400,"EMM INGENIERIA SAS","Persona Jurídica",null,null,null,241594593,null,null,null,241594593,0,44551,"CELEBRADO SIN INICIAR","CELEBRADO SIN INICIAR",120,null,null,null,null,null,null,"X",null,null,null,0]
[1,303,2021,"FDLRUU-CD-303-2021","https://community.secop.gov.co/Public/Tendering/OpportunityDetail/Index?noticeUID=CO1.NTC.2323532&isFromPublicArea=True&isModal=False\n","Contratos de prestación de servicios profesionales y de apoyo a la gestión","Contratación directa","Prestación de servicios profesionales y de apoyo a la gestión, o para la ejecución de trabajos artísticos que sólo puedan encomendarse a determinadas personas naturales;","PRESTAR LOS SERVICIOS TECNICOS PARA DESARROLLAR ACTIVIDADES TENDIENTES A GARANTIZAR LA SALUD Y LA ATENCIÓN DE LAS EMERGENCIAS Y DESASTRES QUE SE PRESENTEN EN LA LOCALIDAD RAFAEL URIBE URIBE","Inversión","Un Nuevo Contrato Social y Ambiental para la Bogotá del Siglo XXI",30,{"$f":"IF(ISERROR(VLOOKUP(L273,Proposito_programa!$C$2:$E$59,2,FALSE)),\" \",VLOOKUP(L273,Proposito_programa!$C$2:$E$59,2,FALSE))","v":"Eficiencia en la atención de emergencias"},{"$f":"IF(ISERROR(VLOOKUP(L273,Proposito_programa!$C$2:$E$59,3,FALSE)),\" \",VLOOKUP(L273,Proposito_programa!$C$2:$E$59,3,FALSE))","v":"Propósito 2 : Cambiar Nuestros Hábitos de Vida para Reverdecer a Bogotá y Adaptarnos y Mitigar la Crisis Climática"},"133011602300000001665",1,52731133,"EMILY KARINA PARRA CASTAÑEDA","Persona Natural",null,null,null,12150000,null,null,null,12150000,0,44485,44508,44642,135,null,null,null,null,null,null,null,"X",null,null,0]
[1,178,2021,"FDLRUU-CD-178-2021","https://community.secop.gov.co/Public/Tendering/OpportunityDetail/Index?noticeUID=CO1.NTC.1809643&isFromPublicArea=True&isModal=False\n","Contratos de prestación de servicios profesionales y de apoyo a la gestión","Contratación directa","Prestación de servicios profesionales y de apoyo a la gestión, o para la ejecución de trabajos artísticos que sólo puedan encomendarse a determinadas personas naturales;","PRESTAR LOS SERVICIOS TÉCNICOS PARA APOYAR A LA ALCALDIA LOCAL DE RAFAEL URIBE URIBE EN LA REALIZACION   DE PIEZAS DIGITALES, DE ANIMACION,   PUBLICITARIAS Y DE IMAGEN INSTITUCIONAL DE GRAN FORMATO","Inversión","Un Nuevo Contrato Social y Ambiental para la Bogotá del Siglo XXI",57,{"$f":"IF(ISERROR(VLOOKUP(L274,Proposito_programa!$C$2:$E$59,2,FALSE)),\" \",VLOOKUP(L274,Proposito_programa!$C$2:$E$59,2,FALSE))","v":"Gestión pública local"},{"$f":"IF(ISERROR(VLOOKUP(L274,Proposito_programa!$C$2:$E$59,3,FALSE)),\" \",VLOOKUP(L274,Proposito_programa!$C$2:$E$59,3,FALSE))","v":"Propósito 5: Construir Bogotá - Región con gobierno abierto, transparente y ciudadanía consciente"},"133011605570000001697",1,1073509741,"ELVER ANDRES CHITIVA JIMENEZ","Persona Natural",null,null,null,39000000,null,null,null,39000000,34840000,44256,44258,44563,300,null,null,null,null,null,null,null,null,"X",null,0.89333333333333331]
[1,136,2021,"FDLRUU-CD-136-2021","https://community.secop.gov.co/Public/Tendering/OpportunityDetail/Index?noticeUID=CO1.NTC.1788680&isFromPublicArea=True&isModal=False\n","Contratos de prestación de servicios profesionales y de apoyo a la gestión","Contratación directa","Prestación de servicios profesionales y de apoyo a la gestión, o para la ejecución de trabajos artísticos que sólo puedan encomendarse a determinadas personas naturales;","“PRESTAR LOS SERVICIOS PROFESIONALES EN LAS RESPUESTAS A LAS EMERGENCIAS QUE SE PRESENTEN EN LA LOCALIDAD, ASÍ COMO A LAS ACTUACIONES ADMINISTRATIVAS QUE SE ESTÉN ADELANTANDO CONFORME A LA NORMATIVIDAD APLICABLE EN EL MARCO DEL CONSEJO LOCAL DE GESTIÓN DEL RIESGO Y CAMBIO CLIMATICO”","Inversión","Un Nuevo Contrato Social y Ambiental para la Bogotá del Siglo XXI",57,{"$f":"IF(ISERROR(VLOOKUP(L275,Proposito_programa!$C$2:$E$59,2,FALSE)),\" \",VLOOKUP(L275,Proposito_programa!$C$2:$E$59,2,FALSE))","v":"Gestión pública local"},{"$f":"IF(ISERROR(VLOOKUP(L275,Proposito_programa!$C$2:$E$59,3,FALSE)),\" \",VLOOKUP(L275,Proposito_programa!$C$2:$E$59,3,FALSE))","v":"Propósito 5: Construir Bogotá - Región con gobierno abierto, transparente y ciudadanía consciente"},"133011605570000001698",1,71624800,"ELKIN DE JESUS GUTIERREZ HENAO","Persona Natural",null,null,null,52000000,null,null,null,{"$f":"+W275+X275+Z275","v":52000000},46800000,44251,44256,44561,300,null,null,null,null,null,null,null,null,"X",null,0.9]
[1,170,2021,"FDLRUU-CD-150-2021","https://community.secop.gov.co/Public/Tendering/OpportunityDetail/Index?noticeUID=CO1.NTC.1800149&isFromPublicArea=True&isModal=False\n","Contratos de prestación de servicios profesionales y de apoyo a la gestión","Contratación directa","Prestación de servicios profesionales y de apoyo a la gestión, o para la ejecución de trabajos artísticos que sólo puedan encomendarse a determinadas personas naturales;","EL CONTRATISTA SE OBLIGA CON EL FONDO DE DESARROLLO LOCAL DE RAFAEL URIBE URIBE A PRESTAR SUS SERVICIOS DE APOYO A LA GESTION LOCAL Y TERRITORIAL DE LOS TEMAS DE SEGURIDAD Y CONVIVENCIA CIUDADANA PARA LA ALCALDIA LOCAL DE RAFAEL URIBE URIBE","Inversión","Un Nuevo Contrato Social y Ambiental para la Bogotá del Siglo XXI",43,{"$f":"IF(ISERROR(VLOOKUP(L276,Proposito_programa!$C$2:$E$59,2,FALSE)),\" \",VLOOKUP(L276,Proposito_programa!$C$2:$E$59,2,FALSE))","v":"Cultura ciudadana para la confianza, la convivencia y la participación desde la vida cotidiana"},{"$f":"IF(ISERROR(VLOOKUP(L276,Proposito_programa!$C$2:$E$59,3,FALSE)),\" \",VLOOKUP(L276,Proposito_programa!$C$2:$E$59,3,FALSE))","v":"Propósito 3: Inspirar confianza y legitimidad para vivir sin miedo y ser epicentro de cultura ciudadana, paz y reconciliación"},"133011603430000001680",1,80911828,"ELISEO ROMERO","Persona Natural",null,null,null,19800000,null,1,3080000,22880000,19726667,44253,44257,44574,270,1,42,null,null,null,null,null,null,"X",null,0.86217950174825175]
[1,17,2021,"FDLRUU-CD-017-2021","https://community.secop.gov.co/Public/Tendering/OpportunityDetail/Index?noticeUID=CO1.NTC.1715490&isFromPublicArea=True&isModal=False\n","Contratos de prestación de servicios profesionales y de apoyo a la gestión","Contratación directa","Prestación de servicios profesionales y de apoyo a la gestión, o para la ejecución de trabajos artísticos que sólo puedan encomendarse a determinadas personas naturales;","PRESTAR LOS SERVICIOS PROFESIONALES AL DESPACHO DE LA ALCALDÍA LOCAL DE RAFAEL URIBE URIBE EN ACTIVIDADES DE ORDEN ADMINISTRATIVO Y DE GESTION QUE SE LE SOLICITEN","Inversión","Un Nuevo Contrato Social y Ambiental para la Bogotá del Siglo XXI",57,{"$f":"IF(ISERROR(VLOOKUP(L277,Proposito_programa!$C$2:$E$59,2,FALSE)),\" \",VLOOKUP(L277,Proposito_programa!$C$2:$E$59,2,FALSE))","v":"Gestión pública local"},{"$f":"IF(ISERROR(VLOOKUP(L277,Proposito_programa!$C$2:$E$59,3,FALSE)),\" \",VLOOKUP(L277,Proposito_programa!$C$2:$E$59,3,FALSE))","v":"Propósito 5: Construir Bogotá - Región con gobierno abierto, transparente y ciudadanía consciente"},"133011605570000001697",1,1031164535,"EDUARD HUMBERTO QUINTANA ARELLANO","Persona Natural",null,null,null,43000000,-31390000,null,null,11610000,11610000,44225,44229,44307,300,null,null,null,null,null,null,null,null,null,"X",1]
[1,230,2021,"FDLRUU-CD-230-2021 ","https://community.secop.gov.co/Public/Tendering/OpportunityDetail/Index?noticeUID=CO1.NTC.2029861&isFromPublicArea=True&isModal=False\n","Contratos de prestación de servicios profesionales y de apoyo a la gestión","Contratación directa","Prestación de servicios profesionales y de apoyo a la gestión, o para la ejecución de trabajos artísticos que sólo puedan encomendarse a determinadas personas naturales;","PRESTAR LOS SERVICIOS DE APOYO A LA GESTIÓN PARA LA CONDUCCIÓN DE LOS VEHÍCULOS LIVIANOS QUE LE SEAN ASIGNADOS Y QUE SE ENCUENTREN AL SERVICIO DE LA ALCALDÍA LOCAL DE RAFAEL URIBE URIBE","Inversión","Un Nuevo Contrato Social y Ambiental para la Bogotá del Siglo XXI",57,{"$f":"IF(ISERROR(VLOOKUP(L278,Proposito_programa!$C$2:$E$59,2,FALSE)),\" \",VLOOKUP(L278,Proposito_programa!$C$2:$E$59,2,FALSE))","v":"Gestión pública local"},{"$f":"IF(ISERROR(VLOOKUP(L278,Proposito_programa!$C$2:$E$59,3,FALSE)),\" \",VLOOKUP(L278,Proposito_programa!$C$2:$E$59,3,FALSE))","v":"Propósito 5: Construir Bogotá - Región con gobierno abierto, transparente y ciudadanía consciente"},"133011605570000001697",1,1013603721,"EDUARD FABIAN RUCINQUE RODRIGUEZ","Persona Natural",null,null,null,15600000,null,null,null,15600000,13520000,44358,44372,44554,180,null,null,null,null,null,null,null,null,"X",null,0.8666666666666667]
[1,42,2021,"FDLRUU-CD-042-2021","https://community.secop.gov.co/Public/Tendering/OpportunityDetail/Index?noticeUID=CO1.NTC.1730421&isFromPublicArea=True&isModal=False\n","Contratos de prestación de servicios profesionales y de apoyo a la gestión","Contratación directa","Prestación de servicios profesionales y de apoyo a la gestión, o para la ejecución de trabajos artísticos que sólo puedan encomendarse a determinadas personas naturales;","PRESTAR LOS SERVICIOS PROFESIONALES PARA APOYAR EL SEGUIMIENTO Y APOYO A LA SUPERVISION DE LOS PROYECTOS DE INFRAESTRUCTURA SOBRE LAS METAS ESTABLECIDAS EN EL PLAN DE DESARROLLO LOCAL","Inversión","Un Nuevo Contrato Social y Ambiental para la Bogotá del Siglo XXI",57,{"$f":"IF(ISERROR(VLOOKUP(L279,Proposito_programa!$C$2:$E$59,2,FALSE)),\" \",VLOOKUP(L279,Proposito_programa!$C$2:$E$59,2,FALSE))","v":"Gestión pública local"},{"$f":"IF(ISERROR(VLOOKUP(L279,Proposito_programa!$C$2:$E$59,3,FALSE)),\" \",VLOOKUP(L279,Proposito_programa!$C$2:$E$59,3,FALSE))","v":"Propósito 5: Construir Bogotá - Región con gobierno abierto, transparente y ciudadanía consciente"},"133011605570000001697",1,79725057,"EDSON ROSAS ALFONSO","Persona Natural",null,null,null,67000000,null,1,7593333,74593333,65213333,44232,44236,44574,300,1,35,null,null,null,null,null,null,"X",null,0.87425149644405886]
[1,114,2021,"FDLRUU-CD-114-2021","https://community.secop.gov.co/Public/Tendering/OpportunityDetail/Index?noticeUID=CO1.NTC.1775324&isFromPublicArea=True&isModal=False","Contratos de prestación de servicios profesionales y de apoyo a la gestión","Contratación directa","Prestación de servicios profesionales y de apoyo a la gestión, o para la ejecución de trabajos artísticos que sólo puedan encomendarse a determinadas personas naturales;","PRESTAR LOS SERVICIOS PROFESIONALES PARA LA OPERACIÓN, PRESTACIÓN, SEGUIMIENTO Y CUMPLIMIENTO PROCEDIMIENTOS ADMINISTRATIVOS OPERATIVOS Y PROGRAMÁTICOS DEL SERVICIO APOYO ECONÓMICO TIPO C, QUE CONTRIBUYAN A LA GARANTÍA DE LOS DERECHOS DE LA POBLACIÓN MAYOR EN EL MARCO DE LA POLÍTICA PÚBLICA SOCIAL PARA EL ENVEJECIMIENTO Y LA VEJEZ EN EL DISTRITO CAPITAL A CARGO DE LA ALCALDÍA LOCAL RAFAEL URIBE URIBE","Inversión","Un Nuevo Contrato Social y Ambiental para la Bogotá del Siglo XXI",1,{"$f":"IF(ISERROR(VLOOKUP(L280,Proposito_programa!$C$2:$E$59,2,FALSE)),\" \",VLOOKUP(L280,Proposito_programa!$C$2:$E$59,2,FALSE))","v":"Subsidios y transferencias para la equidad"},{"$f":"IF(ISERROR(VLOOKUP(L280,Proposito_programa!$C$2:$E$59,3,FALSE)),\" \",VLOOKUP(L280,Proposito_programa!$C$2:$E$59,3,FALSE))","v":"Propósito 1: Hacer un nuevo contrato social para incrementar la inclusión social, productiva y política"},"133011601010000001636",1,1022942908,"EDISON YESIR RODRIGUEZ ROMERO","Persona Natural",null,null,null,41600000,null,1,12306667,53906667,48360000,44244,44249,44561,240,1,71,null,null,null,null,null,null,"X",null,0.8971061037774789]
[1,179,2021,"FDLRUU-CD-179-2021","https://community.secop.gov.co/Public/Tendering/OpportunityDetail/Index?noticeUID=CO1.NTC.1812077&isFromPublicArea=True&isModal=False\n","Contratos de prestación de servicios profesionales y de apoyo a la gestión","Contratación directa","Prestación de servicios profesionales y de apoyo a la gestión, o para la ejecución de trabajos artísticos que sólo puedan encomendarse a determinadas personas naturales;","PRESTAR LOS SERVICIOS PROFESIONALES EN EL AREA DE GESTION DE DESARROLLO LOCAL EN EL APOYO A LA SUPERVISION DE LOS CONTRATOS Y/O CONVENIOS QUE LE SEAN DESIGNADOS EN SU IMPLEMENTACION Y SEGUIMIENTO EN LA LOCALIDAD DE RAFAEL URIBE URIBE","Inversión","Un Nuevo Contrato Social y Ambiental para la Bogotá del Siglo XXI",57,{"$f":"IF(ISERROR(VLOOKUP(L281,Proposito_programa!$C$2:$E$59,2,FALSE)),\" \",VLOOKUP(L281,Proposito_programa!$C$2:$E$59,2,FALSE))","v":"Gestión pública local"},{"$f":"IF(ISERROR(VLOOKUP(L281,Proposito_programa!$C$2:$E$59,3,FALSE)),\" \",VLOOKUP(L281,Proposito_programa!$C$2:$E$59,3,FALSE))","v":"Propósito 5: Construir Bogotá - Región con gobierno abierto, transparente y ciudadanía consciente"},"133011605570000001697",1,80372860,"EDISON ANGULO ARIAS ","Persona Natural",null,null,null,60000000,null,null,null,60000000,53400000,44257,44259,44564,300,null,null,null,null,null,null,null,null,"X",null,0.89]
[1,98,2021,"FDLRUU-CD-098-2021","https://community.secop.gov.co/Public/Tendering/OpportunityDetail/Index?noticeUID=CO1.NTC.1758955&isFromPublicArea=True&isModal=False\n","Contratos de prestación de servicios profesionales y de apoyo a la gestión","Contratación directa","Prestación de servicios profesionales y de apoyo a la gestión, o para la ejecución de trabajos artísticos que sólo puedan encomendarse a determinadas personas naturales;","PRESTAR LOS SERVICIOS PROFESIONALES PARA ACOMPAÑAR LOS PROCESOS DE FORMULACION, EVALUACIÓN Y SEGUIMIENTO DE LOS PROYECTOS DE INFRAESTRUCTURA, MALLA VIAL, SALONES COMUNALES, MITIGACION ESPACIO PÚBLICO Y PARQUES DE LA LOCALIDAD DE RAFAEL URIBE URIBE","Inversión","Un Nuevo Contrato Social y Ambiental para la Bogotá del Siglo XXI",57,{"$f":"IF(ISERROR(VLOOKUP(L282,Proposito_programa!$C$2:$E$59,2,FALSE)),\" \",VLOOKUP(L282,Proposito_programa!$C$2:$E$59,2,FALSE))","v":"Gestión pública local"},{"$f":"IF(ISERROR(VLOOKUP(L282,Proposito_programa!$C$2:$E$59,3,FALSE)),\" \",VLOOKUP(L282,Proposito_programa!$C$2:$E$59,3,FALSE))","v":"Propósito 5: Construir Bogotá - Región con gobierno abierto, transparente y ciudadanía consciente"},"133011605570000001697",1,79468757,"EDGAR IVAN SEPULVEDA PARRA","Persona Natural",null,null,null,57000000,null,1,5510000,62510000,54340000,44239,44242,44574,300,1,29,null,null,null,null,null,null,"X",null,0.8693009118541033]
[1,174,2021,"FDLRUU-CD-150-2021","https://community.secop.gov.co/Public/Tendering/OpportunityDetail/Index?noticeUID=CO1.NTC.1800149&isFromPublicArea=True&isModal=False\n","Contratos de prestación de servicios profesionales y de apoyo a la gestión","Contratación directa","Prestación de servicios profesionales y de apoyo a la gestión, o para la ejecución de trabajos artísticos que sólo puedan encomendarse a determinadas personas naturales;","EL CONTRATISTA SE OBLIGA CON EL FONDO DE DESARROLLO LOCAL DE RAFAEL URIBE URIBE A PRESTAR SUS SERVICIOS DE APOYO A LA GESTION LOCAL Y TERRITORIAL DE LOS TEMAS DE SEGURIDAD Y CONVIVENCIA CIUDADANA PARA LA ALCALDIA LOCAL DE RAFAEL URIBE URIBE","Inversión","Un Nuevo Contrato Social y Ambiental para la Bogotá del Siglo XXI",43,{"$f":"IF(ISERROR(VLOOKUP(L283,Proposito_programa!$C$2:$E$59,2,FALSE)),\" \",VLOOKUP(L283,Proposito_programa!$C$2:$E$59,2,FALSE))","v":"Cultura ciudadana para la confianza, la convivencia y la participación desde la vida cotidiana"},{"$f":"IF(ISERROR(VLOOKUP(L283,Proposito_programa!$C$2:$E$59,3,FALSE)),\" \",VLOOKUP(L283,Proposito_programa!$C$2:$E$59,3,FALSE))","v":"Propósito 3: Inspirar confianza y legitimidad para vivir sin miedo y ser epicentro de cultura ciudadana, paz y reconciliación"},"133011603430000001680",1,1015483940,"EDGAR ANDRES RAMIREZ RUIZ","Persona Natural",null,null,null,19800000,null,1,3006667,22806667,19653333,44256,44258,44574,270,1,41,null,null,null,null,null,null,"X",null,0.86173630719473393]
[1,67439,2021,"OC-67439","https://www.colombiacompra.gov.co/tienda-virtual-del-estado-colombiano/ordenes-compra/67439\n","Suministro","Selección abreviada","Acuerdo marco de precios ","CONTRATAR LA ADQUISICIÓN DE CARPETAS DE ARCHIVO Y PAPEL PARA LA ALCALDIA LOCAL DE RAFAEL URIBE URIBE”","Funcionamiento","Un Nuevo Contrato Social y Ambiental para la Bogotá del Siglo XXI","No aplica",{"$f":"IF(ISERROR(VLOOKUP(L284,Proposito_programa!$C$2:$E$59,2,FALSE)),\" \",VLOOKUP(L284,Proposito_programa!$C$2:$E$59,2,FALSE))","v":" "},{"$f":"IF(ISERROR(VLOOKUP(L284,Proposito_programa!$C$2:$E$59,3,FALSE)),\" \",VLOOKUP(L284,Proposito_programa!$C$2:$E$59,3,FALSE))","v":" "},"1310202010202",1,860028580,"DISPAPELES S.A.S","Persona Jurídica",null,null,null,14776406,null,1,5222470,19998876,18439929,44302,44305,44366,30,1,30,null,null,null,null,null,null,"X",null,0.92204826911272408]
[1,72,2021,"FDLRUU-CD-072-2021","https://community.secop.gov.co/Public/Tendering/OpportunityDetail/Index?noticeUID=CO1.NTC.1758144&isFromPublicArea=True&isModal=False\n","Contratos de prestación de servicios profesionales y de apoyo a la gestión","Contratación directa","Prestación de servicios profesionales y de apoyo a la gestión, o para la ejecución de trabajos artísticos que sólo puedan encomendarse a determinadas personas naturales;","EL CONTRATISTA SE OBLIGA A PRESTAR SUS SERVICIOS DE AUXILIAR ADMINISTRATIVO A LA JUNTA ADMINISTRADORA LOCAL DE LA ALCALDÍA LOCAL DE RAFAEL URIBE URIBE","Inversión","Un Nuevo Contrato Social y Ambiental para la Bogotá del Siglo XXI",57,{"$f":"IF(ISERROR(VLOOKUP(L285,Proposito_programa!$C$2:$E$59,2,FALSE)),\" \",VLOOKUP(L285,Proposito_programa!$C$2:$E$59,2,FALSE))","v":"Gestión pública local"},{"$f":"IF(ISERROR(VLOOKUP(L285,Proposito_programa!$C$2:$E$59,3,FALSE)),\" \",VLOOKUP(L285,Proposito_programa!$C$2:$E$59,3,FALSE))","v":"Propósito 5: Construir Bogotá - Región con gobierno abierto, transparente y ciudadanía consciente"},"133011605570000001697",1,52126179,"DILIA YINET MEDINA ROJAS ","Persona Natural",null,null,null,26000000,null,1,2513333,28513333,24786667,44239,44242,44574,300,1,29,null,null,null,null,null,null,"X",null,0.86930093370704853]
[1,254,2021,"FLDRUU-CD-254-2021","https://community.secop.gov.co/Public/Tendering/OpportunityDetail/Index?noticeUID=CO1.NTC.2164900&isFromPublicArea=True&isModal=False\n","Contratos de prestación de servicios profesionales y de apoyo a la gestión","Contratación directa","Prestación de servicios profesionales y de apoyo a la gestión, o para la ejecución de trabajos artísticos que sólo puedan encomendarse a determinadas personas naturales;","PRESTAR SERVICIOS DE APOYO A LA GESTIÓN LOCAL EN LOS TEMAS DE MITIGACIÓN DEL RIESGO EN CAMPO, EN EL MARCO DEL PLAN DE DESARROLLO LOCAL DE LA LOCALIDAD DE RAFAEL URIBE URIBE","Inversión","Un Nuevo Contrato Social y Ambiental para la Bogotá del Siglo XXI",30,{"$f":"IF(ISERROR(VLOOKUP(L286,Proposito_programa!$C$2:$E$59,2,FALSE)),\" \",VLOOKUP(L286,Proposito_programa!$C$2:$E$59,2,FALSE))","v":"Eficiencia en la atención de emergencias"},{"$f":"IF(ISERROR(VLOOKUP(L286,Proposito_programa!$C$2:$E$59,3,FALSE)),\" \",VLOOKUP(L286,Proposito_programa!$C$2:$E$59,3,FALSE))","v":"Propósito 2 : Cambiar Nuestros Hábitos de Vida para Reverdecer a Bogotá y Adaptarnos y Mitigar la Crisis Climática"},"133011602300000001665",1,1023921942,"DIEGO ANDRES MORALES CASTIBLANCO","Persona Natural",null,null,null,8100000,null,null,null,8100000,6180000,44419,44426,44563,135,null,null,null,null,null,null,null,null,"X",null,0.76296296296296295]
[1,165,2021,"FDLRUU-CD-150-2021","https://community.secop.gov.co/Public/Tendering/OpportunityDetail/Index?noticeUID=CO1.NTC.1800149&isFromPublicArea=True&isModal=False\n","Contratos de prestación de servicios profesionales y de apoyo a la gestión","Contratación directa","Prestación de servicios profesionales y de apoyo a la gestión, o para la ejecución de trabajos artísticos que sólo puedan encomendarse a determinadas personas naturales;","EL CONTRATISTA SE OBLIGA CON EL FONDO DE DESARROLLO LOCAL DE RAFAEL URIBE URIBE A PRESTAR SUS SERVICIOS DE APOYO A LA GESTION LOCAL Y TERRITORIAL DE LOS TEMAS DE SEGURIDAD Y CONVIVENCIA CIUDADANA PARA LA ALCALDIA LOCAL DE RAFAEL URIBE URIBE","Inversión","Un Nuevo Contrato Social y Ambiental para la Bogotá del Siglo XXI",43,{"$f":"IF(ISERROR(VLOOKUP(L287,Proposito_programa!$C$2:$E$59,2,FALSE)),\" \",VLOOKUP(L287,Proposito_programa!$C$2:$E$59,2,FALSE))","v":"Cultura ciudadana para la confianza, la convivencia y la participación desde la vida cotidiana"},{"$f":"IF(ISERROR(VLOOKUP(L287,Proposito_programa!$C$2:$E$59,3,FALSE)),\" \",VLOOKUP(L287,Proposito_programa!$C$2:$E$59,3,FALSE))","v":"Propósito 3: Inspirar confianza y legitimidad para vivir sin miedo y ser epicentro de cultura ciudadana, paz y reconciliación"},"133011603430000001680",1,79287603,"DIEGO ANDRES LOPEZ MORENO","Persona Natural",null,null,null,19800000,null,1,3153333,22953333,19800000,44253,44256,44574,270,1,43,null,null,null,null,null,null,"X",null,0.86261982083386324]
[1,132,2021,"FDLRUU-CD-132-2021","https://community.secop.gov.co/Public/Tendering/OpportunityDetail/Index?noticeUID=CO1.NTC.1787834&isFromPublicArea=True&isModal=False\n","Contratos de prestación de servicios profesionales y de apoyo a la gestión","Contratación directa","Prestación de servicios profesionales y de apoyo a la gestión, o para la ejecución de trabajos artísticos que sólo puedan encomendarse a determinadas personas naturales;","PRESTAR LOS SERVICIOS PROFESIONALES PARA LA OPERACIÓN, SEGUIMIENTO Y CUMPLIMIENTO DE LOS PROCESOS Y PROCEDIMIENTOS DEL SERVICIO APOYO ECONÓMICO TIPO C, REQUERIDOS PARA EL OPORTUNO Y ADECUADO REGISTRO, CRUCE Y REPORTE DE LOS DATOS EN EL SISTEMA MISIONAL – SIRBE, QUE CONTRIBUYAN A LA GARANTÍA DE LOS DERECHOS DE LA POBLACIÓN MAYOR EN EL MARCO DE LA POLÍTICA PÚBLICA SOCIAL PARA EL ENVEJECIMIENTO Y LA VEJEZ EN EL DISTRITO CAPITAL A CARGO DE LA ALCALDÍA...","Inversión","Un Nuevo Contrato Social y Ambiental para la Bogotá del Siglo XXI",1,{"$f":"IF(ISERROR(VLOOKUP(L288,Proposito_programa!$C$2:$E$59,2,FALSE)),\" \",VLOOKUP(L288,Proposito_programa!$C$2:$E$59,2,FALSE))","v":"Subsidios y transferencias para la equidad"},{"$f":"IF(ISERROR(VLOOKUP(L288,Proposito_programa!$C$2:$E$59,3,FALSE)),\" \",VLOOKUP(L288,Proposito_programa!$C$2:$E$59,3,FALSE))","v":"Propósito 1: Hacer un nuevo contrato social para incrementar la inclusión social, productiva y política"},"133011601010000001636",1,1031134255,"DIEGO ALEXANDER GUERRERO RODRIGUEZ","Persona Natural",null,null,null,41600000,null,null,null,41600000,41600000,44250,44252,44493,240,null,null,null,null,null,null,null,null,"X",null,1]
[1,133,2021,"FDLRUU-CO-133-2021","https://community.secop.gov.co/Public/Tendering/OpportunityDetail/Index?noticeUID=CO1.NTC.1791825&isFromPublicArea=True&isModal=False\n","Contratos de prestación de servicios profesionales y de apoyo a la gestión","Contratación directa","Prestación de servicios profesionales y de apoyo a la gestión, o para la ejecución de trabajos artísticos que sólo puedan encomendarse a determinadas personas naturales;","EL CONTRATISTA SE OBLIGA A PRESTAR SUS SERVICIOS PROFESIONALES EN EL ÁREA DE GESTIÓN DEL DESARROLLO LOCAL - PLANEACIÓN, REALIZANDO LAS ACTIVIDADES PROPIAS PARA LA FORMULACION, EJECUCIÓN Y SEGUIMIENTO DE LOS PROYECTOS DE INVERSIÓN DEL PLAN DE DESARROLLO LOCAL 2021 – 2024 RELACIONADOS CON LOS SECTORES HABITAT Y AMBIENTE","Inversión","Un Nuevo Contrato Social y Ambiental para la Bogotá del Siglo XXI",57,{"$f":"IF(ISERROR(VLOOKUP(L289,Proposito_programa!$C$2:$E$59,2,FALSE)),\" \",VLOOKUP(L289,Proposito_programa!$C$2:$E$59,2,FALSE))","v":"Gestión pública local"},{"$f":"IF(ISERROR(VLOOKUP(L289,Proposito_programa!$C$2:$E$59,3,FALSE)),\" \",VLOOKUP(L289,Proposito_programa!$C$2:$E$59,3,FALSE))","v":"Propósito 5: Construir Bogotá - Región con gobierno abierto, transparente y ciudadanía consciente"},"133011605570000001697",1,1026279529,"DIANA CAROLINA PINZON PEREZ","Persona Natural",null,null,null,52000000,null,null,null,52000000,46280000,44251,44259,44564,300,null,null,null,null,null,null,null,null,"X",null,0.89]
[1,171,2021,"FDLRUU-CD-150-2021","https://community.secop.gov.co/Public/Tendering/OpportunityDetail/Index?noticeUID=CO1.NTC.1800149&isFromPublicArea=True&isModal=False\n","Contratos de prestación de servicios profesionales y de apoyo a la gestión","Contratación directa","Prestación de servicios profesionales y de apoyo a la gestión, o para la ejecución de trabajos artísticos que sólo puedan encomendarse a determinadas personas naturales;","EL CONTRATISTA SE OBLIGA CON EL FONDO DE DESARROLLO LOCAL DE RAFAEL URIBE URIBE A PRESTAR SUS SERVICIOS DE APOYO A LA GESTION LOCAL Y TERRITORIAL DE LOS TEMAS DE SEGURIDAD Y CONVIVENCIA CIUDADANA PARA LA ALCALDIA LOCAL DE RAFAEL URIBE URIBE","Inversión","Un Nuevo Contrato Social y Ambiental para la Bogotá del Siglo XXI",43,{"$f":"IF(ISERROR(VLOOKUP(L290,Proposito_programa!$C$2:$E$59,2,FALSE)),\" \",VLOOKUP(L290,Proposito_programa!$C$2:$E$59,2,FALSE))","v":"Cultura ciudadana para la confianza, la convivencia y la participación desde la vida cotidiana"},{"$f":"IF(ISERROR(VLOOKUP(L290,Proposito_programa!$C$2:$E$59,3,FALSE)),\" \",VLOOKUP(L290,Proposito_programa!$C$2:$E$59,3,FALSE))","v":"Propósito 3: Inspirar confianza y legitimidad para vivir sin miedo y ser epicentro de cultura ciudadana, paz y reconciliación"},"133011603430000001680",1,1010183800,"DELIO ELICEO URBINA TORRES ","Persona Natural",null,null,null,19800000,null,1,3080000,22880000,19726667,44253,44257,44574,270,1,42,null,null,null,null,null,null,"X",null,0.86217950174825175]
[1,189,2021,"FDLRUU-CD-189-2021","https://community.secop.gov.co/Public/Tendering/OpportunityDetail/Index?noticeUID=CO1.NTC.1845967&isFromPublicArea=True&isModal=False\n","Contratos de prestación de servicios profesionales y de apoyo a la gestión","Contratación directa","Prestación de servicios profesionales y de apoyo a la gestión, o para la ejecución de trabajos artísticos que sólo puedan encomendarse a determinadas personas naturales;","APOYAR JURIDICAMENTE LOS PROCESOS DE REUBICACIÓN Y DE RECUPERACIÓN DE ESPACIO PÚBLICO, CONTROL DE ESTABLECIMIENTOS DE COMERCIO, ASÍ COMO EN LOS DEMÁS PROCESOS ADMINISTRATIVOS A CARGO DEL ÁREA GESTIÓN POLICIVA DE LA ALCALDÍA LOCAL DE RAFAEL URIBE URIBE","Inversión","Un Nuevo Contrato Social y Ambiental para la Bogotá del Siglo XXI",57,{"$f":"IF(ISERROR(VLOOKUP(L291,Proposito_programa!$C$2:$E$59,2,FALSE)),\" \",VLOOKUP(L291,Proposito_programa!$C$2:$E$59,2,FALSE))","v":"Gestión pública local"},{"$f":"IF(ISERROR(VLOOKUP(L291,Proposito_programa!$C$2:$E$59,3,FALSE)),\" \",VLOOKUP(L291,Proposito_programa!$C$2:$E$59,3,FALSE))","v":"Propósito 5: Construir Bogotá - Región con gobierno abierto, transparente y ciudadanía consciente"},"133011605570000001698",1,52072284,"DELIA MARLEN PINTO BERNAL","Persona Natural",null,null,null,52000000,null,null,null,52000000,41946667,44279,44284,44589,300,null,null,null,null,null,null,null,null,"X",null,0.80666667307692308]
[1,197,2021,"FDLRUU-CD-197-2021","https://community.secop.gov.co/Public/Tendering/OpportunityDetail/Index?noticeUID=CO1.NTC.1848488&isFromPublicArea=True&isModal=False\n","Contratos de prestación de servicios profesionales y de apoyo a la gestión","Contratación directa","Prestación de servicios profesionales y de apoyo a la gestión, o para la ejecución de trabajos artísticos que sólo puedan encomendarse a determinadas personas naturales;","PRESTAR SUS SERVICIOS DE APOYO ADMINISTRATIVO, ASISTENCIAL EN EL PROCESO DE TOMA FÍSICA, VERIFICACIÓN, CLASIFICACIÓN Y \nACTUALIZACIÓN DE LA INFORMACIÓN DE BIENES MUEBLES E INMUEBLES DE PROPIEDAD Y/O A CARGO DEL FONDO DE DESARROLLO LOCAL DE RAFAEL URIBE URIBE Y DEPURACIÓN \nDE LOS CONTRATOS DE COMODATO EN EL AREA DE GESTIÓN PARA EL DESARROLLO LOCAL – ALMACEN DE CONFORMIDAD CON LAS DISPOSICIONES LEGALES VIGENTES","Inversión","Un Nuevo Contrato Social y Ambiental para la Bogotá del Siglo XXI",57,{"$f":"IF(ISERROR(VLOOKUP(L292,Proposito_programa!$C$2:$E$59,2,FALSE)),\" \",VLOOKUP(L292,Proposito_programa!$C$2:$E$59,2,FALSE))","v":"Gestión pública local"},{"$f":"IF(ISERROR(VLOOKUP(L292,Proposito_programa!$C$2:$E$59,3,FALSE)),\" \",VLOOKUP(L292,Proposito_programa!$C$2:$E$59,3,FALSE))","v":"Propósito 5: Construir Bogotá - Región con gobierno abierto, transparente y ciudadanía consciente"},"133011605570000001697",1,80833968,"DAVID RICARDO ALARCÓN LÓPEZ","Persona Natural",null,null,null,26000000,null,null,null,26000000,21493333,44272,44278,44583,300,null,null,null,null,null,null,null,null,"X",null,0.8266666538461539]
[1,272,2021,"FDLRUU-CD-272-2021","https://community.secop.gov.co/Public/Tendering/OpportunityDetail/Index?noticeUID=CO1.NTC.2172964&isFromPublicArea=True&isModal=False\n","Contratos de prestación de servicios profesionales y de apoyo a la gestión","Contratación directa","Prestación de servicios profesionales y de apoyo a la gestión, o para la ejecución de trabajos artísticos que sólo puedan encomendarse a determinadas personas naturales;","PRESTAR SUS SERVICIOS ASISTENCIALES PARA LA GESTIÓN DEL RIESGO, EN EL MARCO DE LOS VIGÍAS DEL RIESGO DE LA LOCALIDAD DE RAFAEL URIBE URIBE.","Inversión","Un Nuevo Contrato Social y Ambiental para la Bogotá del Siglo XXI",30,{"$f":"IF(ISERROR(VLOOKUP(L293,Proposito_programa!$C$2:$E$59,2,FALSE)),\" \",VLOOKUP(L293,Proposito_programa!$C$2:$E$59,2,FALSE))","v":"Eficiencia en la atención de emergencias"},{"$f":"IF(ISERROR(VLOOKUP(L293,Proposito_programa!$C$2:$E$59,3,FALSE)),\" \",VLOOKUP(L293,Proposito_programa!$C$2:$E$59,3,FALSE))","v":"Propósito 2 : Cambiar Nuestros Hábitos de Vida para Reverdecer a Bogotá y Adaptarnos y Mitigar la Crisis Climática"},"133011602300000001665",1,1000346902,"DAVID GUSTAVO ALVAREZ LOPEZ","Persona Natural",null,null,null,8100000,null,null,null,8100000,5760000,44421,44433,44570,135,null,null,null,null,null,null,null,null,"X",null,0.71111111111111114]
[1,280,2021,"FDLRUU-CD-280-2021","https://community.secop.gov.co/Public/Tendering/ContractNoticePhases/View?PPI=CO1.PPI.14848698&isFromPublicArea=True&isModal=False\n","Contratos de prestación de servicios profesionales y de apoyo a la gestión","Contratación directa","Prestación de servicios profesionales y de apoyo a la gestión, o para la ejecución de trabajos artísticos que sólo puedan encomendarse a determinadas personas naturales;","PRESTAR SERVICIOS PROFESIONALES PARA REALIZAR ACUERDOS ENTRE LA ALCALDÍA LOCAL DE RAFAEL URIBE URIBE Y SUS HABITANTES PARA VINCULARLOS A LOS PROGRAMAS DEL IDRD \"ESCUELA DE LA BICICLETA\" Y \"AL TRABAJO EN BICI\" QUE MOTIVEN EL USO ADECUADO DE LOS MEDIOS DE TRANSPORTE NO MOTORIZADOS, POR MEDIO DE LA PROMOCIÓN DE LA NORMATIVIDAD PARA SU APROPIACIÓN Y APLICACIÓN EN EL MARCO DEL PROYECTO DE INVERSIÓN 1681","Inversión","Un Nuevo Contrato Social y Ambiental para la Bogotá del Siglo XXI",45,{"$f":"IF(ISERROR(VLOOKUP(L294,Proposito_programa!$C$2:$E$59,2,FALSE)),\" \",VLOOKUP(L294,Proposito_programa!$C$2:$E$59,2,FALSE))","v":"Espacio público más seguro y construido colectivamente"},{"$f":"IF(ISERROR(VLOOKUP(L294,Proposito_programa!$C$2:$E$59,3,FALSE)),\" \",VLOOKUP(L294,Proposito_programa!$C$2:$E$59,3,FALSE))","v":"Propósito 3: Inspirar confianza y legitimidad para vivir sin miedo y ser epicentro de cultura ciudadana, paz y reconciliación"},"133011603450000001681",1,1012394592,"DAVID CASTAÑO CHIGUASUQUE","Persona Natural",null,null,null,20000000,null,null,null,20000000,14666667,44440,44442,44563,120,null,null,null,null,null,null,null,null,"X",null,0.73333334999999999]
[1,120,2021,"FDLRUU-CD-120-2021","https://community.secop.gov.co/Public/Tendering/OpportunityDetail/Index?noticeUID=CO1.NTC.1779717&isFromPublicArea=True&isModal=False\n","Contratos de prestación de servicios profesionales y de apoyo a la gestión","Contratación directa","Prestación de servicios profesionales y de apoyo a la gestión, o para la ejecución de trabajos artísticos que sólo puedan encomendarse a determinadas personas naturales;","PRESTAR LOS SERVICIOS TÉCNICOS PARA LA OPERACIÓN, SEGUIMIENTO Y CUMPLIMIENTO DE LOS PROCESOS Y PROCEDIMIENTOS DEL SERVICIO APOYOS PARA LA SEGURIDAD ECONÓMICA TIPO C, REQUERIDOS PARA EL OPORTUNO Y ADECUADO REGISTRO, CRUCE Y REPORTE DE LOS DATOS EN EL SISTEMA MISIONAL SIRBE, QUE CONTRIBUYAN A LA GARANTÍA DE LOS DERECHOS DE LA POBLACIÓN MAYOR EN EL MARCO DE LA POLÍTICA PÚBLICA SOCIAL PARA EL ENVEJECIMIENTO Y LA VEJEZ EN EL DISTRITO CAPITAL A CARGO...","Inversión","Un Nuevo Contrato Social y Ambiental para la Bogotá del Siglo XXI",1,{"$f":"IF(ISERROR(VLOOKUP(L295,Proposito_programa!$C$2:$E$59,2,FALSE)),\" \",VLOOKUP(L295,Proposito_programa!$C$2:$E$59,2,FALSE))","v":"Subsidios y transferencias para la equidad"},{"$f":"IF(ISERROR(VLOOKUP(L295,Proposito_programa!$C$2:$E$59,3,FALSE)),\" \",VLOOKUP(L295,Proposito_programa!$C$2:$E$59,3,FALSE))","v":"Propósito 1: Hacer un nuevo contrato social para incrementar la inclusión social, productiva y política"},"133011601010000001636",1,1022435829,"DANIELA USTARIS ORTEGA ","Persona Natural",null,null,null,26400000,null,1,9570000,35970000,31020000,44245,44246,44574,240,1,87,null,null,null,null,null,null,"X",null,0.86238532110091748]
[1,14,2021,"FDLRUU-CD-014-2021","https://community.secop.gov.co/Public/Tendering/OpportunityDetail/Index?noticeUID=CO1.NTC.1696919&isFromPublicArea=True&isModal=False\n","Contratos de prestación de servicios profesionales y de apoyo a la gestión","Contratación directa","Prestación de servicios profesionales y de apoyo a la gestión, o para la ejecución de trabajos artísticos que sólo puedan encomendarse a determinadas personas naturales;","PRESTAR LOS SERVICIOS PROFESIONALES COMO ABOGADO PARA APOYAR LA GESTIÓN CONTRACTUAL DEL ÁREA GESTIÓN DEL DESARROLLO LOCAL DE LA ALCALDÍA LOCAL DE RAFAEL URIBE URIBE EN LOS DIFERENTES PROCESOS DE SELECCIÓN EN SUS ETAPAS PRECONTRACTUAL, CONTRACTUAL Y POSTCONTRACTUAL ","Inversión","Un Nuevo Contrato Social y Ambiental para la Bogotá del Siglo XXI",57,{"$f":"IF(ISERROR(VLOOKUP(L296,Proposito_programa!$C$2:$E$59,2,FALSE)),\" \",VLOOKUP(L296,Proposito_programa!$C$2:$E$59,2,FALSE))","v":"Gestión pública local"},{"$f":"IF(ISERROR(VLOOKUP(L296,Proposito_programa!$C$2:$E$59,3,FALSE)),\" \",VLOOKUP(L296,Proposito_programa!$C$2:$E$59,3,FALSE))","v":"Propósito 5: Construir Bogotá - Región con gobierno abierto, transparente y ciudadanía consciente"},"133011605570000001697",1,1020795504,"DANIELA ALEJANDRA RUBIANO VIDAL","Persona Natural",null,null,null,67000000,null,null,null,67000000,67000000,44223,44225,44528,300,null,null,null,null,null,null,null,null,"X",null,1]
[1,134,2021,"FDLRUU-CD-134-2021","https://community.secop.gov.co/Public/Tendering/ContractNoticePhases/View?PPI=CO1.PPI.12152016&isFromPublicArea=True&isModal=False","Contratos de prestación de servicios profesionales y de apoyo a la gestión","Contratación directa","Prestación de servicios profesionales y de apoyo a la gestión, o para la ejecución de trabajos artísticos que sólo puedan encomendarse a determinadas personas naturales;","PRESTAR LOS SERVICIOS TÉCNICOS PARA LA OPERACIÓN, SEGUIMIENTO Y CUMPLIMIENTO DE LOS PROCESOS Y PROCEDIMIENTOS DEL SERVICIO APOYOS PARA LA SEGURIDAD ECONÓMICA TIPO C, REQUERIDOS PARA EL OPORTUNO Y ADECUADO REGISTRO, CRUCE Y REPORTE DE LOS DATOS EN EL SISTEMA MISIONAL SIRBE, QUE CONTRIBUYAN A LA GARANTÍA DE LOS DERECHOS DE LA POBLACIÓN MAYOR EN EL MARCO DE LA POLÍTICA PÚBLICA SOCIAL PARA EL ENVEJECIMIENTO Y LA VEJEZ EN EL DISTRITO CAPITAL A CARGO DE LA ALCALDÍA LOCAL","Inversión","Un Nuevo Contrato Social y Ambiental para la Bogotá del Siglo XXI",1,{"$f":"IF(ISERROR(VLOOKUP(L297,Proposito_programa!$C$2:$E$59,2,FALSE)),\" \",VLOOKUP(L297,Proposito_programa!$C$2:$E$59,2,FALSE))","v":"Subsidios y transferencias para la equidad"},{"$f":"IF(ISERROR(VLOOKUP(L297,Proposito_programa!$C$2:$E$59,3,FALSE)),\" \",VLOOKUP(L297,Proposito_programa!$C$2:$E$59,3,FALSE))","v":"Propósito 1: Hacer un nuevo contrato social para incrementar la inclusión social, productiva y política"},"133011601010000001636",1,1013616944,"DANIEL VELASCO MONSALVE ","Persona Natural",null,null,null,26400000,null,1,7590000,33990000,30470000,44250,44251,44561,240,1,69,null,null,null,null,null,null,"X",null,0.8964401294498382]
[1,13,2021,"FDLRUU-CD-013-2021","https://community.secop.gov.co/Public/Tendering/ContractNoticePhases/View?PPI=CO1.PPI.11756778&isFromPublicArea=True&isModal=False","Contratos de prestación de servicios profesionales y de apoyo a la gestión","Contratación directa","Prestación de servicios profesionales y de apoyo a la gestión, o para la ejecución de trabajos artísticos que sólo puedan encomendarse a determinadas personas naturales;","APOYAR JURÍDICAMENTE LA EJECUCIÓN DE LAS ACCIONES REQUERIDAS PARA LA DEPURACIÓN DE LAS ACTUACIONES ADMINISTRATIVAS QUE CURSAN EN LA ALCALDÍA LOCAL","Inversión","Un Nuevo Contrato Social y Ambiental para la Bogotá del Siglo XXI",57,{"$f":"IF(ISERROR(VLOOKUP(L298,Proposito_programa!$C$2:$E$59,2,FALSE)),\" \",VLOOKUP(L298,Proposito_programa!$C$2:$E$59,2,FALSE))","v":"Gestión pública local"},{"$f":"IF(ISERROR(VLOOKUP(L298,Proposito_programa!$C$2:$E$59,3,FALSE)),\" \",VLOOKUP(L298,Proposito_programa!$C$2:$E$59,3,FALSE))","v":"Propósito 5: Construir Bogotá - Región con gobierno abierto, transparente y ciudadanía consciente"},"133011605570000001698",1,1128470308,"DANIEL SANTIAGO MONTES JIMENEZ","Persona Natural",null,null,null,31200000,null,1,15600000,46800000,41600000,44223,44228,44500,180,1,90,null,null,null,null,null,null,"X",null,0.88888888888888884]
[1,107,2021,"FDLRUU-CD-107-2021","https://community.secop.gov.co/Public/Tendering/OpportunityDetail/Index?noticeUID=CO1.NTC.1771161&isFromPublicArea=True&isModal=False\n","Contratos de prestación de servicios profesionales y de apoyo a la gestión","Contratación directa","Prestación de servicios profesionales y de apoyo a la gestión, o para la ejecución de trabajos artísticos que sólo puedan encomendarse a determinadas personas naturales;","PRESTAR LOS SERVICIOS PROFESIONALES PARA LA OPERACIÓN, PRESTACIÓN, SEGUIMIENTO Y CUMPLIMIENTO PROCEDIMIENTOS ADMINISTRATIVOS OPERATIVOS Y PROGRAMÁTICOS DEL SERVICIO APOYO ECONÓMICO TIPO C, QUE CONTRIBUYAN A LA GARANTÍA DE LOS DERECHOS DE LA POBLACIÓN MAYOR EN EL MARCO DE LA POLÍTICA PÚBLICA SOCIAL PARA EL ENVEJECIMIENTO Y LA VEJEZ EN EL DISTRITO CAPITAL A CARGO DE LA ALCALDÍA LOCAL RAFAEL URIBE URIBE.","Inversión","Un Nuevo Contrato Social y Ambiental para la Bogotá del Siglo XXI",1,{"$f":"IF(ISERROR(VLOOKUP(L299,Proposito_programa!$C$2:$E$59,2,FALSE)),\" \",VLOOKUP(L299,Proposito_programa!$C$2:$E$59,2,FALSE))","v":"Subsidios y transferencias para la equidad"},{"$f":"IF(ISERROR(VLOOKUP(L299,Proposito_programa!$C$2:$E$59,3,FALSE)),\" \",VLOOKUP(L299,Proposito_programa!$C$2:$E$59,3,FALSE))","v":"Propósito 1: Hacer un nuevo contrato social para incrementar la inclusión social, productiva y política"},"133011601010000001636",1,1031156309,"DAILY JASBLEIDY ALBARRACIN BENITEZ","Persona Natural",null,null,null,41600000,null,1,12306667,53906667,48360000,44244,44249,44561,240,1,71,null,null,null,null,null,null,"X",null,0.8971061037774789]
[1,314,2021,"FDLRUU-MC-304-2021","https://community.secop.gov.co/Public/Tendering/OpportunityDetail/Index?noticeUID=CO1.NTC.2401011&isFromPublicArea=True&isModal=False\n","Contratos de prestación de servicios","Contratación mínima cuantia","No aplica","DESARROLLAR LAS ACTIVIDADES DE ADQUISICIÓN E INSTALACIÓN DE ELEMENTOS PARA EL AVANCE EN LA IMPLEMENTACIÓN DEL PLAN INSTITUCIONAL DE GESTIÓN AMBIENTALPIGA- EN LA ALCALDÍA LOCAL DE RAFAEL URIBE URIBE","Inversión","Un Nuevo Contrato Social y Ambiental para la Bogotá del Siglo XXI",57,{"$f":"IF(ISERROR(VLOOKUP(L300,Proposito_programa!$C$2:$E$59,2,FALSE)),\" \",VLOOKUP(L300,Proposito_programa!$C$2:$E$59,2,FALSE))","v":"Gestión pública local"},{"$f":"IF(ISERROR(VLOOKUP(L300,Proposito_programa!$C$2:$E$59,3,FALSE)),\" \",VLOOKUP(L300,Proposito_programa!$C$2:$E$59,3,FALSE))","v":"Propósito 5: Construir Bogotá - Región con gobierno abierto, transparente y ciudadanía consciente"},"133011605570000001697",1,900856657,"D&M SOLUTIONS SAS-D&MS SAS-","Persona Jurídica",null,null,null,24996022,null,null,null,24996022,0,44532,44553,44614,60,null,null,null,null,null,null,null,"X",null,null,0]
[1,328,2021,"FDLRUU-SAMC-318-2021","https://community.secop.gov.co/Public/Tendering/OpportunityDetail/Index?noticeUID=CO1.NTC.2463631&isFromPublicArea=True&isModal=False\n","Contratos de prestación de servicios","Selección abreviada","Selección abreviada por menor cuantía ","REALIZAR ACCIONES PARA EL FORTALECIMIENTO DE LAS CAPACIDADES LOCALES PARA DAR RESPUESTA A EMERGENCIAS Y DESASTRES EN LA LOCALIDAD RAFAEL URIBE URIBE EN EL MARCO DEL PROYECTO DE INVERSIÓN 1665","Inversión","Un Nuevo Contrato Social y Ambiental para la Bogotá del Siglo XXI",30,{"$f":"IF(ISERROR(VLOOKUP(L301,Proposito_programa!$C$2:$E$59,2,FALSE)),\" \",VLOOKUP(L301,Proposito_programa!$C$2:$E$59,2,FALSE))","v":"Eficiencia en la atención de emergencias"},{"$f":"IF(ISERROR(VLOOKUP(L301,Proposito_programa!$C$2:$E$59,3,FALSE)),\" \",VLOOKUP(L301,Proposito_programa!$C$2:$E$59,3,FALSE))","v":"Propósito 2 : Cambiar Nuestros Hábitos de Vida para Reverdecer a Bogotá y Adaptarnos y Mitigar la Crisis Climática"},"133011602300000001665",4,860070301,"CRUZ ROJA BOGOTA SECCIONAL CUNDINAMARCA Y BOGOTA","Persona Jurídica",null,null,null,102490499,null,null,null,102490499,0,44559,"CELEBRADO SIN INICIAR","CELEBRADO SIN INICIAR",90,null,null,null,null,null,null,"X",null,null,null,0]
[1,19,2021,"FDLRUU-CD-019-2021","https://community.secop.gov.co/Public/Tendering/OpportunityDetail/Index?noticeUID=CO1.NTC.1720556&isFromPublicArea=True&isModal=False\n","Contratos de prestación de servicios profesionales y de apoyo a la gestión","Contratación directa","Prestación de servicios profesionales y de apoyo a la gestión, o para la ejecución de trabajos artísticos que sólo puedan encomendarse a determinadas personas naturales;","PRESTACIÓN DE SERVICIOS PROFESIONALES PARA APOYAR LAS ETAPAS PRECONTRACTUAL, CONTRACTUAL Y POSTCONTRACTUAL DE LOS PROCESOS DE ADQUISICIÓN DE BIENES Y SERVICIOS QUE REALICE EL FONDO DE DESARROLLO LOCAL DE RAFAEL URIBE URIBE, DE ACUERDO CON LOS ESTUDIOS PREVIOS","Inversión","Un Nuevo Contrato Social y Ambiental para la Bogotá del Siglo XXI",57,{"$f":"IF(ISERROR(VLOOKUP(L302,Proposito_programa!$C$2:$E$59,2,FALSE)),\" \",VLOOKUP(L302,Proposito_programa!$C$2:$E$59,2,FALSE))","v":"Gestión pública local"},{"$f":"IF(ISERROR(VLOOKUP(L302,Proposito_programa!$C$2:$E$59,3,FALSE)),\" \",VLOOKUP(L302,Proposito_programa!$C$2:$E$59,3,FALSE))","v":"Propósito 5: Construir Bogotá - Región con gobierno abierto, transparente y ciudadanía consciente"},"133011605570000001697",1,1022985336,"CRISTHIAN STEVENS VERA ESCOBAR","Persona Natural",null,null,null,43000000,null,null,null,43000000,15766667,44228,44228,44336,300,null,null,null,null,null,null,null,null,null,"X",0.36666667441860468]
[1,224,2021,"FDLRUU-CD-224-2021","https://community.secop.gov.co/Public/Tendering/OpportunityDetail/Index?noticeUID=CO1.NTC.1988013&isFromPublicArea=True&isModal=False\n","Contratos de prestación de servicios profesionales y de apoyo a la gestión","Contratación directa","Prestación de servicios profesionales y de apoyo a la gestión, o para la ejecución de trabajos artísticos que sólo puedan encomendarse a determinadas personas naturales;","PRESTACIÓN DE SERVICIOS PROFESIONALES EN EL AREA DE GESTION DE DESARROLLO LOCAL PARA APOYAR LAS ETAPAS PRECONTRACTUAL, CONTRACTUAL Y POSTCONTRACTUAL CONFORME A LO ESTABLECIDO EN LA LEY PARA LOS PROCESOS DE ADQUISICIÓN DE BIENES Y SERVICIOS POR PARTE DEL FONDO DE DESARROLLO LOCAL DE RAFAEL URIBE URIBE","Inversión","Un Nuevo Contrato Social y Ambiental para la Bogotá del Siglo XXI",57,{"$f":"IF(ISERROR(VLOOKUP(L303,Proposito_programa!$C$2:$E$59,2,FALSE)),\" \",VLOOKUP(L303,Proposito_programa!$C$2:$E$59,2,FALSE))","v":"Gestión pública local"},{"$f":"IF(ISERROR(VLOOKUP(L303,Proposito_programa!$C$2:$E$59,3,FALSE)),\" \",VLOOKUP(L303,Proposito_programa!$C$2:$E$59,3,FALSE))","v":"Propósito 5: Construir Bogotá - Región con gobierno abierto, transparente y ciudadanía consciente"},"133011605570000001697",1,1022985336,"CRISTHIAN STEVENS VERA ESCOBAR","Persona Natural",null,null,null,54000000,null,null,null,54000000,37400000,44337,44340,44615,270,null,null,null,null,null,null,null,"X",null,null,0.69259259259259254]
[1,111,2021,"FDLRUU-CD-111-2021","https://community.secop.gov.co/Public/Tendering/OpportunityDetail/Index?noticeUID=CO1.NTC.1777218&isFromPublicArea=True&isModal=False\n","Contratos de prestación de servicios profesionales y de apoyo a la gestión","Contratación directa","Prestación de servicios profesionales y de apoyo a la gestión, o para la ejecución de trabajos artísticos que sólo puedan encomendarse a determinadas personas naturales;","PRESTAR LOS SERVICIOS PROFESIONALES PARA LA OPERACIÓN, PRESTACIÓN, SEGUIMIENTO Y CUMPLIMIENTO PROCEDIMIENTOS ADMINISTRATIVOS OPERATIVOS Y PROGRAMÁTICOS DEL SERVICIO APOYO ECONÓMICO TIPO C, QUE CONTRIBUYAN A LA GARANTÍA DE LOS DERECHOS DE LA POBLACIÓN MAYOR EN EL MARCO DE LA POLÍTICA PÚBLICA SOCIAL PARA EL ENVEJECIMIENTO Y LA VEJEZ EN EL DISTRITO CAPITAL A CARGO DE LA ALCALDÍA LOCAL RAFAEL URIBE URIBE”","Inversión","Un Nuevo Contrato Social y Ambiental para la Bogotá del Siglo XXI",1,{"$f":"IF(ISERROR(VLOOKUP(L304,Proposito_programa!$C$2:$E$59,2,FALSE)),\" \",VLOOKUP(L304,Proposito_programa!$C$2:$E$59,2,FALSE))","v":"Subsidios y transferencias para la equidad"},{"$f":"IF(ISERROR(VLOOKUP(L304,Proposito_programa!$C$2:$E$59,3,FALSE)),\" \",VLOOKUP(L304,Proposito_programa!$C$2:$E$59,3,FALSE))","v":"Propósito 1: Hacer un nuevo contrato social para incrementar la inclusión social, productiva y política"},"133011601010000001636",1,1013620667,"CRISTHIAN DAVID GUTIERREZ MEDINA","Persona Natural",null,null,null,41600000,null,1,12306667,53906667,48360000,44246,44249,44561,240,null,71,null,null,null,null,null,null,"X",null,0.8971061037774789]
[1,141,2021,"FDLRUU-CD-141-2021","https://community.secop.gov.co/Public/Tendering/OpportunityDetail/Index?noticeUID=CO1.NTC.1792926&isFromPublicArea=True&isModal=False\n","Contratos de prestación de servicios profesionales y de apoyo a la gestión","Contratación directa","Prestación de servicios profesionales y de apoyo a la gestión, o para la ejecución de trabajos artísticos que sólo puedan encomendarse a determinadas personas naturales;","APOYAR LA GESTIÓN DOCUMENTAL DE LA ALCALDÍA LOCAL, ACOMPAÑANDO AL EQUIPO JURÍDICO DE DEPURACIÓN EN LAS LABORES OPERATIVAS QUE GENERA EL PROCESO DE IMPULSO DE LAS ACTUACIONES ADMINISTRATIVAS EXISTENTES EN LA ALCALDÍA LOCAL DE RAFAEL URIBE URIBE” ","Inversión","Un Nuevo Contrato Social y Ambiental para la Bogotá del Siglo XXI",57,{"$f":"IF(ISERROR(VLOOKUP(L305,Proposito_programa!$C$2:$E$59,2,FALSE)),\" \",VLOOKUP(L305,Proposito_programa!$C$2:$E$59,2,FALSE))","v":"Gestión pública local"},{"$f":"IF(ISERROR(VLOOKUP(L305,Proposito_programa!$C$2:$E$59,3,FALSE)),\" \",VLOOKUP(L305,Proposito_programa!$C$2:$E$59,3,FALSE))","v":"Propósito 5: Construir Bogotá - Región con gobierno abierto, transparente y ciudadanía consciente"},"133011605570000001698",1,1032436573,"CRISTHIAN CAMILO GARAVITO MARTINEZ","Persona Natural",null,null,null,26000000,null,null,null,26000000,23400000,44251,44256,44561,300,null,null,null,null,null,null,null,null,"X",null,0.9]
[1,279,2021,"FDLRUU-SAMC-246-2021","https://community.secop.gov.co/Public/Tendering/OpportunityDetail/Index?noticeUID=CO1.NTC.2171886&isFromPublicArea=True&isModal=False\n","Contratos de prestación de servicios","Selección abreviada","Selección abreviada por menor cuantía ","DESARROLLAR ACCIONES DESDE LOS DISPOSITIVOS DE BASE COMUNITARIA QUE INCLUYAN ESTRATEGIAS DIRIGIDAS A LA COMUNIDAD DE LA LOCALIDAD DE RAFAEL URIBE URIBE ESPECIALMENTE A LOS ADOLESCENTES Y JÓVENES QUE CONTRIBUYAN A LA DISMINUCIÓN DE LOS FACTORES DE RIESGO POR EL CONSUMO DE SPA EN EL MARCO DEL PROYECTO DE INVERSIÓN 1658","Inversión","Un Nuevo Contrato Social y Ambiental para la Bogotá del Siglo XXI",6,{"$f":"IF(ISERROR(VLOOKUP(L306,Proposito_programa!$C$2:$E$59,2,FALSE)),\" \",VLOOKUP(L306,Proposito_programa!$C$2:$E$59,2,FALSE))","v":"Sistema Distrital de Cuidado"},{"$f":"IF(ISERROR(VLOOKUP(L306,Proposito_programa!$C$2:$E$59,3,FALSE)),\" \",VLOOKUP(L306,Proposito_programa!$C$2:$E$59,3,FALSE))","v":"Propósito 1: Hacer un nuevo contrato social para incrementar la inclusión social, productiva y política"},"133011601060000001658",9,900206910,"CORPORACION PUNTOS CARDINALES ","Persona Jurídica",null,null,null,259540355,null,null,null,259540355,38931053,44438,44445,44625,180,null,null,null,null,null,null,null,"X",null,null,0.14999999903675865]
[1,295,2021,"FDLRUU-SAMC-249-2021","https://community.secop.gov.co/Public/Tendering/OpportunityDetail/Index?noticeUID=CO1.NTC.2229030&isFromPublicArea=True&isModal=False","Contratos de prestación de servicios","Selección abreviada","Selección abreviada por menor cuantía ","DESARROLLAR ACCIONES Y ESTRATEGIAS ENCAMINADAS A LA PREVENCIÓN DEL EMBARAZO EN ADOLESCENTES DELA LOCALIDAD RAFAEL URIBE URIBE, NO CUBIERTAS POR EL PLAN DE BENEFICIOS DE SALUD, QUE DEN RESPUESTA A LASNECESIDADES TERRITORIALES Y QUE SEAN ACORDE CON LA NORMATIVIDAD LEGAL VIGENTE EN EL MARCO DEL PROYECTO DEINVERSIÓN 1659.","Inversión","Un Nuevo Contrato Social y Ambiental para la Bogotá del Siglo XXI",8,{"$f":"IF(ISERROR(VLOOKUP(L307,Proposito_programa!$C$2:$E$59,2,FALSE)),\" \",VLOOKUP(L307,Proposito_programa!$C$2:$E$59,2,FALSE))","v":"Prevención y atención de maternidad temprana"},{"$f":"IF(ISERROR(VLOOKUP(L307,Proposito_programa!$C$2:$E$59,3,FALSE)),\" \",VLOOKUP(L307,Proposito_programa!$C$2:$E$59,3,FALSE))","v":"Propósito 1: Hacer un nuevo contrato social para incrementar la inclusión social, productiva y política"},"133011601080000001659",6,900175862,"CORPORACIÓN ESTRATÉGICA EN GESTIÓN E INTEGRACIÓN COLOMBIA-EGESCO","Persona Jurídica",null,null,null,221560645,null,null,null,221560645,44312129,44468,44480,44661,180,null,null,null,null,null,null,null,"X",null,null,0.2]
[1,232,2021,"FDLRUU-CD-231-2021 ","https://www.contratos.gov.co/consultas/detalleProceso.do?numConstancia=21-22-26737&g-recaptcha-response=03AGdBq243Icv-4pQG_qfcX8vlNGeUuG93FIHU1x3TMTqu8CWiGPQa42tG0FNpw1Uz6d9uunRTpWoTakuC69UGzPP0f7uyJg2Bo1dchdZz1KnIZkRuh9fL_pH9emfMlCpoVteKrr7TNT5JgGe_716JD0VvSBDurNejK6TpskthUU-l22Wlj5GHmLqtvnbCpxBUH03eTvuJqSpzGdlb6FtGoHkY40PM-6vc2yCou4cwJQYzSSBTPz08Fgfis6DERz6zcf-8xuGpGs7ZkriuaSVmIpQ0W4h1X5Sw9P9g9zjfkpiBb_7DIKH9GoGiMhthfw_UwTLDaJY9LZQ6GcAJkK93gVh8Pr_QDt5Hp4ZXsqFHoGlYOtr4bKaPUDLspxmPqMj4sg_lmiBK6KVcC828oIX_ufckgSCZ1BZWBG0EbTuVnywq0RD81qiMvO31M59k8rAmwQ7VxYYwYWSrvB20vyEbvJgO8faPK2t8M7uzqQpvZ-DOUoT_Q_kGM7gfYNWuKjUvXSlroGsDC3JwRzQiYTkqdbkyXp1h2ByO0A","Contratos interadministrativos","Contratación directa","Contratos interadministrativos","Aunar esfuerzos técnicos y administrativos con el fin de desarrollar acciones articuladas entre las partes orientadas a fomentar la generación y circulación de bienes y servicios culturales, así como al fortalecimiento de los agentes de estos sectores en las localidades del Distrito Capital que hacen parte de este instrumento.","Funcionamiento","Un Nuevo Contrato Social y Ambiental para la Bogotá del Siglo XXI","No aplica",{"$f":"IF(ISERROR(VLOOKUP(L308,Proposito_programa!$C$2:$E$59,2,FALSE)),\" \",VLOOKUP(L308,Proposito_programa!$C$2:$E$59,2,FALSE))","v":" "},{"$f":"IF(ISERROR(VLOOKUP(L308,Proposito_programa!$C$2:$E$59,3,FALSE)),\" \",VLOOKUP(L308,Proposito_programa!$C$2:$E$59,3,FALSE))","v":" "},"N/A",1,899999061,"CONVENIO INTERADMINISTRATIVO MARCO 331 CELEBRADO ENTRE LA SECRETARÍA DISTRITAL CULTURA, RECREACIÓN Y DEPORTE SCRD, LA FUNDACIÓN GILBERTO ÁLZATE AVENDAÑO FUGA, EL INSTITUTO DISTRITAL DE LAS ARTES IDARTES, LA ORQUESTA FILARMÓNICA DE BOGOTÁ OFB, EL INSTITUTO DISTRITAL DE PATRIMONIO CULTURAL IDPC Y CANAL CAPITAL","Persona Jurídica",null,null,null,0,null,null,null,0,"-",44351,44355,44742,384,null,null,null,null,null,null,null,"X",null,null,"-"]
[1,321,2019,"COP-321-2019","https://community.secop.gov.co/Public/Tendering/OpportunityDetail/Index?noticeUID=CO1.NTC.975649&isFromPublicArea=True&isModal=False","Obra pública","Licitación pública","No aplica","EJECUTAR LAS OBRAS Y ACTIVIDADES PARA LA CONSERVACIÓN DE LA MALLA VIAL Y ESPACIO PÚBLICO DE LA LOCALIDAD DE RAFAEL URIBE URIBE EN BOGOTÁ, D. C.","Inversión","Un Nuevo Contrato Social y Ambiental para la Bogotá del Siglo XXI",49,{"$f":"IF(ISERROR(VLOOKUP(L309,Proposito_programa!$C$2:$E$59,2,FALSE)),\" \",VLOOKUP(L309,Proposito_programa!$C$2:$E$59,2,FALSE))","v":"Movilidad segura, sostenible y accesible"},{"$f":"IF(ISERROR(VLOOKUP(L309,Proposito_programa!$C$2:$E$59,3,FALSE)),\" \",VLOOKUP(L309,Proposito_programa!$C$2:$E$59,3,FALSE))","v":"Propósito 4: Hacer de Bogotá Región un modelo de movilidad multimodal, incluyente y sostenible"},"133011604490000001685",1,901351603,"CONSORCIO RU 2020","Consorcio",900316090,"INGEVOLCO SAS",0.5,null,null,2,2759113000,2759113000,151231128,44328,44328,44603,660,5,660,null,null,null,null,null,"X",null,null,5.4811502102306064E-2]
[0,321,2019,"COP-321-2019","https://community.secop.gov.co/Public/Tendering/OpportunityDetail/Index?noticeUID=CO1.NTC.975649&isFromPublicArea=True&isModal=False","Obra pública","Licitación pública","No aplica","EJECUTAR LAS OBRAS Y ACTIVIDADES PARA LA CONSERVACIÓN DE LA MALLA VIAL Y ESPACIO PÚBLICO DE LA LOCALIDAD DE RAFAEL URIBE URIBE EN BOGOTÁ, D. C.","Inversión","Un Nuevo Contrato Social y Ambiental para la Bogotá del Siglo XXI",49,{"$f":"IF(ISERROR(VLOOKUP(L310,Proposito_programa!$C$2:$E$59,2,FALSE)),\" \",VLOOKUP(L310,Proposito_programa!$C$2:$E$59,2,FALSE))","v":"Movilidad segura, sostenible y accesible"},{"$f":"IF(ISERROR(VLOOKUP(L310,Proposito_programa!$C$2:$E$59,3,FALSE)),\" \",VLOOKUP(L310,Proposito_programa!$C$2:$E$59,3,FALSE))","v":"Propósito 4: Hacer de Bogotá Región un modelo de movilidad multimodal, incluyente y sostenible"},"133011604490000001685",1,901351603,"CONSORCIO RU 2020","Consorcio",900351236,"ESTUDIOS E INGENIERIA SAS",0.5,0,null,null,null,0,0,44328,44328,44603,660,5,660,null,null,null,null,null,"X",null,null,"-"]
[1,322,2021,"FDLRUU-LP-293-2021 ","https://community.secop.gov.co/Public/Tendering/OpportunityDetail/Index?noticeUID=CO1.NTC.2418002&isFromPublicArea=True&isModal=False\n","Obra pública","Licitación pública","No aplica","CONTRATAR POR EL SISTEMA DE PRECIOS UNITARIOS FIJOS SIN FÓRMULA DE REAJUSTE LA CONSTRUCCIÓN DE OBRAS CIVILES PARA LA MITIGACIÓN DE RIESGO EN LA LOCALIDAD DE RAFAEL URIBE URIBE.","Inversión","Un Nuevo Contrato Social y Ambiental para la Bogotá del Siglo XXI",30,{"$f":"IF(ISERROR(VLOOKUP(L311,Proposito_programa!$C$2:$E$59,2,FALSE)),\" \",VLOOKUP(L311,Proposito_programa!$C$2:$E$59,2,FALSE))","v":"Eficiencia en la atención de emergencias"},{"$f":"IF(ISERROR(VLOOKUP(L311,Proposito_programa!$C$2:$E$59,3,FALSE)),\" \",VLOOKUP(L311,Proposito_programa!$C$2:$E$59,3,FALSE))","v":"Propósito 2 : Cambiar Nuestros Hábitos de Vida para Reverdecer a Bogotá y Adaptarnos y Mitigar la Crisis Climática"},"133011602300000001665",4,null,"CONSORCIO MITIGACION 2021","Consorcio",901212455,"ARM CONSULTORIA Y CONSTRUCCIONES S.A.S",0.2,2092337151,null,null,null,2092337151,0,44558,"CELEBRADO SIN INICIAR","CELEBRADO SIN INICIAR",150,null,null,null,null,null,null,"X",null,null,null,0]
[0,322,2021,"FDLRUU-LP-293-2021 ","https://community.secop.gov.co/Public/Tendering/OpportunityDetail/Index?noticeUID=CO1.NTC.2418002&isFromPublicArea=True&isModal=False\n","Obra pública","Licitación pública","No aplica","CONTRATAR POR EL SISTEMA DE PRECIOS UNITARIOS FIJOS SIN FÓRMULA DE REAJUSTE LA CONSTRUCCIÓN DE OBRAS CIVILES PARA LA MITIGACIÓN DE RIESGO EN LA LOCALIDAD DE RAFAEL URIBE URIBE.","Inversión","Un Nuevo Contrato Social y Ambiental para la Bogotá del Siglo XXI",30,{"$f":"IF(ISERROR(VLOOKUP(L312,Proposito_programa!$C$2:$E$59,2,FALSE)),\" \",VLOOKUP(L312,Proposito_programa!$C$2:$E$59,2,FALSE))","v":"Eficiencia en la atención de emergencias"},{"$f":"IF(ISERROR(VLOOKUP(L312,Proposito_programa!$C$2:$E$59,3,FALSE)),\" \",VLOOKUP(L312,Proposito_programa!$C$2:$E$59,3,FALSE))","v":"Propósito 2 : Cambiar Nuestros Hábitos de Vida para Reverdecer a Bogotá y Adaptarnos y Mitigar la Crisis Climática"},"133011602300000001665",4,null,"CONSORCIO MITIGACION 2021","Consorcio",900204854,"OMICRON DEL LLANO S.A.S",0.8,0,null,null,null,0,0,44558,"CELEBRADO SIN INICIAR","CELEBRADO SIN INICIAR",150,null,null,null,null,null,null,"X",null,null,null,"-"]
[1,329,2021,"FDLRUU-CMA-317-2021 ","https://community.secop.gov.co/Public/Tendering/OpportunityDetail/Index?noticeUID=CO1.NTC.2446027&isFromPublicArea=True&isModal=False\n","Interventoría","Concurso de méritos","No aplica","REALIZAR LA INTERVENTORÍA TÉCNICA, ADMINISTRATIVA, LEGAL, FINANCIERA, SOCIAL, AMBIENTAL Y DE SEGURIDAD Y SALUD EN EL TRABAJO (SST), DEL CONTRATO DE OBRA PÚBLICA QUE TIENE POR OBJETO : CONTRATAR A PRECIOS UNITARIOS FIJOS, LAS OBRAS REFERENTES AL MANTENIMIENTO Y REPARACIONES LOCATIVAS DE LOS SALONES COMUNALES \"BOSQUE DE LOS MOLINOS, PRÍNCIPE DE BOCHICA, VILLA GLADYS, DIANA TURBAY SECTOR EL VALLE Y CLARET, DESTINADO AL USO DOTACIONAL - EQUIPAMENTO COLECTIVO CULTURAL DE ESCALA VECINAL, UBICADO","Inversión","Un Nuevo Contrato Social y Ambiental para la Bogotá del Siglo XXI",55,{"$f":"IF(ISERROR(VLOOKUP(L313,Proposito_programa!$C$2:$E$59,2,FALSE)),\" \",VLOOKUP(L313,Proposito_programa!$C$2:$E$59,2,FALSE))","v":"Fortalecimiento de cultura ciudadana y su institucionalidad"},{"$f":"IF(ISERROR(VLOOKUP(L313,Proposito_programa!$C$2:$E$59,3,FALSE)),\" \",VLOOKUP(L313,Proposito_programa!$C$2:$E$59,3,FALSE))","v":"Propósito 5: Construir Bogotá - Región con gobierno abierto, transparente y ciudadanía consciente"},"133011605550000001689",3,901553323,"CONSORCIO INTERVENTORES URIBE C&R 2021","Consorcio",9000073566,"CIVILNET INGENIERIA SAS",0.5,81969580,null,null,null,81969580,0,44559,"CELEBRADO SIN INICIAR","CELEBRADO SIN INICIAR",120,null,null,null,null,null,null,"X",null,null,null,0]
[0,329,2021,"FDLRUU-CMA-317-2021 ","https://community.secop.gov.co/Public/Tendering/OpportunityDetail/Index?noticeUID=CO1.NTC.2446027&isFromPublicArea=True&isModal=False\n","Interventoría","Concurso de méritos","No aplica","REALIZAR LA INTERVENTORÍA TÉCNICA, ADMINISTRATIVA, LEGAL, FINANCIERA, SOCIAL, AMBIENTAL Y DE SEGURIDAD Y SALUD EN EL TRABAJO (SST), DEL CONTRATO DE OBRA PÚBLICA QUE TIENE POR OBJETO : CONTRATAR A PRECIOS UNITARIOS FIJOS, LAS OBRAS REFERENTES AL MANTENIMIENTO Y REPARACIONES LOCATIVAS DE LOS SALONES COMUNALES \"BOSQUE DE LOS MOLINOS, PRÍNCIPE DE BOCHICA, VILLA GLADYS, DIANA TURBAY SECTOR EL VALLE Y CLARET, DESTINADO AL USO DOTACIONAL - EQUIPAMENTO COLECTIVO CULTURAL DE ESCALA VECINAL, UBICADO","Inversión","Un Nuevo Contrato Social y Ambiental para la Bogotá del Siglo XXI",55,{"$f":"IF(ISERROR(VLOOKUP(L314,Proposito_programa!$C$2:$E$59,2,FALSE)),\" \",VLOOKUP(L314,Proposito_programa!$C$2:$E$59,2,FALSE))","v":"Fortalecimiento de cultura ciudadana y su institucionalidad"},{"$f":"IF(ISERROR(VLOOKUP(L314,Proposito_programa!$C$2:$E$59,3,FALSE)),\" \",VLOOKUP(L314,Proposito_programa!$C$2:$E$59,3,FALSE))","v":"Propósito 5: Construir Bogotá - Región con gobierno abierto, transparente y ciudadanía consciente"},"133011605550000001689",3,901553323,"CONSORCIO INTERVENTORES URIBE C&R 2021","Consorcio",9014891631,"EMUNAH COLOMBIA SAS",0.5,0,null,null,null,0,0,44559,"CELEBRADO SIN INICIAR","CELEBRADO SIN INICIAR",120,null,null,null,null,null,null,"X",null,null,null,"-"]
[1,331,2021,"FDLRUU-CMA-316-2021 ","https://community.secop.gov.co/Public/Tendering/OpportunityDetail/Index?noticeUID=CO1.NTC.2443557&isFromPublicArea=True&isModal=False\n","Interventoría","Concurso de méritos","No aplica","REALIZAR LA INTERVENTORÍA TÉCNICA, ADMINISTRATIVA, LEGAL, FINANCIERA, SOCIAL, AMBIENTAL Y DE SEGURIDAD Y SALUD EN EL TRABAJO (SST), DEL CONTRATO DE OBRA PÚBLICA QUE TIENE POR OBJETO: CONTRATAR POR EL SISTEMA DE PRECIOS UNITARIOS FIJOS SIN FORMULA DE REAJUSTE LA CONSTRUCCIÓN DE OBRAS CIVILES PARA LA MITIGACIÓN DE RIESGO EN LA LOCALIDAD DE RAFAEL URIBE URIBE DERIVADO DEL PROCESO DE LA LICITACION PUBLICA No. FDLRUU-LP-293-2021.","Inversión","Un Nuevo Contrato Social y Ambiental para la Bogotá del Siglo XXI",30,{"$f":"IF(ISERROR(VLOOKUP(L315,Proposito_programa!$C$2:$E$59,2,FALSE)),\" \",VLOOKUP(L315,Proposito_programa!$C$2:$E$59,2,FALSE))","v":"Eficiencia en la atención de emergencias"},{"$f":"IF(ISERROR(VLOOKUP(L315,Proposito_programa!$C$2:$E$59,3,FALSE)),\" \",VLOOKUP(L315,Proposito_programa!$C$2:$E$59,3,FALSE))","v":"Propósito 2 : Cambiar Nuestros Hábitos de Vida para Reverdecer a Bogotá y Adaptarnos y Mitigar la Crisis Climática"},"133011602300000001665",2,901565507,"CONSORCIO INTER MITIGACION 2022","Consorcio",900107376,"INTERVENTORIA Y CONSTRUCCIONES CIVILES SAS",0.7,212977824,null,null,null,212977824,0,44560,"CELEBRADO SIN INICIAR","CELEBRADO SIN INICIAR",150,null,null,null,null,null,null,"X",null,null,null,0]
[0,331,2021,"FDLRUU-CMA-316-2021 ","https://community.secop.gov.co/Public/Tendering/OpportunityDetail/Index?noticeUID=CO1.NTC.2443557&isFromPublicArea=True&isModal=False\n","Interventoría","Concurso de méritos","No aplica","REALIZAR LA INTERVENTORÍA TÉCNICA, ADMINISTRATIVA, LEGAL, FINANCIERA, SOCIAL, AMBIENTAL Y DE SEGURIDAD Y SALUD EN EL TRABAJO (SST), DEL CONTRATO DE OBRA PÚBLICA QUE TIENE POR OBJETO: CONTRATAR POR EL SISTEMA DE PRECIOS UNITARIOS FIJOS SIN FORMULA DE REAJUSTE LA CONSTRUCCIÓN DE OBRAS CIVILES PARA LA MITIGACIÓN DE RIESGO EN LA LOCALIDAD DE RAFAEL URIBE URIBE DERIVADO DEL PROCESO DE LA LICITACION PUBLICA No. FDLRUU-LP-293-2021.","Inversión","Un Nuevo Contrato Social y Ambiental para la Bogotá del Siglo XXI",30,{"$f":"IF(ISERROR(VLOOKUP(L316,Proposito_programa!$C$2:$E$59,2,FALSE)),\" \",VLOOKUP(L316,Proposito_programa!$C$2:$E$59,2,FALSE))","v":"Eficiencia en la atención de emergencias"},{"$f":"IF(ISERROR(VLOOKUP(L316,Proposito_programa!$C$2:$E$59,3,FALSE)),\" \",VLOOKUP(L316,Proposito_programa!$C$2:$E$59,3,FALSE))","v":"Propósito 2 : Cambiar Nuestros Hábitos de Vida para Reverdecer a Bogotá y Adaptarnos y Mitigar la Crisis Climática"},"133011602300000001665",2,901565507,"CONSORCIO INTER MITIGACION 2022","Consorcio",901154678,"2L PROYECTOS SAS",0.3,0,null,null,null,0,0,44560,"CELEBRADO SIN INICIAR","CELEBRADO SIN INICIAR",null,null,null,null,null,null,null,null,null,null,null,"-"]
[1,273,2020,"FDLRUU-CMA-171-2020","https://community.secop.gov.co/Public/Tendering/OpportunityDetail/Index?noticeUID=CO1.NTC.1336646&isFromPublicArea=True&isModal=False\n","Interventoría","Concurso de méritos","No aplica","REALIZAR LA INTERVENTORÍA TÉCNICA, ADMINISTRATIVA, LEGAL, FINANCIERA, SOCIAL, AMBIENTAL Y DE SEGURIDAD Y SALUD EN EL TRABAJO (SST), DEL CONTRATO DE OBRA PÚBLICA QUE TIENE POR OBJETO: “OBRAS Y ACTIVIDADES PARA LA CONSTRUCCIÓN DE MALLA VIAL Y ESPACIO PÚBLICO DE LA LOCALIDAD DE RAFAEL URIBE URIBE EN BOGOTÁ, D.C.” DERIVADO DEL PROCESO DE LA LICITACIÓN PUBLICA NO. FDLRUU-LP-233-2019; EN EL MARCO DEL PROYECTO 1544 MALLA VIAL LOCAL Y ESPACIO PÚBLICO","Inversión","Un Nuevo Contrato Social y Ambiental para la Bogotá del Siglo XXI",49,{"$f":"IF(ISERROR(VLOOKUP(L317,Proposito_programa!$C$2:$E$59,2,FALSE)),\" \",VLOOKUP(L317,Proposito_programa!$C$2:$E$59,2,FALSE))","v":"Movilidad segura, sostenible y accesible"},{"$f":"IF(ISERROR(VLOOKUP(L317,Proposito_programa!$C$2:$E$59,3,FALSE)),\" \",VLOOKUP(L317,Proposito_programa!$C$2:$E$59,3,FALSE))","v":"Propósito 4: Hacer de Bogotá Región un modelo de movilidad multimodal, incluyente y sostenible"},"133011604490000001685",1,901405970,"CONSORCIO G&J","Consorcio",830515117,"GNG INGENIERIA S.A.S ",0.6,null,null,1,45134272,45134272,0,44405,44405,44805,255,1,45,null,null,null,null,null,"X",null,null,0]
[0,273,2020,"FDLRUU-CMA-171-2020","https://community.secop.gov.co/Public/Tendering/OpportunityDetail/Index?noticeUID=CO1.NTC.1336646&isFromPublicArea=True&isModal=False\n","Interventoría","Concurso de méritos","No aplica","REALIZAR LA INTERVENTORÍA TÉCNICA, ADMINISTRATIVA, LEGAL, FINANCIERA, SOCIAL, AMBIENTAL Y DE SEGURIDAD Y SALUD EN EL TRABAJO (SST), DEL CONTRATO DE OBRA PÚBLICA QUE TIENE POR OBJETO: “OBRAS Y ACTIVIDADES PARA LA CONSTRUCCIÓN DE MALLA VIAL Y ESPACIO PÚBLICO DE LA LOCALIDAD DE RAFAEL URIBE URIBE EN BOGOTÁ, D.C.” DERIVADO DEL PROCESO DE LA LICITACIÓN PUBLICA NO. FDLRUU-LP-233-2019; EN EL MARCO DEL PROYECTO 1544 MALLA VIAL LOCAL Y ESPACIO PÚBLICO","Inversión","Un Nuevo Contrato Social y Ambiental para la Bogotá del Siglo XXI",49,{"$f":"IF(ISERROR(VLOOKUP(L318,Proposito_programa!$C$2:$E$59,2,FALSE)),\" \",VLOOKUP(L318,Proposito_programa!$C$2:$E$59,2,FALSE))","v":"Movilidad segura, sostenible y accesible"},{"$f":"IF(ISERROR(VLOOKUP(L318,Proposito_programa!$C$2:$E$59,3,FALSE)),\" \",VLOOKUP(L318,Proposito_programa!$C$2:$E$59,3,FALSE))","v":"Propósito 4: Hacer de Bogotá Región un modelo de movilidad multimodal, incluyente y sostenible"},"133011604490000001685",1,901405970,"CONSORCIO G&J","Consorcio",900866325,"JMELO INGENIERIA DE PROYECTOS S.AS",0.4,0,null,null,null,0,0,44405,44405,44805,255,1,45,null,null,null,null,null,"X",null,null,"-"]
[1,1,2020,"FDLRUU-SABM-001-2020","https://community.secop.gov.co/Public/Tendering/OpportunityDetail/Index?noticeUID=CO1.NTC.1085480&isFromPublicArea=True&isModal=False","Contratos de prestación de servicios","Régimen especial","Decreto 92 de 2017","CONTRATAR A PRESTACION DEL SERVICIO DE VIGILANCIA Y SEGURIDAD PRIVADA A TRAVES DE LA BOLSA MERCANTIL DE COLOMBIA S.A PARA LOS PREDIOS DE PROPIEDAD Y/ O TENENCIA DEL FONDO DE DESARROLLO LOCAL RAFAEL URIBE URIBE DE CONFORMIDAD CON LAS CONDICIONES TECNICAS QUE DESIGNE.","Funcionamiento","Un Nuevo Contrato Social y Ambiental para la Bogotá del Siglo XXI","No aplica",{"$f":"IF(ISERROR(VLOOKUP(L319,Proposito_programa!$C$2:$E$59,2,FALSE)),\" \",VLOOKUP(L319,Proposito_programa!$C$2:$E$59,2,FALSE))","v":" "},{"$f":"IF(ISERROR(VLOOKUP(L319,Proposito_programa!$C$2:$E$59,3,FALSE)),\" \",VLOOKUP(L319,Proposito_programa!$C$2:$E$59,3,FALSE))","v":" "},"131020202030501",1,805023598,"COMISIONISTAS FINANCIEROS AGROPECUARIOS S.A -CONFINAGRO S.A ","Persona Jurídica",null,null,null,null,null,1,119452974,119452974,109802298,44305,44305,44371,499,1,169,null,null,null,null,null,"X",null,null,0.91920941206537055]
[1,284,2021,"FDLRUU-SASI-253-2021","https://community.secop.gov.co/Public/Tendering/OpportunityDetail/Index?noticeUID=CO1.NTC.2168457&isFromPublicArea=True&isModal=False\n","Compraventa de bienes muebles","Selección abreviada","Subasta inversa ","ADQUIRIR ELEMENTOS BÁSICOS PARA DOTAR JUNTAS DE ACCIÓN COMUNAL PARA EL MAYOR APROVECHAMIENTO DEL ESPACIO, EN EL MARCO DEL PROYECTO 1689","Inversión","Un Nuevo Contrato Social y Ambiental para la Bogotá del Siglo XXI",55,{"$f":"IF(ISERROR(VLOOKUP(L320,Proposito_programa!$C$2:$E$59,2,FALSE)),\" \",VLOOKUP(L320,Proposito_programa!$C$2:$E$59,2,FALSE))","v":"Fortalecimiento de cultura ciudadana y su institucionalidad"},{"$f":"IF(ISERROR(VLOOKUP(L320,Proposito_programa!$C$2:$E$59,3,FALSE)),\" \",VLOOKUP(L320,Proposito_programa!$C$2:$E$59,3,FALSE))","v":"Propósito 5: Construir Bogotá - Región con gobierno abierto, transparente y ciudadanía consciente"},"133011605550000001689",9,800089897,"COMERCIALIZADORA SERLE.COM","Persona Jurídica",null,null,null,119437360,null,null,null,119437360,119437360,44441,44452,44542,90,null,null,null,null,null,null,null,null,"X",null,1]
[1,263,2021,"FDLRUU-CD-263-2021","https://community.secop.gov.co/Public/Tendering/OpportunityDetail/Index?noticeUID=CO1.NTC.2165976&isFromPublicArea=True&isModal=False\n","Contratos de prestación de servicios profesionales y de apoyo a la gestión","Contratación directa","Prestación de servicios profesionales y de apoyo a la gestión, o para la ejecución de trabajos artísticos que sólo puedan encomendarse a determinadas personas naturales;","PRESTAR SUS SERVICIOS ASISTENCIALES PARA LA GESTIÓN DEL RIESGO, EN EL MARCO DE LOS VIGÍAS DEL RIESGO DE LA LOCALIDAD DE RAFAEL URIBE URIBE","Inversión","Un Nuevo Contrato Social y Ambiental para la Bogotá del Siglo XXI",30,{"$f":"IF(ISERROR(VLOOKUP(L321,Proposito_programa!$C$2:$E$59,2,FALSE)),\" \",VLOOKUP(L321,Proposito_programa!$C$2:$E$59,2,FALSE))","v":"Eficiencia en la atención de emergencias"},{"$f":"IF(ISERROR(VLOOKUP(L321,Proposito_programa!$C$2:$E$59,3,FALSE)),\" \",VLOOKUP(L321,Proposito_programa!$C$2:$E$59,3,FALSE))","v":"Propósito 2 : Cambiar Nuestros Hábitos de Vida para Reverdecer a Bogotá y Adaptarnos y Mitigar la Crisis Climática"},"133011602300000001665",1,39647356,"CLELIA ESTRID PINEDA ORTIZ","Persona Natural",null,null,null,8100000,null,null,null,8100000,6060000,44420,44428,44566,135,null,null,null,null,null,null,null,null,"X",null,0.74814814814814812]
[1,258,2021,"FDLRUU-CD-258-2021","https://community.secop.gov.co/Public/Tendering/OpportunityDetail/Index?noticeUID=CO1.NTC.2165099&isFromPublicArea=True&isModal=False\n","Contratos de prestación de servicios profesionales y de apoyo a la gestión","Contratación directa","Prestación de servicios profesionales y de apoyo a la gestión, o para la ejecución de trabajos artísticos que sólo puedan encomendarse a determinadas personas naturales;","PRESTAR SUS SERVICIOS ASISTENCIALES PARA LA GESTIÓN DEL RIESGO, EN EL MARCO DE LOS VIGÍAS DEL RIESGO DE LA LOCALIDAD DE RAFAEL URIBE URIBE","Inversión","Un Nuevo Contrato Social y Ambiental para la Bogotá del Siglo XXI",30,{"$f":"IF(ISERROR(VLOOKUP(L322,Proposito_programa!$C$2:$E$59,2,FALSE)),\" \",VLOOKUP(L322,Proposito_programa!$C$2:$E$59,2,FALSE))","v":"Eficiencia en la atención de emergencias"},{"$f":"IF(ISERROR(VLOOKUP(L322,Proposito_programa!$C$2:$E$59,3,FALSE)),\" \",VLOOKUP(L322,Proposito_programa!$C$2:$E$59,3,FALSE))","v":"Propósito 2 : Cambiar Nuestros Hábitos de Vida para Reverdecer a Bogotá y Adaptarnos y Mitigar la Crisis Climática"},"133011602300000001665",1,59818924,"CLAUDIA QUINTANA SANABRIA ","Persona Natural",null,null,null,8100000,null,null,null,8100000,6060000,44419,44428,44565,135,null,null,null,null,null,null,null,null,"X",null,0.74814814814814812]
[1,53,2021,"FDLRUU-CD-053-2021","https://community.secop.gov.co/Public/Tendering/OpportunityDetail/Index?noticeUID=CO1.NTC.1743904&isFromPublicArea=True&isModal=False\n","Contratos de prestación de servicios profesionales y de apoyo a la gestión","Contratación directa","Prestación de servicios profesionales y de apoyo a la gestión, o para la ejecución de trabajos artísticos que sólo puedan encomendarse a determinadas personas naturales;","“PRESTAR LOS SERVICIOS PROFESIONALES COMO ABOGADO EN LA ALCALDÍA LOCAL DE RAFAEL URIBE URIBE EN TODAS LAS GESTIONES JURÍDICAS Y ADMINISTRATIVAS EN MATERIA DE PROPIEDAD HORIZONTAL Y TRAMITES DE SOLICITUDES DE VENDEDORES INFORMALES”.\t ","Inversión","Un Nuevo Contrato Social y Ambiental para la Bogotá del Siglo XXI",57,{"$f":"IF(ISERROR(VLOOKUP(L323,Proposito_programa!$C$2:$E$59,2,FALSE)),\" \",VLOOKUP(L323,Proposito_programa!$C$2:$E$59,2,FALSE))","v":"Gestión pública local"},{"$f":"IF(ISERROR(VLOOKUP(L323,Proposito_programa!$C$2:$E$59,3,FALSE)),\" \",VLOOKUP(L323,Proposito_programa!$C$2:$E$59,3,FALSE))","v":"Propósito 5: Construir Bogotá - Región con gobierno abierto, transparente y ciudadanía consciente"},"133011605570000001698",1,51922807,"CLAUDIA MARERLING RODRIGUEZ MELO","Persona Natural",null,null,null,52000000,null,1,3466667,55466667,50440000,44236,44237,44561,300,1,20,null,null,null,null,null,null,"X",null,0.90937499453500603]
[1,210,2021,"FDLRUU-CD-210-2021","https://community.secop.gov.co/Public/Tendering/OpportunityDetail/Index?noticeUID=CO1.NTC.1890627&isFromPublicArea=True&isModal=False\n","Contratos de prestación de servicios profesionales y de apoyo a la gestión","Contratación directa","Prestación de servicios profesionales y de apoyo a la gestión, o para la ejecución de trabajos artísticos que sólo puedan encomendarse a determinadas personas naturales;","APOYAR AL (LA) ALCALDE (SA)LOCAL EN LA PROMOCIÓN, ARTICULACIÓN, ACOMPAÑAMIENTO Y SEGUIMIENTO PARA LA ATENCIÓN Y PROTECCIÓN DE LOS ANIMALES DOMÉSTICOS Y SILVESTRES DE LA LOCALIDAD","Inversión","Un Nuevo Contrato Social y Ambiental para la Bogotá del Siglo XXI",57,{"$f":"IF(ISERROR(VLOOKUP(L324,Proposito_programa!$C$2:$E$59,2,FALSE)),\" \",VLOOKUP(L324,Proposito_programa!$C$2:$E$59,2,FALSE))","v":"Gestión pública local"},{"$f":"IF(ISERROR(VLOOKUP(L324,Proposito_programa!$C$2:$E$59,3,FALSE)),\" \",VLOOKUP(L324,Proposito_programa!$C$2:$E$59,3,FALSE))","v":"Propósito 5: Construir Bogotá - Región con gobierno abierto, transparente y ciudadanía consciente"},"133011605570000001697",1,1019066849,"CLAUDIA FERNANDA RESTREPO BOTERO","Persona Natural",null,null,null,41566666,null,null,null,41566666,31533333,44306,44307,44601,290,null,null,null,null,null,null,null,"X",null,null,0.75862069380305841]
[1,193,2021,"FDLRUU-CD-193-2021","https://community.secop.gov.co/Public/Tendering/OpportunityDetail/Index?noticeUID=CO1.NTC.1838071&isFromPublicArea=True&isModal=False\n","Contratos de prestación de servicios profesionales y de apoyo a la gestión","Contratación directa","Prestación de servicios profesionales y de apoyo a la gestión, o para la ejecución de trabajos artísticos que sólo puedan encomendarse a determinadas personas naturales;","PRESTAR LOS SERVICIOS PROFESIONALES PARA APOYAR LA REVISIÓN Y/O ELABORACIÓN DE LOS DOCUMENTOS Y GESTIONES PROVENIENTES DE LAS DIFERENTES ÁREAS RELACIONADAS CON TEMAS ADMINISTRATIVOS CONTABLES Y FINANCIEROS DEL FONDO DE DESARROLLO LOCAL DE RAFAEL URIBE URIBE","Inversión","Un Nuevo Contrato Social y Ambiental para la Bogotá del Siglo XXI",57,{"$f":"IF(ISERROR(VLOOKUP(L325,Proposito_programa!$C$2:$E$59,2,FALSE)),\" \",VLOOKUP(L325,Proposito_programa!$C$2:$E$59,2,FALSE))","v":"Gestión pública local"},{"$f":"IF(ISERROR(VLOOKUP(L325,Proposito_programa!$C$2:$E$59,3,FALSE)),\" \",VLOOKUP(L325,Proposito_programa!$C$2:$E$59,3,FALSE))","v":"Propósito 5: Construir Bogotá - Región con gobierno abierto, transparente y ciudadanía consciente"},"133011605570000001697",1,51913151,"CLARA INÉS ROMERO REYES","Persona Natural",null,null,null,26400000,null,1,13200000,39600000,37400000,44266,44271,44545,180,1,90,null,null,null,null,null,null,"X",null,0.94444444444444442]
[1,97,2021,"FDLRUU-CD-097-2021","https://community.secop.gov.co/Public/Tendering/OpportunityDetail/Index?noticeUID=CO1.NTC.1761054&isFromPublicArea=True&isModal=False\n","Contratos de prestación de servicios profesionales y de apoyo a la gestión","Contratación directa","Prestación de servicios profesionales y de apoyo a la gestión, o para la ejecución de trabajos artísticos que sólo puedan encomendarse a determinadas personas naturales;","EL CONTRATISTA SE OBLIGA A PRESTAR SUS SERVICIOS PROFESIONALES EN EL ÁREA DE GESTIÓN DEL DESARROLLO LOCAL - PLANEACIÓN, REALIZANDO LAS ACTIVIDADES PROPIAS PARA LA FORMULACION, EJECUCIÓN Y SEGUIMIENTO DE LOS PROYECTOS DE INVERSIÓN DEL PLAN DE DESARROLLO LOCAL 2021 - 2024","Inversión","Un Nuevo Contrato Social y Ambiental para la Bogotá del Siglo XXI",57,{"$f":"IF(ISERROR(VLOOKUP(L326,Proposito_programa!$C$2:$E$59,2,FALSE)),\" \",VLOOKUP(L326,Proposito_programa!$C$2:$E$59,2,FALSE))","v":"Gestión pública local"},{"$f":"IF(ISERROR(VLOOKUP(L326,Proposito_programa!$C$2:$E$59,3,FALSE)),\" \",VLOOKUP(L326,Proposito_programa!$C$2:$E$59,3,FALSE))","v":"Propósito 5: Construir Bogotá - Región con gobierno abierto, transparente y ciudadanía consciente"},"133011605570000001697",1,1020713661,"CESAR MAURICIO RUIZ LONDOÑO","Persona Natural",null,null,null,52000000,null,1,2773333,54773333,49573333,44239,44242,44561,300,1,16,null,null,null,null,null,null,"X",null,0.90506329056148549]
[1,246,2021,"FDLRUU-CD-246-2021","https://community.secop.gov.co/Public/Tendering/OpportunityDetail/Index?noticeUID=CO1.NTC.2132050&isFromPublicArea=True&isModal=False\n","Contratos de prestación de servicios profesionales y de apoyo a la gestión","Contratación directa","Prestación de servicios profesionales y de apoyo a la gestión, o para la ejecución de trabajos artísticos que sólo puedan encomendarse a determinadas personas naturales;","PRESTAR LOS SERVICIOS PROFESIONALES AL DESPACHO DE LA ALCALDÍA LOCAL DE RAFAEL URIBE URIBE EN LA EJECUCIÓN DE ACTIVIDADES DE ORDEN ADMINISTRATIVO, FINANCIERO Y DE APOYO A LA GESTIÓN QUE SEAN REQUERIDOS. ","Inversión","Un Nuevo Contrato Social y Ambiental para la Bogotá del Siglo XXI",57,{"$f":"IF(ISERROR(VLOOKUP(L327,Proposito_programa!$C$2:$E$59,2,FALSE)),\" \",VLOOKUP(L327,Proposito_programa!$C$2:$E$59,2,FALSE))","v":"Gestión pública local"},{"$f":"IF(ISERROR(VLOOKUP(L327,Proposito_programa!$C$2:$E$59,3,FALSE)),\" \",VLOOKUP(L327,Proposito_programa!$C$2:$E$59,3,FALSE))","v":"Propósito 5: Construir Bogotá - Región con gobierno abierto, transparente y ciudadanía consciente"},"133011605570000001697",1,1020826222,"CESAR ANDRES ANDRADE OCAMPO","Persona Natural",null,null,null,17600000,null,null,null,17600000,13346667,44406,44407,44500,120,null,null,null,null,null,null,null,null,null,"X",0.75833335227272725]
[1,257,2021,"FDLRUU-CD-257-2021","https://community.secop.gov.co/Public/Tendering/OpportunityDetail/Index?noticeUID=CO1.NTC.2164860&isFromPublicArea=True&isModal=False\n","Contratos de prestación de servicios profesionales y de apoyo a la gestión","Contratación directa","Prestación de servicios profesionales y de apoyo a la gestión, o para la ejecución de trabajos artísticos que sólo puedan encomendarse a determinadas personas naturales;","PRESTAR SUS SERVICIOS ASISTENCIALES PARA LA GESTIÓN DEL RIESGO, EN EL MARCO DE LOS VIGÍAS DEL RIESGO DE LA LOCALIDAD DE RAFAEL URIBE URIBE","Inversión","Un Nuevo Contrato Social y Ambiental para la Bogotá del Siglo XXI",30,{"$f":"IF(ISERROR(VLOOKUP(L328,Proposito_programa!$C$2:$E$59,2,FALSE)),\" \",VLOOKUP(L328,Proposito_programa!$C$2:$E$59,2,FALSE))","v":"Eficiencia en la atención de emergencias"},{"$f":"IF(ISERROR(VLOOKUP(L328,Proposito_programa!$C$2:$E$59,3,FALSE)),\" \",VLOOKUP(L328,Proposito_programa!$C$2:$E$59,3,FALSE))","v":"Propósito 2 : Cambiar Nuestros Hábitos de Vida para Reverdecer a Bogotá y Adaptarnos y Mitigar la Crisis Climática"},"133011602300000001665",1,1024492481,"CAROLINA MENDOZA GUTIERREZ ","Persona Natural",null,null,null,8100000,null,null,null,8100000,6240000,44418,44425,44562,135,null,null,null,null,null,null,null,null,"X",null,0.77037037037037037]
[1,54,2021,"FDLRUU-CD-054-2021","https://community.secop.gov.co/Public/Tendering/OpportunityDetail/Index?noticeUID=CO1.NTC.1743628&isFromPublicArea=True&isModal=False\n","Contratos de prestación de servicios profesionales y de apoyo a la gestión","Contratación directa","Prestación de servicios profesionales y de apoyo a la gestión, o para la ejecución de trabajos artísticos que sólo puedan encomendarse a determinadas personas naturales;","APOYAR TÉCNICAMENTE LOS PROCESOS ADMINISTRATIVOS, CONTABLES Y OPERATIVOS QUE SE REQUIERAN EN EL ALMACEN DE LA ALCALDIA LOCAL DE RAFAEL URIBE URIBE","Inversión","Un Nuevo Contrato Social y Ambiental para la Bogotá del Siglo XXI",57,{"$f":"IF(ISERROR(VLOOKUP(L329,Proposito_programa!$C$2:$E$59,2,FALSE)),\" \",VLOOKUP(L329,Proposito_programa!$C$2:$E$59,2,FALSE))","v":"Gestión pública local"},{"$f":"IF(ISERROR(VLOOKUP(L329,Proposito_programa!$C$2:$E$59,3,FALSE)),\" \",VLOOKUP(L329,Proposito_programa!$C$2:$E$59,3,FALSE))","v":"Propósito 5: Construir Bogotá - Región con gobierno abierto, transparente y ciudadanía consciente"},"133011605570000001697",1,1030559488,"CARLOS GIOVANNY CASTELLANOS GUZMAN ","Persona Natural",null,null,null,33000000,null,1,3630000,36630000,32010000,44236,44237,44573,300,1,33,null,null,null,null,null,null,"X",null,0.87387387387387383]
[1,291,2021,"FDLRUU-CD-291-2021","https://community.secop.gov.co/Public/Tendering/OpportunityDetail/Index?noticeUID=CO1.NTC.2254099&isFromPublicArea=True&isModal=False\n","Contratos de prestación de servicios profesionales y de apoyo a la gestión","Contratación directa","Prestación de servicios profesionales y de apoyo a la gestión, o para la ejecución de trabajos artísticos que sólo puedan encomendarse a determinadas personas naturales;","PRESTAR SERVICIOS PROFESIONALES PARA REALIZACIÓN DE ACUERDOS QUE PROMUEVAN LA CONVIVENCIA ARMÓNICA ENTRE LA CIUDADANÍA Y LOS VENDEDORES INFOR MALES Y ESTACIONARIOS, ORIENTADOS A LA SOLUCIÓN DE LOS CONFLICTOS DERIVADOS DEL USO DEL ESPACIO PÚBLICO CONTEMPLADOS EN EL PROYECTO DE INVERSIÓN 1681 CULTURA CIUDADANA Y USO OPTIMO DEL ESPACIO PUBLICO EN RAFAEL URIBE URIBE.","Inversión","Un Nuevo Contrato Social y Ambiental para la Bogotá del Siglo XXI",45,{"$f":"IF(ISERROR(VLOOKUP(L330,Proposito_programa!$C$2:$E$59,2,FALSE)),\" \",VLOOKUP(L330,Proposito_programa!$C$2:$E$59,2,FALSE))","v":"Espacio público más seguro y construido colectivamente"},{"$f":"IF(ISERROR(VLOOKUP(L330,Proposito_programa!$C$2:$E$59,3,FALSE)),\" \",VLOOKUP(L330,Proposito_programa!$C$2:$E$59,3,FALSE))","v":"Propósito 3: Inspirar confianza y legitimidad para vivir sin miedo y ser epicentro de cultura ciudadana, paz y reconciliación"},"133011603450000001681",1,1018418431,"CARLOS EDUARDO LINARES CASTELLANOS ","Persona Natural",null,null,null,20000000,null,null,null,20000000,11333333,44455,44462,44583,120,null,null,null,null,null,null,null,null,"X",null,0.56666665000000005]
[1,93,2021,"FDLRUU-CD-093-2021","https://community.secop.gov.co/Public/Tendering/OpportunityDetail/Index?noticeUID=CO1.NTC.1760604&isFromPublicArea=True&isModal=False\n","Contratos de prestación de servicios profesionales y de apoyo a la gestión","Contratación directa","Prestación de servicios profesionales y de apoyo a la gestión, o para la ejecución de trabajos artísticos que sólo puedan encomendarse a determinadas personas naturales;","PRESTAR SUS SERVICIOS PROFESIONALES EN EL ÁREA DE GESTIÓN DEL DESARROLLO LOCAL - PLANEACIÓN, REALIZANDO LAS ACTIVIDADES PROPIAS PARA LA FORMULACION, EJECUCIÓN Y SEGUIMIENTO DE LOS PROYECTOS DE INVERSIÓN DEL PLAN DE DESARROLLO LOCAL 2021 - 2024”","Inversión","Un Nuevo Contrato Social y Ambiental para la Bogotá del Siglo XXI",57,{"$f":"IF(ISERROR(VLOOKUP(L331,Proposito_programa!$C$2:$E$59,2,FALSE)),\" \",VLOOKUP(L331,Proposito_programa!$C$2:$E$59,2,FALSE))","v":"Gestión pública local"},{"$f":"IF(ISERROR(VLOOKUP(L331,Proposito_programa!$C$2:$E$59,3,FALSE)),\" \",VLOOKUP(L331,Proposito_programa!$C$2:$E$59,3,FALSE))","v":"Propósito 5: Construir Bogotá - Región con gobierno abierto, transparente y ciudadanía consciente"},"133011605570000001697",1,79541010,"CARLOS EDUARDO CASTRO ORTIZ","Persona Natural",null,null,null,52000000,null,null,null,52000000,48880000,44242,44246,44548,300,null,null,null,null,null,null,null,null,"X",null,0.94]
[1,177,2021,"FDLRUU-CD-177-2021","https://community.secop.gov.co/Public/Tendering/OpportunityDetail/Index?noticeUID=CO1.NTC.1810869&isFromPublicArea=True&isModal=False\n","Contratos de prestación de servicios profesionales y de apoyo a la gestión","Contratación directa","Prestación de servicios profesionales y de apoyo a la gestión, o para la ejecución de trabajos artísticos que sólo puedan encomendarse a determinadas personas naturales;","APOYAR ADMINISTRATIVA Y ASISTENCIALMENTE A LAS INSPECCIONES DE POLICÍA DE LA LOCALIDAD DE RAFAEL URIBE URIBE","Inversión","Un Nuevo Contrato Social y Ambiental para la Bogotá del Siglo XXI",57,{"$f":"IF(ISERROR(VLOOKUP(L332,Proposito_programa!$C$2:$E$59,2,FALSE)),\" \",VLOOKUP(L332,Proposito_programa!$C$2:$E$59,2,FALSE))","v":"Gestión pública local"},{"$f":"IF(ISERROR(VLOOKUP(L332,Proposito_programa!$C$2:$E$59,3,FALSE)),\" \",VLOOKUP(L332,Proposito_programa!$C$2:$E$59,3,FALSE))","v":"Propósito 5: Construir Bogotá - Región con gobierno abierto, transparente y ciudadanía consciente"},"133011605570000001698",1,80124179,"CARLOS ANDRES TORRES ROMERO","Persona Natural",null,null,null,10500000,null,1,5250000,15750000,15341667,44259,44263,44537,180,1,90,null,null,null,null,null,null,"X",null,0.97407409523809518]
[1,274,2021,"FDLRUU-CD-274-2021","https://community.secop.gov.co/Public/Tendering/OpportunityDetail/Index?noticeUID=CO1.NTC.2179921&isFromPublicArea=True&isModal=False\n","Contratos de prestación de servicios profesionales y de apoyo a la gestión","Contratación directa","Prestación de servicios profesionales y de apoyo a la gestión, o para la ejecución de trabajos artísticos que sólo puedan encomendarse a determinadas personas naturales;","PRESTAR SERVICIOS PROFESIONALES PARA REALIZAR ACUERDOS ENTRE LA ALCALDIA LOCAL DE RAFAEL URIBE URIBE Y SUS HABITANTES PARA VINCULARLOS A LOS PROGRAMAS DEL IDRD \"ESCUELA DE LA BICICLETA\" Y \"AL TRABAJO EN BICI\" QUE MOTIVEN EL USO ADECUADO DE LOS MEDIOS DE TTRANSPORTE NO MOTORIZADOS, PORMEDIO DE LA PROMOCION DE LA NORMATIVIDAD PARA SU APROPIACION Y APLICACIÓN EN EL MARCO DEL PROYECTO DE INVERSION 1681","Inversión","Un Nuevo Contrato Social y Ambiental para la Bogotá del Siglo XXI",45,{"$f":"IF(ISERROR(VLOOKUP(L333,Proposito_programa!$C$2:$E$59,2,FALSE)),\" \",VLOOKUP(L333,Proposito_programa!$C$2:$E$59,2,FALSE))","v":"Espacio público más seguro y construido colectivamente"},{"$f":"IF(ISERROR(VLOOKUP(L333,Proposito_programa!$C$2:$E$59,3,FALSE)),\" \",VLOOKUP(L333,Proposito_programa!$C$2:$E$59,3,FALSE))","v":"Propósito 3: Inspirar confianza y legitimidad para vivir sin miedo y ser epicentro de cultura ciudadana, paz y reconciliación"},"133011603450000001681",1,80129534,"CARLOS ANDRES MENDEZ MOJICA ","Persona Natural",null,null,null,20000000,null,null,null,20000000,16833333,44426,44428,44549,120,null,null,null,null,null,null,null,null,"X",null,0.84166664999999996]
[1,142,2021,"FDLRUU-CD-142-2021","https://community.secop.gov.co/Public/Tendering/OpportunityDetail/Index?noticeUID=CO1.NTC.1793992&isFromPublicArea=True&isModal=False\n","Contratos de prestación de servicios profesionales y de apoyo a la gestión","Contratación directa","Prestación de servicios profesionales y de apoyo a la gestión, o para la ejecución de trabajos artísticos que sólo puedan encomendarse a determinadas personas naturales;","PRESTAR LOS SERVICIOS PROFESIONALES PARA LA OPERACIÓN, PRESTACIÓN, SEGUIMIENTO Y CUMPLIMIENTO PROCEDIMIENTOS ADMINISTRATIVOS OPERATIVOS Y PROGRAMÁTICOS DEL SERVICIO APOYO ECONÓMICO TIPO C, QUE CONTRIBUYAN A LA GARANTÍA DE LOS DERECHOS DE LA POBLACIÓN MAYOR EN EL MARCO DE LA POLÍTICA PÚBLICA SOCIAL PARA EL ENVEJECIMIENTO Y LA VEJEZ EN EL DISTRITO CAPITAL A CARGO DE LA ALCALDÍA LOCAL RAFAEL URIBE URIBE","Inversión","Un Nuevo Contrato Social y Ambiental para la Bogotá del Siglo XXI",1,{"$f":"IF(ISERROR(VLOOKUP(L334,Proposito_programa!$C$2:$E$59,2,FALSE)),\" \",VLOOKUP(L334,Proposito_programa!$C$2:$E$59,2,FALSE))","v":"Subsidios y transferencias para la equidad"},{"$f":"IF(ISERROR(VLOOKUP(L334,Proposito_programa!$C$2:$E$59,3,FALSE)),\" \",VLOOKUP(L334,Proposito_programa!$C$2:$E$59,3,FALSE))","v":"Propósito 1: Hacer un nuevo contrato social para incrementar la inclusión social, productiva y política"},"133011601010000001636",1,80913594,"CARLOS ALEXANDER CASTILLO MUÑOZ","Persona Natural",null,null,null,41600000,null,1,9706667,51306667,43853333,44265,44273,44574,240,1,56,null,null,null,null,null,null,"X",null,{"$f":"IF(ISERROR(AB334/AA334),\"-\",(AB334/AA334))","v":0.85472971767977057}]
[1,69,2021,"FDLRUU-CD-069-2021","https://community.secop.gov.co/Public/Tendering/OpportunityDetail/Index?noticeUID=CO1.NTC.1750948&isFromPublicArea=True&isModal=False\n","Contratos de prestación de servicios profesionales y de apoyo a la gestión","Contratación directa","Prestación de servicios profesionales y de apoyo a la gestión, o para la ejecución de trabajos artísticos que sólo puedan encomendarse a determinadas personas naturales;","APOYAR TÉCNICAMENTE LOS PROCESOS ADMINISTRATIVOS, CONTABLES Y OPERATIVOS QUE SE REQUIERAN EN EL ALMACEN DE LA ALCALDIA LOCAL DE RAFAEL URIBE URIBE","Inversión","Un Nuevo Contrato Social y Ambiental para la Bogotá del Siglo XXI",57,{"$f":"IF(ISERROR(VLOOKUP(L335,Proposito_programa!$C$2:$E$59,2,FALSE)),\" \",VLOOKUP(L335,Proposito_programa!$C$2:$E$59,2,FALSE))","v":"Gestión pública local"},{"$f":"IF(ISERROR(VLOOKUP(L335,Proposito_programa!$C$2:$E$59,3,FALSE)),\" \",VLOOKUP(L335,Proposito_programa!$C$2:$E$59,3,FALSE))","v":"Propósito 5: Construir Bogotá - Región con gobierno abierto, transparente y ciudadanía consciente"},"133011605570000001697",1,19445797,"CARLOS ALBERTO ESCOBAR LARA ","Persona Natural",null,null,null,33000000,null,1,3190000,36190000,31460000,44237,44242,44574,300,1,29,null,null,null,null,null,null,"X",null,0.8693009118541033]
[1,285,2021,"FDLRUU-CD-285-2021","https://community.secop.gov.co/Public/Tendering/OpportunityDetail/Index?noticeUID=CO1.NTC.2231175&isFromPublicArea=True&isModal=False\n","Contratos de prestación de servicios profesionales y de apoyo a la gestión","Contratación directa","Prestación de servicios profesionales y de apoyo a la gestión, o para la ejecución de trabajos artísticos que sólo puedan encomendarse a determinadas personas naturales;","PRESTAR SERVICIOS PROFESIONALES PARA REALIZAR ACUERDOS QUE PROMUEVAN LA PARTICIPACIÓN DE LA POBLACIÓN VULNERABLE, QUE GENEREN EMPRENDIMIENTOS FORMALIZADOS QUE COADYUVEN AL DESARROLLO ECONÓMICO Y PRODUCTIVO DE ESTA POBLACIÓN EN EL MARCO DEL PROYECTO DE INVERSIÓN 1681","Inversión","Un Nuevo Contrato Social y Ambiental para la Bogotá del Siglo XXI",45,{"$f":"IF(ISERROR(VLOOKUP(L336,Proposito_programa!$C$2:$E$59,2,FALSE)),\" \",VLOOKUP(L336,Proposito_programa!$C$2:$E$59,2,FALSE))","v":"Espacio público más seguro y construido colectivamente"},{"$f":"IF(ISERROR(VLOOKUP(L336,Proposito_programa!$C$2:$E$59,3,FALSE)),\" \",VLOOKUP(L336,Proposito_programa!$C$2:$E$59,3,FALSE))","v":"Propósito 3: Inspirar confianza y legitimidad para vivir sin miedo y ser epicentro de cultura ciudadana, paz y reconciliación"},"133011603450000001681",1,80058217,"CARLOS ALBERTO CARDOZO AMAYA","Persona Natural",null,null,null,20000000,null,null,null,20000000,13000000,44447,44452,44573,120,null,null,null,null,null,null,null,null,"X",null,0.65]
[1,190,2021,"FDLRUU-CD-190-2021","https://community.secop.gov.co/Public/Tendering/OpportunityDetail/Index?noticeUID=CO1.NTC.1840460&isFromPublicArea=True&isModal=False\n","Contratos de prestación de servicios profesionales y de apoyo a la gestión","Contratación directa","Prestación de servicios profesionales y de apoyo a la gestión, o para la ejecución de trabajos artísticos que sólo puedan encomendarse a determinadas personas naturales;","PRESTAR SUS SERVICIOS DE APOYO ADMINISTRATIVO ASISTENCIAL EN EL PROCESO DE TOMA FISICA, VERIFICACION, CLASIFICACION Y ACTUALIZACION DE LA INFORMACION DE BIENES MUEBLES E INMUEBLES DE PROPIEDAD Y/O A CARGO DEL FONDO DE DESARROLLO LOCAL DE RAFAEL URIBE URIBE Y DEPURACION DE LOS CONTRATOS DE COMODATO EN EL AREA DE GESTIÓN PARA EL DESARROLLO LOCAL – ALMACEN DE CONFORMIDAD CON LAS DISPOSICIONES LEGALES VIGENTES","Inversión","Un Nuevo Contrato Social y Ambiental para la Bogotá del Siglo XXI",57,{"$f":"IF(ISERROR(VLOOKUP(L337,Proposito_programa!$C$2:$E$59,2,FALSE)),\" \",VLOOKUP(L337,Proposito_programa!$C$2:$E$59,2,FALSE))","v":"Gestión pública local"},{"$f":"IF(ISERROR(VLOOKUP(L337,Proposito_programa!$C$2:$E$59,3,FALSE)),\" \",VLOOKUP(L337,Proposito_programa!$C$2:$E$59,3,FALSE))","v":"Propósito 5: Construir Bogotá - Región con gobierno abierto, transparente y ciudadanía consciente"},"133011605570000001697",1,1031172956,"CAMILO ANDRES MARROQUIN RUIZ","Persona Natural",null,null,null,26000000,null,null,null,26000000,21320000,44271,44280,44585,300,null,null,null,null,null,null,null,null,"X",null,0.82]
[1,15,2021,"FDLRUU-CD-015-2021","https://community.secop.gov.co/Public/Tendering/OpportunityDetail/Index?noticeUID=CO1.NTC.1706955&isFromPublicArea=True&isModal=False\n","Contratos de prestación de servicios profesionales y de apoyo a la gestión","Contratación directa","Prestación de servicios profesionales y de apoyo a la gestión, o para la ejecución de trabajos artísticos que sólo puedan encomendarse a determinadas personas naturales;","APOYAR TÉCNICAMENTE LAS DISTINTAS ETAPAS DE LOS PROCESOS DE COMPETENCIA DE LA ALCALDÍA LOCAL PARA LA DEPURACIÓN DE LAS ACTUACIONES ADMINISTRATIVAS","Inversión","Un Nuevo Contrato Social y Ambiental para la Bogotá del Siglo XXI",57,{"$f":"IF(ISERROR(VLOOKUP(L338,Proposito_programa!$C$2:$E$59,2,FALSE)),\" \",VLOOKUP(L338,Proposito_programa!$C$2:$E$59,2,FALSE))","v":"Gestión pública local"},{"$f":"IF(ISERROR(VLOOKUP(L338,Proposito_programa!$C$2:$E$59,3,FALSE)),\" \",VLOOKUP(L338,Proposito_programa!$C$2:$E$59,3,FALSE))","v":"Propósito 5: Construir Bogotá - Región con gobierno abierto, transparente y ciudadanía consciente"},"133011605570000001698",1,79743591,"CAMILO ANDRES ALVAREZ GACHARNA","Persona Natural",null,null,null,31200000,null,1,15600000,46800000,46800000,44225,44228,44500,180,1,90,null,null,null,null,null,null,"X",null,1]
[null,null,2021,null,null,"Otros gastos","Otros gastos","Otros gastos","CAJA MENOR","Funcionamiento","Un Nuevo Contrato Social y Ambiental para la Bogotá del Siglo XXI","No aplica",{"$f":"IF(ISERROR(VLOOKUP(L339,Proposito_programa!$C$2:$E$59,2,FALSE)),\" \",VLOOKUP(L339,Proposito_programa!$C$2:$E$59,2,FALSE))","v":" "},{"$f":"IF(ISERROR(VLOOKUP(L339,Proposito_programa!$C$2:$E$59,3,FALSE)),\" \",VLOOKUP(L339,Proposito_programa!$C$2:$E$59,3,FALSE))","v":" "},"1310202020102",null,null,"CAJA MENOR",null,null,null,null,7343300,null,null,null,{"$f":"+W339+X339+Z339","v":7343300},7343300,44197,44197,44561,360,null,null,null,null,null,null,null,null,"X",null,1]
[null,null,2021,null,null,"Otros gastos","Otros gastos","Otros gastos","Por medio de la cual se ordena el Gasto y Pago de Apoyos Económicos correspondiente al Proyecto No. 1336: ¿Apoyo e igualdad para elAdulto Mayor¿, en su componente: Entrega de Apoyos Económico tipo C a 6.500 personas mayores de la localidad Rafael Uribe Uribe  para la vigencia 2020.","Inversión","Un Nuevo Contrato Social y Ambiental para la Bogotá del Siglo XXI",1,{"$f":"IF(ISERROR(VLOOKUP(L340,Proposito_programa!$C$2:$E$59,2,FALSE)),\" \",VLOOKUP(L340,Proposito_programa!$C$2:$E$59,2,FALSE))","v":"Subsidios y transferencias para la equidad"},{"$f":"IF(ISERROR(VLOOKUP(L340,Proposito_programa!$C$2:$E$59,3,FALSE)),\" \",VLOOKUP(L340,Proposito_programa!$C$2:$E$59,3,FALSE))","v":"Propósito 1: Hacer un nuevo contrato social para incrementar la inclusión social, productiva y política"},"133011601010000001636",1,860066942,"CAJA DE COMPENSACION FAMILIAR - COMPENSAR","Persona Jurídica",null,null,null,10050000000,null,null,null,10050000000,9967472970,44197,44197,44561,360,null,null,null,null,null,null,null,"X",null,null,0.99178835522388065]
[1,206,2021,"FDLRUU-CD-206-2021","https://community.secop.gov.co/Public/Tendering/OpportunityDetail/Index?noticeUID=CO1.NTC.1873143&isFromPublicArea=True&isModal=False\n","Contratos de prestación de servicios profesionales y de apoyo a la gestión","Contratación directa","Prestación de servicios profesionales y de apoyo a la gestión, o para la ejecución de trabajos artísticos que sólo puedan encomendarse a determinadas personas naturales;","EL CONTRATISTA SE OBLIGA A PRESTAR SUS SERVICIOS PROFESIONALES EN EL ÁREA DE GESTIÓN DEL DESARROLLO LOCAL - PLANEACIÓN, REALIZANDO LAS ACTIVIDADES PROPIAS PARA LA DIVULGACION, FORMULACION, EJECUCIÓN Y SEGUIMIENTO DE LOS PROYECTOS DE INVERSIÓN DEL PLAN DE DESARROLLO LOCAL 2021 – 2024","Inversión","Un Nuevo Contrato Social y Ambiental para la Bogotá del Siglo XXI",57,{"$f":"IF(ISERROR(VLOOKUP(L341,Proposito_programa!$C$2:$E$59,2,FALSE)),\" \",VLOOKUP(L341,Proposito_programa!$C$2:$E$59,2,FALSE))","v":"Gestión pública local"},{"$f":"IF(ISERROR(VLOOKUP(L341,Proposito_programa!$C$2:$E$59,3,FALSE)),\" \",VLOOKUP(L341,Proposito_programa!$C$2:$E$59,3,FALSE))","v":"Propósito 5: Construir Bogotá - Región con gobierno abierto, transparente y ciudadanía consciente"},"133011605570000001697",1,1030614944,"BRYAN CAMILO GACHA RODRIGUEZ ","Persona Natural",null,null,null,31200000,null,1,15600000,46800000,38480000,44282,44291,44565,180,1,90,52265349,"PAOLA GUTIERREZ VALENCIA",44362,19066667,null,null,"X",null,0.82222222222222219]
[1,102,2021,"FDLRUU-CD-102-2021","secop.gov.co/Public/Tendering/ContractNoticePhases/View?PPI=CO1.PPI.12020559&isFromPublicArea=True&isModal=False","Contratos de prestación de servicios profesionales y de apoyo a la gestión","Contratación directa","Prestación de servicios profesionales y de apoyo a la gestión, o para la ejecución de trabajos artísticos que sólo puedan encomendarse a determinadas personas naturales;","APOYAR TÉCNICAMENTE A LOS RESPONSABLES E INTEGRANTES DE LOS PROCESOS EN LA IMPLEMENTACIÓN DE HERRAMIENTAS DE GESTIÓN, SIGUIENDO LOS LINEAMIENTOS METODOLÓGICOS ESTABLECIDOS POR LA OFICINA ASESORA DE PLANEACIÓN DE LA SECRETARÍA DISTRITAL DE GOBIERNO","Inversión","Un Nuevo Contrato Social y Ambiental para la Bogotá del Siglo XXI",57,{"$f":"IF(ISERROR(VLOOKUP(L342,Proposito_programa!$C$2:$E$59,2,FALSE)),\" \",VLOOKUP(L342,Proposito_programa!$C$2:$E$59,2,FALSE))","v":"Gestión pública local"},{"$f":"IF(ISERROR(VLOOKUP(L342,Proposito_programa!$C$2:$E$59,3,FALSE)),\" \",VLOOKUP(L342,Proposito_programa!$C$2:$E$59,3,FALSE))","v":"Propósito 5: Construir Bogotá - Región con gobierno abierto, transparente y ciudadanía consciente"},"133011605570000001697",1,1019023768,"BRIGEETH JOHANA MORA DUARTE","Persona Natural",null,null,null,52000000,null,null,null,52000000,41773333,44239,44242,44559,300,null,null,1033736859,"WILLIAM FERNANDO HURTADO FERNANDEZ ",44411,25306667,null,null,"X",null,0.80333332692307691]
[1,289,2021,"FDLRUU-CD-289-2021","https://community.secop.gov.co/Public/Tendering/OpportunityDetail/Index?noticeUID=CO1.NTC.2250794&isFromPublicArea=True&isModal=False\n","Contratos de prestación de servicios profesionales y de apoyo a la gestión","Contratación directa","Prestación de servicios profesionales y de apoyo a la gestión, o para la ejecución de trabajos artísticos que sólo puedan encomendarse a determinadas personas naturales;","PRESTAR LOS SERVICIOS TECNICOS PARA DESARROLLAR ACTIVIDADES TENDIENTES A GARANTIZAR LA SALUD Y LA ATENCIÓN DE LAS EMERGENCIAS Y DESASTRES QUE SE PRESENTEN EN LA LOCALIDAD RAFAEL URIBE URIBE.","Inversión","Un Nuevo Contrato Social y Ambiental para la Bogotá del Siglo XXI",30,{"$f":"IF(ISERROR(VLOOKUP(L343,Proposito_programa!$C$2:$E$59,2,FALSE)),\" \",VLOOKUP(L343,Proposito_programa!$C$2:$E$59,2,FALSE))","v":"Eficiencia en la atención de emergencias"},{"$f":"IF(ISERROR(VLOOKUP(L343,Proposito_programa!$C$2:$E$59,3,FALSE)),\" \",VLOOKUP(L343,Proposito_programa!$C$2:$E$59,3,FALSE))","v":"Propósito 2 : Cambiar Nuestros Hábitos de Vida para Reverdecer a Bogotá y Adaptarnos y Mitigar la Crisis Climática"},"133011602300000001665",1,1012362027,"BRAYER ANDERSON PEÑA","Persona Natural",null,null,null,10800000,null,null,null,10800000,5400000,44460,44470,44591,120,null,null,null,null,null,null,null,null,"X",null,0.5]
[1,40,2021,"FDLRUU-CD-040-2021","https://community.secop.gov.co/Public/Tendering/OpportunityDetail/Index?noticeUID=CO1.NTC.1729198&isFromPublicArea=True&isModal=False\n","Contratos de prestación de servicios profesionales y de apoyo a la gestión","Contratación directa","Prestación de servicios profesionales y de apoyo a la gestión, o para la ejecución de trabajos artísticos que sólo puedan encomendarse a determinadas personas naturales;","EL CONTRATISTA SE OBLIGA A PRESTAR SUS SERVICIOS DE APOYO TÉCNICO ADMINISTRATIVO PARA LA GRUPO DE PLANEACIÓN DE LA ALCALDÍA LOCAL DE RAFAEL URIBE URIBE”","Inversión","Un Nuevo Contrato Social y Ambiental para la Bogotá del Siglo XXI",57,{"$f":"IF(ISERROR(VLOOKUP(L344,Proposito_programa!$C$2:$E$59,2,FALSE)),\" \",VLOOKUP(L344,Proposito_programa!$C$2:$E$59,2,FALSE))","v":"Gestión pública local"},{"$f":"IF(ISERROR(VLOOKUP(L344,Proposito_programa!$C$2:$E$59,3,FALSE)),\" \",VLOOKUP(L344,Proposito_programa!$C$2:$E$59,3,FALSE))","v":"Propósito 5: Construir Bogotá - Región con gobierno abierto, transparente y ciudadanía consciente"},"133011605570000001697",1,1033750473,"BRAYAN ANDRES MORALES CASTIBLANCO ","Persona Natural",null,null,null,39000000,null,1,5070000,44070000,38480000,44230,44232,44574,300,1,39,null,null,null,null,null,null,"X",null,0.87315634218289084]
[1,73843,2021,"OC-73843"," https://colombiacompra.gov.co/tienda-virtual-del-estado-colombiano/ordenes-compra/73843","Compraventa de bienes muebles","Selección abreviada","Acuerdo marco de precios ","ELEMENTOS DE BIOSEGURIDAD PARA EL\nMANEJO DE LA EMERGENCIA SANITARIA,\nSOCIAL y ECOLOGICA PRODUCTO DEL COVID19 ALCALDIA LOCAL RAFAEL URIBE URIBE","Funcionamiento","Un Nuevo Contrato Social y Ambiental para la Bogotá del Siglo XXI","No aplica",{"$f":"IF(ISERROR(VLOOKUP(L345,Proposito_programa!$C$2:$E$59,2,FALSE)),\" \",VLOOKUP(L345,Proposito_programa!$C$2:$E$59,2,FALSE))","v":" "},{"$f":"IF(ISERROR(VLOOKUP(L345,Proposito_programa!$C$2:$E$59,3,FALSE)),\" \",VLOOKUP(L345,Proposito_programa!$C$2:$E$59,3,FALSE))","v":" "},"13102020208",1,901211678,"BON SANTE SAS ","Persona Jurídica",null,null,null,300247,null,null,null,300247,0,44413,44414,44444,30,null,null,null,null,null,null,null,null,"X",null,0]
[1,100,2021,"FDLRUU-CD-100-2021","https://community.secop.gov.co/Public/Tendering/OpportunityDetail/Index?noticeUID=CO1.NTC.1772323&isFromPublicArea=True&isModal=False\n","Contratos de prestación de servicios profesionales y de apoyo a la gestión","Contratación directa","Prestación de servicios profesionales y de apoyo a la gestión, o para la ejecución de trabajos artísticos que sólo puedan encomendarse a determinadas personas naturales;","PRESTAR LOS SERVICIOS PROFESIONALES AL DESPACHO EN EL SEGUIMIENTO E IMPLEMENTACION DE POLITICAS PUBLICAS DISTRITALES EN LA ALCALDÍA LOCAL DE RAFAEL URIBE URIBE.”","Inversión","Un Nuevo Contrato Social y Ambiental para la Bogotá del Siglo XXI",57,{"$f":"IF(ISERROR(VLOOKUP(L346,Proposito_programa!$C$2:$E$59,2,FALSE)),\" \",VLOOKUP(L346,Proposito_programa!$C$2:$E$59,2,FALSE))","v":"Gestión pública local"},{"$f":"IF(ISERROR(VLOOKUP(L346,Proposito_programa!$C$2:$E$59,3,FALSE)),\" \",VLOOKUP(L346,Proposito_programa!$C$2:$E$59,3,FALSE))","v":"Propósito 5: Construir Bogotá - Región con gobierno abierto, transparente y ciudadanía consciente"},"133011605570000001697",1,30392551,"BEATRIZ HELENA ALVAREZ LONDOÑO","Persona Natural",null,null,null,67000000,null,null,null,67000000,63426667,44244,44244,44546,300,null,null,null,null,null,null,null,null,"X",null,0.94666667164179108]
[1,325,2021,"FDLRUU-MC-325-2021","https://community.secop.gov.co/Public/Tendering/OpportunityDetail/Index?noticeUID=CO1.NTC.2464024&isFromPublicArea=True&isModal=False\n","Contratos de prestación de servicios","Contratación mínima cuantia","No aplica","PRESTACIÓN DE SERVICIO DE MANTENIMIENTO PREVENTIVO DE MOTOBOMBAS Y LAVADO Y DESINFECCIÓN DE TANQUE DE ALMACENAMIENTO DE AGUA POTABLE EN LAS INSTALACIONES DE LA ALCALDÍA LOCAL DE RAFAEL URIBE URIBE","Funcionamiento","Un Nuevo Contrato Social y Ambiental para la Bogotá del Siglo XXI","No aplica",{"$f":"IF(ISERROR(VLOOKUP(L347,Proposito_programa!$C$2:$E$59,2,FALSE)),\" \",VLOOKUP(L347,Proposito_programa!$C$2:$E$59,2,FALSE))","v":" "},{"$f":"IF(ISERROR(VLOOKUP(L347,Proposito_programa!$C$2:$E$59,3,FALSE)),\" \",VLOOKUP(L347,Proposito_programa!$C$2:$E$59,3,FALSE))","v":" "},"1310201010103- 131020202030502-131020202030605",5,901406200,"B.V. CONSTRUCCIONES S.A.S.","Persona Jurídica",null,null,null,2134443,null,null,null,2134443,0,44559,"CELEBRADO SIN INICIAR","CELEBRADO SIN INICIAR",90,null,null,null,null,null,null,"X",null,null,null,0]
[1,206,2020,"FDLRUU-SAMC-176-2020","https://community.secop.gov.co/Public/Tendering/OpportunityDetail/Index?noticeUID=CO1.NTC.1349918&isFromPublicArea=True&isModal=False\n","Suministro","Selección abreviada","Selección abreviada por menor cuantía ","CONTRATAR A MONTO AGOTABLE EL DIAGNÓSTICO, MANTENIMIENTO PREVENTIVO Y CORRECTIVO INCLUYENDO MANO DE OBRA Y/O SUMINISTRO DE REPUESTOS ORIGINALES, KITS DE ELEMENTOS, LUBRICANTES, SUMINISTRO DE LLANTAS Y DESPINCHES PARA LA MAQUINARIA PESADA DEL FONDO DE DESARROLLO LOCAL RAFAEL URIBE URIBE","Inversión","Un Nuevo Contrato Social y Ambiental para la Bogotá del Siglo XXI",49,{"$f":"IF(ISERROR(VLOOKUP(L348,Proposito_programa!$C$2:$E$59,2,FALSE)),\" \",VLOOKUP(L348,Proposito_programa!$C$2:$E$59,2,FALSE))","v":"Movilidad segura, sostenible y accesible"},{"$f":"IF(ISERROR(VLOOKUP(L348,Proposito_programa!$C$2:$E$59,3,FALSE)),\" \",VLOOKUP(L348,Proposito_programa!$C$2:$E$59,3,FALSE))","v":"Propósito 4: Hacer de Bogotá Región un modelo de movilidad multimodal, incluyente y sostenible"},"133011604490000001685",1,830006596,"AUTOS MONGUI SAS","Persona Jurídica",null,null,null,null,null,1,40000000,40000000,0,44404,44404,44520,450,1,30,null,null,null,null,null,null,"X",null,0]
[1,175,2021,"FDLRUU-CD-175-2021","https://community.secop.gov.co/Public/Tendering/OpportunityDetail/Index?noticeUID=CO1.NTC.1799940&isFromPublicArea=True&isModal=False\n","Contratos de prestación de servicios profesionales y de apoyo a la gestión","Contratación directa","Prestación de servicios profesionales y de apoyo a la gestión, o para la ejecución de trabajos artísticos que sólo puedan encomendarse a determinadas personas naturales;","PRESTAR SERVICIOS PROFESIONALES ESPECIALIZADOS AL DESPACHO DEL ALCALDE LOCAL EN LA FORMULACIÓN E IMPLEMENTACIÓN DE ESTRATEGIAS INTERINSTITUCIONALES EN ASPECTOS ECONÓMICOS, SOCIALES Y CULTURALES, QUE IMPACTEN EN LA LOCALIDAD RAFAEL URIBE URIBE","Inversión","Un Nuevo Contrato Social y Ambiental para la Bogotá del Siglo XXI",57,{"$f":"IF(ISERROR(VLOOKUP(L349,Proposito_programa!$C$2:$E$59,2,FALSE)),\" \",VLOOKUP(L349,Proposito_programa!$C$2:$E$59,2,FALSE))","v":"Gestión pública local"},{"$f":"IF(ISERROR(VLOOKUP(L349,Proposito_programa!$C$2:$E$59,3,FALSE)),\" \",VLOOKUP(L349,Proposito_programa!$C$2:$E$59,3,FALSE))","v":"Propósito 5: Construir Bogotá - Región con gobierno abierto, transparente y ciudadanía consciente"},"133011605570000001697",1,52538400,"AURA LIZETH MELO AVILA ","Persona Natural",null,null,null,75000000,null,null,null,75000000,67000000,44253,44258,44530,300,null,null,null,null,null,null,null,null,null,"X",0.89333333333333331]
[1,300,2021,"FDLRUU-CD-300-2021 ","https://community.secop.gov.co/Public/Tendering/OpportunityDetail/Index?noticeUID=CO1.NTC.2305010&isFromPublicArea=True&isModal=False","Contratos de prestación de servicios","Contratación directa","Cuando no exista pluralidad de oferentes en el mercado","FORMAR A LOS DIGNATARIOS Y/O CIUDADANÍA DE LAS JUNTAS DE ACCIÓN COMUNAL EN TEMAS BÁSICOS DE MANEJO DE ACCIONES COMUNALES. (DECRETO 2350 DEL 2003, ART. 32 Y LA LEY 1757 DE 2015) PARA LA MATERIALIZACIÓN DE LA INICIATIVA RUU 131 EN EL MARCO DEL PROYECTO DE INVERSIÓN 1689 PARTICIPACIÓN CIUDADANA ORGANIZADA Y SOLIDARIA EN RAFAEL URIBE URIBE.","Inversión","Un Nuevo Contrato Social y Ambiental para la Bogotá del Siglo XXI",55,{"$f":"IF(ISERROR(VLOOKUP(L350,Proposito_programa!$C$2:$E$59,2,FALSE)),\" \",VLOOKUP(L350,Proposito_programa!$C$2:$E$59,2,FALSE))","v":"Fortalecimiento de cultura ciudadana y su institucionalidad"},{"$f":"IF(ISERROR(VLOOKUP(L350,Proposito_programa!$C$2:$E$59,3,FALSE)),\" \",VLOOKUP(L350,Proposito_programa!$C$2:$E$59,3,FALSE))","v":"Propósito 5: Construir Bogotá - Región con gobierno abierto, transparente y ciudadanía consciente"},"133011605550000001689",1,830058756,"ASOJUNTAS LRUU.","Persona Jurídica",null,null,null,102530448,null,null,null,102530448,0,44481,44488,44638,150,null,null,null,null,null,null,null,"X",null,null,0]
[1,228,2021,"FDLRUU-AC-228-2021","https://community.secop.gov.co/Public/Tendering/OpportunityDetail/Index?noticeUID=CO1.NTC.2014733&isFromPublicArea=True&isModal=False\n","Contratos de prestación de servicios","Régimen especial","Decreto 92 de 2017","REALIZAR LA GESTIÓN INTEGRAL DE RESIDUOS SÓLIDOS APROVECHABLES DE CARÁCTER NO PELIGROSO, GENERADOS EN LAS INSTALACIONES DE LA ALCALDÍA LOCAL DE RAFAEL URIBE URIBE, LA CUAL COMPRENDE SU RECOLECCIÓN, TRANSPORTE SELECTIVO, ALMACENAMIENTO, CLASIFICACIÓN, APROVECHAMIENTO Y DISPOSICIÓN FINAL.","Funcionamiento","Un Nuevo Contrato Social y Ambiental para la Bogotá del Siglo XXI","No aplica",{"$f":"IF(ISERROR(VLOOKUP(L351,Proposito_programa!$C$2:$E$59,2,FALSE)),\" \",VLOOKUP(L351,Proposito_programa!$C$2:$E$59,2,FALSE))","v":" "},{"$f":"IF(ISERROR(VLOOKUP(L351,Proposito_programa!$C$2:$E$59,3,FALSE)),\" \",VLOOKUP(L351,Proposito_programa!$C$2:$E$59,3,FALSE))","v":" "},"N/A",1,901225706,"ASOCIACIÓN DE\nRECICLADORES COLOMBIA LIMPIA - ARECICOL","Persona Jurídica",null,null,null,0,null,null,null,0,"-",44386,44405,45134,720,null,null,null,null,null,null,null,"X",null,null,"-"]
[1,327,2021,"FDLRUU-SAMC-313-2021","https://community.secop.gov.co/Public/Tendering/OpportunityDetail/Index?noticeUID=CO1.NTC.2454697&isFromPublicArea=True&isModal=False","Contratos de prestación de servicios","Selección abreviada","Selección abreviada por menor cuantía ","RESTAR SERVICIOS OPERATIVOS, LOGISTICOS Y TÉCNICOS, ASÍ COMO EL SUMINISTRO DE BIENES PARA REALIZACIÓN DE LAS ACTIVIDADES REQUERIDAS EN EL MARCO DEL PROYECTO DE INVERSIÓN 1681 CULTURA CIUDADANA Y USO ÓPTIMO DEL ESPACIO PÚBLICO EN RAFAEL URIBE URIBE","Inversión","Un Nuevo Contrato Social y Ambiental para la Bogotá del Siglo XXI",45,{"$f":"IF(ISERROR(VLOOKUP(L352,Proposito_programa!$C$2:$E$59,2,FALSE)),\" \",VLOOKUP(L352,Proposito_programa!$C$2:$E$59,2,FALSE))","v":"Espacio público más seguro y construido colectivamente"},{"$f":"IF(ISERROR(VLOOKUP(L352,Proposito_programa!$C$2:$E$59,3,FALSE)),\" \",VLOOKUP(L352,Proposito_programa!$C$2:$E$59,3,FALSE))","v":"Propósito 3: Inspirar confianza y legitimidad para vivir sin miedo y ser epicentro de cultura ciudadana, paz y reconciliación"},"133011603450000001681",11,900175374,"ASOCIACIÓN DE HOGARES SI A LA VIDA","Persona Jurídica",null,null,null,302460000,null,null,null,302460000,0,44559,"CELEBRADO SIN INICIAR","CELEBRADO SIN INICIAR",60,null,null,null,null,null,null,"X",null,null,null,0]
[1,313,2021,"FDLRUU-SAMC-306-2021","https://community.secop.gov.co/Public/Tendering/OpportunityDetail/Index?noticeUID=CO1.NTC.2401466&isFromPublicArea=True&isModal=False\n","Seguros","Selección abreviada","Selección abreviada por menor cuantía ","CONTRATAR LOS SEGUROS QUE AMPAREN LOS INTERESES PATRIMONIALES ACTUALES Y FUTUROS, ASÍ COMO LOS BIENES DE PROPIEDAD DE LA FONDO DE DESARROLLO LOCAL DE RAFAEL URIBE URIBE, QUE ESTÉN BAJO SU RESPONSABILIDAD Y CUSTODIA Y AQUELLOS QUE SEAN ADQUIRIDOS PARA DESARROLLAR LAS FUNCIONES INHERENTES A SU ACTIVIDAD Y CUALQUIER OTRA PÓLIZA DE SEGUROS QUE REQUIERA LA ENTIDAD EN EL DESARROLLO DE SU ACTIVIDAD","Funcionamiento","Un Nuevo Contrato Social y Ambiental para la Bogotá del Siglo XXI","No aplica",{"$f":"IF(ISERROR(VLOOKUP(L353,Proposito_programa!$C$2:$E$59,2,FALSE)),\" \",VLOOKUP(L353,Proposito_programa!$C$2:$E$59,2,FALSE))","v":" "},{"$f":"IF(ISERROR(VLOOKUP(L353,Proposito_programa!$C$2:$E$59,3,FALSE)),\" \",VLOOKUP(L353,Proposito_programa!$C$2:$E$59,3,FALSE))","v":" "},"131020202020107 -131020202020108-131020202020109 -131020202020110 -131020202020112",1,860524654,"ASEGURADORA SOLIDARIA DE COLOMBIA ENTIDAD COOPERATIVA ","Persona Jurídica",null,null,null,69285976,null,null,null,69285976,0,44532,44533,44703,170,null,null,null,null,null,null,null,"X",null,null,0]
[1,251,2021,"FDLRUU-MC-251-2021","https://community.secop.gov.co/Public/Tendering/OpportunityDetail/Index?noticeUID=CO1.NTC.2122110&isFromPublicArea=True&isModal=False\n","Seguros","Contratación mínima cuantia","No aplica","CONTRATAR LOS SEGUROS QUE AMPAREN LOS INTERESES PATRIMONIALES ACTUALES Y FUTUROS, ASÍ COMO LOS BI ENES DE PROPIEDAD DEL FONDO DE DESARROLLO LOCAL DE RAFAEL URIBE URIBE , QUE ESTÉN BAJO SU RESPONSABILIDAD Y CUSTODIA Y AQUE L LOS QUE SEAN ADQUIRIDOS PARA DESARROLLAR LAS F UNCIONES INHERENTES A SU ACTIVIDAD, Y CUALQUIER OTRA PÓLIZA DE SEGUROS QUE REQUIERA LA ENTIDAD EN EL DESARROLLO DE SU ACTIVIDAD","Funcionamiento","Un Nuevo Contrato Social y Ambiental para la Bogotá del Siglo XXI","No aplica",{"$f":"IF(ISERROR(VLOOKUP(L354,Proposito_programa!$C$2:$E$59,2,FALSE)),\" \",VLOOKUP(L354,Proposito_programa!$C$2:$E$59,2,FALSE))","v":" "},{"$f":"IF(ISERROR(VLOOKUP(L354,Proposito_programa!$C$2:$E$59,3,FALSE)),\" \",VLOOKUP(L354,Proposito_programa!$C$2:$E$59,3,FALSE))","v":" "},"131020202020107 -131020202020108-131020202020109 -131020202020110 -131020202020112",1,860524654,"ASEGURADORA SOLIDARIA DE COLOMBIA ","Persona Jurídica",null,null,null,40876301,null,2,20119041,60995342,60670012,44407,44410,44533,80,2,44,null,null,null,null,null,null,"X",null,0.9946663140277171]
[1,301,2020,"FDLRUU-SAMC-271-2020","https://community.secop.gov.co/Public/Tendering/OpportunityDetail/Index?noticeUID=CO1.NTC.1438764&isFromPublicArea=True&isModal=False","Seguros","Selección abreviada","Selección abreviada por menor cuantía ","CONTRATAR LOS SEGUROS QUE AMPAREN LOS INTERESES PATRIMONIALES ACTUALES Y FUTUROS, ASÍ COMO LOS BIENES DE PROPIEDAD DEL FONDO DE DESARROLLO LOCAL DE RAFAEL URIBE URIBE, QUE ESTÉN BAJO SU RESPONSABILIDAD Y CUSTODIA Y AQUELLOS QUE SEAN ADQUIRIDOS PARA DESARROLLAR LAS FUNCIONES INHERENTES A SU ACTIVIDAD Y CUALQUIER OTRA PÓLIZA DE SEGUROS QUE REQUIERA LA ENTIDAD EN EL DESARROLLO DE SU ACTIVIDAD.","Funcionamiento","Un Nuevo Contrato Social y Ambiental para la Bogotá del Siglo XXI","No aplica",{"$f":"IF(ISERROR(VLOOKUP(L355,Proposito_programa!$C$2:$E$59,2,FALSE)),\" \",VLOOKUP(L355,Proposito_programa!$C$2:$E$59,2,FALSE))","v":" "},{"$f":"IF(ISERROR(VLOOKUP(L355,Proposito_programa!$C$2:$E$59,3,FALSE)),\" \",VLOOKUP(L355,Proposito_programa!$C$2:$E$59,3,FALSE))","v":" "},"131020202020107-131020202020108-131020202020109 -131020202020112",1,860524654,"ASEGURADORA SOLIDARIA DE COLOMBIA","Persona Jurídica",null,null,null,null,null,2,42263115,42263115,42263114,44365,44365,44409,493,1,31,null,null,null,null,null,"X",null,null,0.99999997633870574]
[1,70180,2021,"OC-70180","https://colombiacompra.gov.co/tienda-virtual-del-estado-colombiano/ordenes-compra/70180","Contratos de prestación de servicios","Selección abreviada","Acuerdo marco de precios "," PRESTAR EL SERVICIO INTEGRAL DE ASEO Y CAFETERÍA INCLUIDO EL MANTENIMIENTO LOCATIVO BÁSICO, LOS EQUIPOS NECESARIOS PARA EL DESARROLLO DEL MISMO Y EL SUMINISTRO DE INSUMOS PARA LAS DEPENDENCIAS DE LA ALCALDÍA LOCAL DE RAFAEL URIBE URIBE Y LA JUNTA ADMINISTRADORA LOCAL","Funcionamiento","Un Nuevo Contrato Social y Ambiental para la Bogotá del Siglo XXI","No aplica",{"$f":"IF(ISERROR(VLOOKUP(L356,Proposito_programa!$C$2:$E$59,2,FALSE)),\" \",VLOOKUP(L356,Proposito_programa!$C$2:$E$59,2,FALSE))","v":" "},{"$f":"IF(ISERROR(VLOOKUP(L356,Proposito_programa!$C$2:$E$59,3,FALSE)),\" \",VLOOKUP(L356,Proposito_programa!$C$2:$E$59,3,FALSE))","v":" "},"131020202030502 - 1310202010204",1,811044253,"ASEAR S.A. E.S.P","Persona Jurídica",null,null,null,146144739,null,null,null,146144739,66726625,44349,44351,44715,360,null,null,null,null,null,null,null,"X",null,null,0.45657904250662079]
[1,217,2021,"FDLRUU-CD-217-2021","https://community.secop.gov.co/Public/Tendering/OpportunityDetail/Index?noticeUID=CO1.NTC.1954811&isFromPublicArea=True&isModal=False\n","Contratos de prestación de servicios","Contratación directa","Cuando no exista pluralidad de oferentes en el mercado","PRESTAR EL SERVICIO DE MANTENIMIENTO PREVENTIVO Y CORRECTIVO CON BOLSA DE REPUESTOS AL ASCENSOR MARCA SCHINDLER ANDINO DE PROPIEDAD DE LA ALCALDÍA LOCAL DE RAFAEL URIBE URIBE","Funcionamiento","Un Nuevo Contrato Social y Ambiental para la Bogotá del Siglo XXI","No aplica",{"$f":"IF(ISERROR(VLOOKUP(L357,Proposito_programa!$C$2:$E$59,2,FALSE)),\" \",VLOOKUP(L357,Proposito_programa!$C$2:$E$59,2,FALSE))","v":" "},{"$f":"IF(ISERROR(VLOOKUP(L357,Proposito_programa!$C$2:$E$59,3,FALSE)),\" \",VLOOKUP(L357,Proposito_programa!$C$2:$E$59,3,FALSE))","v":" "},"131020202030611",1,860005289,"ASCENSORES SCHILDLER","Persona Jurídica",null,null,null,9000000,null,null,null,9000000,2986002,44327,44330,44694,360,null,null,null,null,null,null,null,"X",null,null,0.33177800000000002]
[1,158,2021,"FDLRUU-CD-150-2021","https://community.secop.gov.co/Public/Tendering/OpportunityDetail/Index?noticeUID=CO1.NTC.1800149&isFromPublicArea=True&isModal=False\n","Contratos de prestación de servicios profesionales y de apoyo a la gestión","Contratación directa","Prestación de servicios profesionales y de apoyo a la gestión, o para la ejecución de trabajos artísticos que sólo puedan encomendarse a determinadas personas naturales;","EL CONTRATISTA SE OBLIGA CON EL FONDO DE DESARROLLO LOCAL DE RAFAEL URIBE URIBE A PRESTAR SUS SERVICIOS DE APOYO A LA GESTION LOCAL Y TERRITORIAL DE LOS TEMAS DE SEGURIDAD Y CONVIVENCIA CIUDADANA PARA LA ALCALDIA LOCAL DE RAFAEL URIBE URIBE","Inversión","Un Nuevo Contrato Social y Ambiental para la Bogotá del Siglo XXI",43,{"$f":"IF(ISERROR(VLOOKUP(L358,Proposito_programa!$C$2:$E$59,2,FALSE)),\" \",VLOOKUP(L358,Proposito_programa!$C$2:$E$59,2,FALSE))","v":"Cultura ciudadana para la confianza, la convivencia y la participación desde la vida cotidiana"},{"$f":"IF(ISERROR(VLOOKUP(L358,Proposito_programa!$C$2:$E$59,3,FALSE)),\" \",VLOOKUP(L358,Proposito_programa!$C$2:$E$59,3,FALSE))","v":"Propósito 3: Inspirar confianza y legitimidad para vivir sin miedo y ser epicentro de cultura ciudadana, paz y reconciliación"},"133011603430000001680",1,1022444715,"ARLY JOHANA LIMAS ROJAS ","Persona Natural",null,null,null,19800000,null,1,3153333,22953333,19800000,44253,44256,44574,270,1,43,null,null,null,null,null,null,"X",null,0.86261982083386324]
[1,221,2021,"FDLRUU-CD-221-2021","https://community.secop.gov.co/Public/Tendering/OpportunityDetail/Index?noticeUID=CO1.NTC.1976262&isFromPublicArea=True&isModal=False\n","Contratos de prestación de servicios profesionales y de apoyo a la gestión","Contratación directa","Prestación de servicios profesionales y de apoyo a la gestión, o para la ejecución de trabajos artísticos que sólo puedan encomendarse a determinadas personas naturales;","APOYAR JURÍDICAMENTE LA EJECUCIÓN DE LAS ACCIONES REQUERIDAS PARA EL TRÁMITE E IMPULSO PROCESAL DE LAS ACTUACIONES CONTRAVENCIONALES Y/O QUERELLAS QUE CURSEN EN LAS INSPECCIONES DE POLICÍA DE LA LOCALIDAD DE RAFAEL URIBE URIBE","Inversión","Un Nuevo Contrato Social y Ambiental para la Bogotá del Siglo XXI",57,{"$f":"IF(ISERROR(VLOOKUP(L359,Proposito_programa!$C$2:$E$59,2,FALSE)),\" \",VLOOKUP(L359,Proposito_programa!$C$2:$E$59,2,FALSE))","v":"Gestión pública local"},{"$f":"IF(ISERROR(VLOOKUP(L359,Proposito_programa!$C$2:$E$59,3,FALSE)),\" \",VLOOKUP(L359,Proposito_programa!$C$2:$E$59,3,FALSE))","v":"Propósito 5: Construir Bogotá - Región con gobierno abierto, transparente y ciudadanía consciente"},"133011605570000001698",1,52525366,"ANGY PATRICIA BARON SALAMANCA","Persona Natural",null,null,null,31200000,null,1,8146667,39346667,31893333,44335,44343,44574,180,1,47,null,null,null,null,null,null,"X",null,0.81057267188603299]
[1,138,2021,"FDLRUU-CD-138-2021","https://community.secop.gov.co/Public/Tendering/OpportunityDetail/Index?noticeUID=CO1.NTC.1791539&isFromPublicArea=True&isModal=False\n","Contratos de prestación de servicios profesionales y de apoyo a la gestión","Contratación directa","Prestación de servicios profesionales y de apoyo a la gestión, o para la ejecución de trabajos artísticos que sólo puedan encomendarse a determinadas personas naturales;","PRESTAR LOS SERVICIOS DE APOYO TÉCNICO ADMINISTRATIVO PARA EL AREA DE GESTION DE DESARROLLO LOCAL INFRAESTRUCTURA DE LA ALCALDÍA LOCAL DE RAFAEL URIBE URIBE","Inversión","Un Nuevo Contrato Social y Ambiental para la Bogotá del Siglo XXI",57,{"$f":"IF(ISERROR(VLOOKUP(L360,Proposito_programa!$C$2:$E$59,2,FALSE)),\" \",VLOOKUP(L360,Proposito_programa!$C$2:$E$59,2,FALSE))","v":"Gestión pública local"},{"$f":"IF(ISERROR(VLOOKUP(L360,Proposito_programa!$C$2:$E$59,3,FALSE)),\" \",VLOOKUP(L360,Proposito_programa!$C$2:$E$59,3,FALSE))","v":"Propósito 5: Construir Bogotá - Región con gobierno abierto, transparente y ciudadanía consciente"},"133011605570000001697",1,1023896385,"ANGIE PAOLA BAUTISTA TRIANA ","Persona Natural",null,null,null,39000000,null,null,null,39000000,36010000,44250,44251,44553,300,null,null,null,null,null,null,null,null,"X",null,0.92333333333333334]
[1,194,2021,"FDLRUU-CD-194-2021","https://community.secop.gov.co/Public/Tendering/OpportunityDetail/Index?noticeUID=CO1.NTC.1838147&isFromPublicArea=True&isModal=False\n","Contratos de prestación de servicios profesionales y de apoyo a la gestión","Contratación directa","Prestación de servicios profesionales y de apoyo a la gestión, o para la ejecución de trabajos artísticos que sólo puedan encomendarse a determinadas personas naturales;","PRESTAR SUS SERVICIOS DE APOYO ADMINISTRATIVO ASISTENCIAL EN EL PROCESO DE TOMA FISICA VERIFICACION, CLASIFICACION Y ACTUALIZACION DE LA INFORMACION DE BIENES MUEBLES E INMUEBLES DE PROPIEDAD Y/O A CARGO DEL FONDO DE DESARROLLO LOCAL DE RAFAEL URIBE URIBE Y DEPURACION DE LOS CONTRATOS DE COMODATO EN EL AREA DE GESTIÓN PARA EL DESARROLLO LOCAL ALMACEN DE CONFORMIDAD CON LAS DISPOSICIONES LEGALES VIGENTES","Inversión","Un Nuevo Contrato Social y Ambiental para la Bogotá del Siglo XXI",57,{"$f":"IF(ISERROR(VLOOKUP(L361,Proposito_programa!$C$2:$E$59,2,FALSE)),\" \",VLOOKUP(L361,Proposito_programa!$C$2:$E$59,2,FALSE))","v":"Gestión pública local"},{"$f":"IF(ISERROR(VLOOKUP(L361,Proposito_programa!$C$2:$E$59,3,FALSE)),\" \",VLOOKUP(L361,Proposito_programa!$C$2:$E$59,3,FALSE))","v":"Propósito 5: Construir Bogotá - Región con gobierno abierto, transparente y ciudadanía consciente"},"133011605570000001697",1,1010201479,"ANGIE LORENA RAMOS","Persona Natural",null,null,null,26000000,null,null,null,26000000,21926667,44271,44273,44578,300,null,null,null,null,null,null,null,null,"X",null,0.84333334615384614]
[1,52,2021,"FDLRUU-CD-052-2021","https://community.secop.gov.co/Public/Tendering/OpportunityDetail/Index?noticeUID=CO1.NTC.1737346&isFromPublicArea=True&isModal=False\n","Contratos de prestación de servicios profesionales y de apoyo a la gestión","Contratación directa","Prestación de servicios profesionales y de apoyo a la gestión, o para la ejecución de trabajos artísticos que sólo puedan encomendarse a determinadas personas naturales;","POYAR JURÍDICAMENTE LA EJECUCIÓN DE LAS ACCIONES REQUERIDAS PARA EL TRÁMITE E IMPULSO PROCESAL DE LAS ACTUACIONES CONTRAVENCIONALES Y/O QUERELLAS QUE CURSEN EN LAS INSPECCIONES DE POLICÍA DE LA LOCALIDAD DE RAFAEL URIBE URIBE","Inversión","Un Nuevo Contrato Social y Ambiental para la Bogotá del Siglo XXI",57,{"$f":"IF(ISERROR(VLOOKUP(L362,Proposito_programa!$C$2:$E$59,2,FALSE)),\" \",VLOOKUP(L362,Proposito_programa!$C$2:$E$59,2,FALSE))","v":"Gestión pública local"},{"$f":"IF(ISERROR(VLOOKUP(L362,Proposito_programa!$C$2:$E$59,3,FALSE)),\" \",VLOOKUP(L362,Proposito_programa!$C$2:$E$59,3,FALSE))","v":"Propósito 5: Construir Bogotá - Región con gobierno abierto, transparente y ciudadanía consciente"},"133011605570000001698",1,1014224065,"ANGIE ELIZABETH TORRES MORENO","Persona Natural",null,null,null,31200000,null,1,15600000,46800000,46800000,44232,44236,44508,180,1,90,null,null,null,null,null,null,"X",null,1]
[1,85,2021,"FDLRUU-CD-085-2021","https://community.secop.gov.co/Public/Tendering/ContractNoticePhases/View?PPI=CO1.PPI.12003823&isFromPublicArea=True&isModal=False","Contratos de prestación de servicios profesionales y de apoyo a la gestión","Contratación directa","Prestación de servicios profesionales y de apoyo a la gestión, o para la ejecución de trabajos artísticos que sólo puedan encomendarse a determinadas personas naturales;","PRESTAR LOS SERVICIOS PROFESIONALES PARA ACOMPAÑAR LOS PROCESOS DE FORMULACION, EVALUACIÓN Y SEGUIMIENTO DE LOS PROYECTOS DE INFRAESTRUCTURA, MALLA VIAL, SALONES COMUNALES, MITIGACION ESPACIO PÚBLICO Y PARQUES DE LA LOCALIDAD DE RAFAEL URIBE URIBE","Inversión","Un Nuevo Contrato Social y Ambiental para la Bogotá del Siglo XXI",57,{"$f":"IF(ISERROR(VLOOKUP(L363,Proposito_programa!$C$2:$E$59,2,FALSE)),\" \",VLOOKUP(L363,Proposito_programa!$C$2:$E$59,2,FALSE))","v":"Gestión pública local"},{"$f":"IF(ISERROR(VLOOKUP(L363,Proposito_programa!$C$2:$E$59,3,FALSE)),\" \",VLOOKUP(L363,Proposito_programa!$C$2:$E$59,3,FALSE))","v":"Propósito 5: Construir Bogotá - Región con gobierno abierto, transparente y ciudadanía consciente"},"133011605570000001697",1,52381414,"ANGELICA MARIA SANCHEZ RODRIGUEZ ","Persona Natural",null,null,null,57000000,null,1,6080000,63080000,54910000,44238,44239,44574,300,1,32,null,null,null,null,null,null,"X",null,0.87048192771084343]
[1,125,2021,"FDLRUU-CD-125-2021","https://community.secop.gov.co/Public/Tendering/OpportunityDetail/Index?noticeUID=CO1.NTC.1780524&isFromPublicArea=True&isModal=False\n","Contratos de prestación de servicios profesionales y de apoyo a la gestión","Contratación directa","Prestación de servicios profesionales y de apoyo a la gestión, o para la ejecución de trabajos artísticos que sólo puedan encomendarse a determinadas personas naturales;","PRESTAR LOS SERVICIOS PROFESIONALES PARA LA OPERACIÓN, SEGUIMIENTO Y CUMPLIMIENTO DE LOS PROCESOS Y PROCEDIMIENTOS DEL SERVICIO APOYO ECONÓMICO TIPO C, REQUERIDOS PARA EL OPORTUNO Y ADECUADO REGISTRO, CRUCE Y REPORTE DE LOS DATOS EN EL SISTEMA MISIONAL – SIRBE, QUE CONTRIBUYAN A LA GARANTÍA DE LOS DERECHOS DE LA POBLACIÓN MAYOR EN EL MARCO DE LA POLÍTICA PÚBLICA SOCIAL PARA EL ENVEJECIMIENTO Y LA VEJEZ EN EL DISTRITO CAPITAL A CARGO DE LA ALCALDÍA LOCAL","Inversión","Un Nuevo Contrato Social y Ambiental para la Bogotá del Siglo XXI",1,{"$f":"IF(ISERROR(VLOOKUP(L364,Proposito_programa!$C$2:$E$59,2,FALSE)),\" \",VLOOKUP(L364,Proposito_programa!$C$2:$E$59,2,FALSE))","v":"Subsidios y transferencias para la equidad"},{"$f":"IF(ISERROR(VLOOKUP(L364,Proposito_programa!$C$2:$E$59,3,FALSE)),\" \",VLOOKUP(L364,Proposito_programa!$C$2:$E$59,3,FALSE))","v":"Propósito 1: Hacer un nuevo contrato social para incrementar la inclusión social, productiva y política"},"133011601010000001636",1,1013611272,"ANGELA PATRICIA ROZO RODRIGUEZ ","Persona Natural",null,null,null,41600000,null,1,15080000,56680000,48880000,44245,44246,44574,240,1,87,null,null,null,null,null,null,"X",null,0.86238532110091748]
[1,36,2021,"FDLRUU-CD-036-2021","https://community.secop.gov.co/Public/Tendering/ContractNoticePhases/View?PPI=CO1.PPI.11889526&isFromPublicArea=True&isModal=False","Contratos de prestación de servicios profesionales y de apoyo a la gestión","Contratación directa","Prestación de servicios profesionales y de apoyo a la gestión, o para la ejecución de trabajos artísticos que sólo puedan encomendarse a determinadas personas naturales;","PRESTAR LOS SERVICIOS PERSONALES DE APOYO A LA GESTIÓN PARA LA CONDUCCIÓN DE LOS VEHÍCULOS LIVIANOS QUE LE SEAN ASIGNADOS Y QUE SE ENCUENTREN AL SERVICIO DE LA ALCALDÍA LOCAL DE RAFAEL URIBE URIBE","Inversión","Un Nuevo Contrato Social y Ambiental para la Bogotá del Siglo XXI",57,{"$f":"IF(ISERROR(VLOOKUP(L365,Proposito_programa!$C$2:$E$59,2,FALSE)),\" \",VLOOKUP(L365,Proposito_programa!$C$2:$E$59,2,FALSE))","v":"Gestión pública local"},{"$f":"IF(ISERROR(VLOOKUP(L365,Proposito_programa!$C$2:$E$59,3,FALSE)),\" \",VLOOKUP(L365,Proposito_programa!$C$2:$E$59,3,FALSE))","v":"Propósito 5: Construir Bogotá - Región con gobierno abierto, transparente y ciudadanía consciente"},"133011605570000001697",1,10541268,"ANGEL GABRIEL HURTADO HURTADO","Persona Natural",null,null,null,26000000,null,null,null,26000000,7453333,44230,44232,44348,300,null,null,null,null,null,null,null,null,null,"X",0.28666665384615386]
[1,199,2021,"FDLRUU-CD-199-2021","https://community.secop.gov.co/Public/Tendering/OpportunityDetail/Index?noticeUID=CO1.NTC.1851016&isFromPublicArea=True&isModal=False\n","Contratos de prestación de servicios profesionales y de apoyo a la gestión","Contratación directa","Prestación de servicios profesionales y de apoyo a la gestión, o para la ejecución de trabajos artísticos que sólo puedan encomendarse a determinadas personas naturales;","APOYAR TÉCNICAMENTE LAS DISTINTAS ETAPAS DE LOS PROCESOS DE COMPETENCIA DE LAS INSPECCIONES DE POLICÍA DE LA LOCALIDAD, SEGÚN REPARTO","Inversión","Un Nuevo Contrato Social y Ambiental para la Bogotá del Siglo XXI",57,{"$f":"IF(ISERROR(VLOOKUP(L366,Proposito_programa!$C$2:$E$59,2,FALSE)),\" \",VLOOKUP(L366,Proposito_programa!$C$2:$E$59,2,FALSE))","v":"Gestión pública local"},{"$f":"IF(ISERROR(VLOOKUP(L366,Proposito_programa!$C$2:$E$59,3,FALSE)),\" \",VLOOKUP(L366,Proposito_programa!$C$2:$E$59,3,FALSE))","v":"Propósito 5: Construir Bogotá - Región con gobierno abierto, transparente y ciudadanía consciente"},"133011605570000001698",1,1013636916,"ANDRES CAMILO VELASQUEZ LEON","Persona Natural",null,null,null,31200000,null,1,15600000,46800000,42986667,44272,44278,44552,180,1,90,null,null,null,null,null,null,"X",null,0.91851852564102565]
[1,82,2021,"FDLRUU-CD-082-2021","https://community.secop.gov.co/Public/Tendering/OpportunityDetail/Index?noticeUID=CO1.NTC.1761955&isFromPublicArea=True&isModal=False\n","Contratos de prestación de servicios profesionales y de apoyo a la gestión","Contratación directa","Prestación de servicios profesionales y de apoyo a la gestión, o para la ejecución de trabajos artísticos que sólo puedan encomendarse a determinadas personas naturales;","PRESTAR SUS SERVICIOS DE APOYO ADMINISTRATIVO ASISTENCIAL AL AREA DE GESTION JURIDICO POLICIVA DE LA ALCALDÍA LOCAL DE RAFAEL URIBE URIBE","Inversión","Un Nuevo Contrato Social y Ambiental para la Bogotá del Siglo XXI",57,{"$f":"IF(ISERROR(VLOOKUP(L367,Proposito_programa!$C$2:$E$59,2,FALSE)),\" \",VLOOKUP(L367,Proposito_programa!$C$2:$E$59,2,FALSE))","v":"Gestión pública local"},{"$f":"IF(ISERROR(VLOOKUP(L367,Proposito_programa!$C$2:$E$59,3,FALSE)),\" \",VLOOKUP(L367,Proposito_programa!$C$2:$E$59,3,FALSE))","v":"Propósito 5: Construir Bogotá - Región con gobierno abierto, transparente y ciudadanía consciente"},"133011605570000001698",1,80180407,"ANDRES CAMILO REDONDO RENGIFO","Persona Natural",null,null,null,26000000,null,1,2513333,28513333,24786667,44239,44242,44574,300,1,29,null,null,null,null,null,null,"X",null,0.86930093370704853]
[1,237,2021,"FDLRUU-CD-237-2021 ","https://community.secop.gov.co/Public/Tendering/OpportunityDetail/Index?noticeUID=CO1.NTC.2096438&isFromPublicArea=True&isModal=False\n","Contratos de prestación de servicios profesionales y de apoyo a la gestión","Contratación directa","Prestación de servicios profesionales y de apoyo a la gestión, o para la ejecución de trabajos artísticos que sólo puedan encomendarse a determinadas personas naturales;","PRESTAR LOS SERVICIOS PROFESIONALES AL DESPACHO DE LA ALCALDÍA LOCAL DE RAFAEL URIBE URIBE EN EL ANÁLISIS, DIVULGACION, TRÁMITE Y CONCEPTUALIZACIÓN EN PROCESOS DE GESTIÓN PÚBLICA QUE SE REQUIERA\t ","Inversión","Un Nuevo Contrato Social y Ambiental para la Bogotá del Siglo XXI",57,{"$f":"IF(ISERROR(VLOOKUP(L368,Proposito_programa!$C$2:$E$59,2,FALSE)),\" \",VLOOKUP(L368,Proposito_programa!$C$2:$E$59,2,FALSE))","v":"Gestión pública local"},{"$f":"IF(ISERROR(VLOOKUP(L368,Proposito_programa!$C$2:$E$59,3,FALSE)),\" \",VLOOKUP(L368,Proposito_programa!$C$2:$E$59,3,FALSE))","v":"Propósito 5: Construir Bogotá - Región con gobierno abierto, transparente y ciudadanía consciente"},"133011605570000001697",1,1140815716,"ANDREA STHEPANIE DAVILA CLARO","Persona Natural",null,null,null,26000000,null,null,null,26000000,22750000,44390,44393,44500,120,null,null,null,null,null,null,null,null,null,"X",0.875]
[1,101,2021,"FDLRUU-CD-101-2021","https://community.secop.gov.co/Public/Tendering/OpportunityDetail/Index?noticeUID=CO1.NTC.1759851&isFromPublicArea=True&isModal=False\n","Contratos de prestación de servicios profesionales y de apoyo a la gestión","Contratación directa","Prestación de servicios profesionales y de apoyo a la gestión, o para la ejecución de trabajos artísticos que sólo puedan encomendarse a determinadas personas naturales;","\tPRESTAR SUS SERVICIOS DE APOYO ADMINISTRATIVO ASISTENCIAL AL AREA DE GESTION JURIDICO POLICIVA DE LA ALCALDÍA LOCAL DE RAFAEL URIBE URIBE","Inversión","Un Nuevo Contrato Social y Ambiental para la Bogotá del Siglo XXI",57,{"$f":"IF(ISERROR(VLOOKUP(L369,Proposito_programa!$C$2:$E$59,2,FALSE)),\" \",VLOOKUP(L369,Proposito_programa!$C$2:$E$59,2,FALSE))","v":"Gestión pública local"},{"$f":"IF(ISERROR(VLOOKUP(L369,Proposito_programa!$C$2:$E$59,3,FALSE)),\" \",VLOOKUP(L369,Proposito_programa!$C$2:$E$59,3,FALSE))","v":"Propósito 5: Construir Bogotá - Región con gobierno abierto, transparente y ciudadanía consciente"},"133011605570000001698",1,1033764978,"ANDREA DEL PILAR RODRIGUEZ RODRIGUEZ","Persona Natural",null,null,null,26000000,null,null,null,26000000,23833333,44239,44253,44555,300,null,null,null,null,null,null,null,null,"X",null,0.91666665384615387]
[1,60,2021,"FDLRUU-CD-060-2021","https://community.secop.gov.co/Public/Tendering/OpportunityDetail/Index?noticeUID=CO1.NTC.1744386&isFromPublicArea=True&isModal=False\n","Contratos de prestación de servicios profesionales y de apoyo a la gestión","Contratación directa","Prestación de servicios profesionales y de apoyo a la gestión, o para la ejecución de trabajos artísticos que sólo puedan encomendarse a determinadas personas naturales;","PRESTAR SUS SERVICIOS DE APOYO ADMINISTRATIVO ASISTENCIAL AL ÁREA DE GESTIÓN PARA EL DESARROLLO LOCAL DE LA ALCALDÍA LOCAL DE RAFAEL URIBE URIBE","Inversión","Un Nuevo Contrato Social y Ambiental para la Bogotá del Siglo XXI",57,{"$f":"IF(ISERROR(VLOOKUP(L370,Proposito_programa!$C$2:$E$59,2,FALSE)),\" \",VLOOKUP(L370,Proposito_programa!$C$2:$E$59,2,FALSE))","v":"Gestión pública local"},{"$f":"IF(ISERROR(VLOOKUP(L370,Proposito_programa!$C$2:$E$59,3,FALSE)),\" \",VLOOKUP(L370,Proposito_programa!$C$2:$E$59,3,FALSE))","v":"Propósito 5: Construir Bogotá - Región con gobierno abierto, transparente y ciudadanía consciente"},"133011605570000001697",1,1033819386,"ANDREA CAROLINA CAICEDO GARAVITO","Persona Natural",null,null,null,26000000,null,1,2946667,28946667,25220000,44236,44237,44574,300,1,34,null,null,null,null,null,null,"X",null,0.8712574749970351]
[1,140,2021,"FDLRUU-CD-140-2021","https://community.secop.gov.co/Public/Tendering/OpportunityDetail/Index?noticeUID=CO1.NTC.1792090&isFromPublicArea=True&isModal=False\n","Contratos de prestación de servicios profesionales y de apoyo a la gestión","Contratación directa","Prestación de servicios profesionales y de apoyo a la gestión, o para la ejecución de trabajos artísticos que sólo puedan encomendarse a determinadas personas naturales;","PRESTAR LOS SERVICIOS PROFESIONALES PARA ADELANTAR LAS ACCIONES TENDIENTES AL AGENCIAMIENTO E IMPLEMENTACIÓN DE LAS POLÍTICAS PÚBLICAS DEL ORDEN DISTRITAL EN LO LOCAL, SEGUIMIENTO AL PLAN DE DESARROLLO LOCAL, ACOMPAÑAR LAS INSTANCIAS DE PARTICIPACIÓN QUE LE SEAN ASIGNADAS POR EL SUPERVISOR Y APOYAR LAS DEMÁS ACTIVIDADES QUE SE GENEREN EN EL ÁREA DE GESTIÓN DEL DESARROLLO LOCAL","Inversión","Un Nuevo Contrato Social y Ambiental para la Bogotá del Siglo XXI",57,{"$f":"IF(ISERROR(VLOOKUP(L371,Proposito_programa!$C$2:$E$59,2,FALSE)),\" \",VLOOKUP(L371,Proposito_programa!$C$2:$E$59,2,FALSE))","v":"Gestión pública local"},{"$f":"IF(ISERROR(VLOOKUP(L371,Proposito_programa!$C$2:$E$59,3,FALSE)),\" \",VLOOKUP(L371,Proposito_programa!$C$2:$E$59,3,FALSE))","v":"Propósito 5: Construir Bogotá - Región con gobierno abierto, transparente y ciudadanía consciente"},"133011605570000001697",1,1010221253,"ANDREA CAROLINA BARRETO PEREZ ","Persona Natural",null,null,null,52000000,null,null,null,52000000,47840000,44251,44252,44554,300,null,null,null,null,null,null,null,null,"X",null,0.92]
[1,139,2021,"FDLRUU-CD-139-2021","https://community.secop.gov.co/Public/Tendering/OpportunityDetail/Index?noticeUID=CO1.NTC.1791983&isFromPublicArea=True&isModal=False\n","Contratos de prestación de servicios profesionales y de apoyo a la gestión","Contratación directa","Prestación de servicios profesionales y de apoyo a la gestión, o para la ejecución de trabajos artísticos que sólo puedan encomendarse a determinadas personas naturales;","APOYAR AL (A) ALCALDE (SA) LOCAL EN EL FORTALECIMIENTO E INCLUSIÓN DE LAS COMUNIDADES NEGRAS, AFROCOLOMBIANAS, PALENQUERAS E INDÍEGNAS EN EL MARCO DE LA POLÍTICA PÚBLICA DISTRITAL Y LOS ESPACIOS DE PARTICIPACIÓN","Inversión","Un Nuevo Contrato Social y Ambiental para la Bogotá del Siglo XXI",57,{"$f":"IF(ISERROR(VLOOKUP(L372,Proposito_programa!$C$2:$E$59,2,FALSE)),\" \",VLOOKUP(L372,Proposito_programa!$C$2:$E$59,2,FALSE))","v":"Gestión pública local"},{"$f":"IF(ISERROR(VLOOKUP(L372,Proposito_programa!$C$2:$E$59,3,FALSE)),\" \",VLOOKUP(L372,Proposito_programa!$C$2:$E$59,3,FALSE))","v":"Propósito 5: Construir Bogotá - Región con gobierno abierto, transparente y ciudadanía consciente"},"133011605570000001697",1,31324703,"ANA\nJOSEFINA CABEZAS ENRIQUEZ","Persona Natural",null,null,null,43000000,null,null,null,43000000,35260000,44251,44252,44554,300,null,null,1120740083,"VERONICA PAOLA CUELLO ESTRADA",44452,14620000,null,null,"X",null,0.82]
[1,105,2021,"FDLRUU-CD-105-2021","https://community.secop.gov.co/Public/Tendering/OpportunityDetail/Index?noticeUID=CO1.NTC.1768096&isFromPublicArea=True&isModal=False\n","Contratos de prestación de servicios profesionales y de apoyo a la gestión","Contratación directa","Prestación de servicios profesionales y de apoyo a la gestión, o para la ejecución de trabajos artísticos que sólo puedan encomendarse a determinadas personas naturales;","LIDERAR Y GARANTIZAR LA IMPLEMENTACIÓN Y SEGUIMIENTO DE LOS PROCESOS Y PROCEDIMIENTOS DEL SERVICIO SOCIAL\nPARA SUBSIDIO TIPO C DE LA ALCALDÍA LOCAL .","Inversión","Un Nuevo Contrato Social y Ambiental para la Bogotá del Siglo XXI",1,{"$f":"IF(ISERROR(VLOOKUP(L373,Proposito_programa!$C$2:$E$59,2,FALSE)),\" \",VLOOKUP(L373,Proposito_programa!$C$2:$E$59,2,FALSE))","v":"Subsidios y transferencias para la equidad"},{"$f":"IF(ISERROR(VLOOKUP(L373,Proposito_programa!$C$2:$E$59,3,FALSE)),\" \",VLOOKUP(L373,Proposito_programa!$C$2:$E$59,3,FALSE))","v":"Propósito 1: Hacer un nuevo contrato social para incrementar la inclusión social, productiva y política"},"133011601010000001636",1,52409679,"ANA MILENA CARDONA MORA","Persona Natural",null,null,null,45600000,null,1,16530000,62130000,53580000,44243,44246,44574,240,1,87,null,null,null,null,null,null,"X",null,0.86238532110091748]
[1,18,2021,"FDLRUU-CD-018-2021","https://community.secop.gov.co/Public/Tendering/OpportunityDetail/Index?noticeUID=CO1.NTC.1720500&isFromPublicArea=True&isModal=False\n","Contratos de prestación de servicios profesionales y de apoyo a la gestión","Contratación directa","Prestación de servicios profesionales y de apoyo a la gestión, o para la ejecución de trabajos artísticos que sólo puedan encomendarse a determinadas personas naturales;","PRESTAR LOS SERVICIOS COMO PROFESIONAL ESPECIALIZADO PARA APOYAR AL ALCALDE LOCAL EN EL CONTROL, SEGUIMIENTO Y VERIFICACION DE LOS PROCESOS DE CONTRATACIÓN EN SUS DIFERENTES ETAPAS EN EL ÁREA DE GESTIÓN DEL DESARROLLO DE LA ALCALDÍA LOCAL DE RAFAEL URIBE URIBE","Inversión","Un Nuevo Contrato Social y Ambiental para la Bogotá del Siglo XXI",57,{"$f":"IF(ISERROR(VLOOKUP(L374,Proposito_programa!$C$2:$E$59,2,FALSE)),\" \",VLOOKUP(L374,Proposito_programa!$C$2:$E$59,2,FALSE))","v":"Gestión pública local"},{"$f":"IF(ISERROR(VLOOKUP(L374,Proposito_programa!$C$2:$E$59,3,FALSE)),\" \",VLOOKUP(L374,Proposito_programa!$C$2:$E$59,3,FALSE))","v":"Propósito 5: Construir Bogotá - Región con gobierno abierto, transparente y ciudadanía consciente"},"133011605570000001697",1,52962042,"ANA LORENA CARVAJAL CASTILLO","Persona Natural",null,null,null,71000000,null,null,null,71000000,63900000,44228,44228,44530,300,null,null,null,null,null,null,null,null,"X",null,0.9]
[1,155,2021,"FDLRUU-CD-150-2021","https://community.secop.gov.co/Public/Tendering/OpportunityDetail/Index?noticeUID=CO1.NTC.1800149&isFromPublicArea=True&isModal=False\n","Contratos de prestación de servicios profesionales y de apoyo a la gestión","Contratación directa","Prestación de servicios profesionales y de apoyo a la gestión, o para la ejecución de trabajos artísticos que sólo puedan encomendarse a determinadas personas naturales;","EL CONTRATISTA SE OBLIGA CON EL FONDO DE DESARROLLO LOCAL DE RAFAEL URIBE URIBE A PRESTAR SUS SERVICIOS DE APOYO A LA GESTION LOCAL Y TERRITORIAL DE LOS TEMAS DE SEGURIDAD Y CONVIVENCIA CIUDADANA PARA LA ALCALDIA LOCAL DE RAFAEL URIBE URIBE","Inversión","Un Nuevo Contrato Social y Ambiental para la Bogotá del Siglo XXI",43,{"$f":"IF(ISERROR(VLOOKUP(L375,Proposito_programa!$C$2:$E$59,2,FALSE)),\" \",VLOOKUP(L375,Proposito_programa!$C$2:$E$59,2,FALSE))","v":"Cultura ciudadana para la confianza, la convivencia y la participación desde la vida cotidiana"},{"$f":"IF(ISERROR(VLOOKUP(L375,Proposito_programa!$C$2:$E$59,3,FALSE)),\" \",VLOOKUP(L375,Proposito_programa!$C$2:$E$59,3,FALSE))","v":"Propósito 3: Inspirar confianza y legitimidad para vivir sin miedo y ser epicentro de cultura ciudadana, paz y reconciliación"},"133011603430000001680",1,51912017,"ANA DOLORES SANABRIA","Persona Natural",null,null,null,19800000,null,1,3153333,22953333,19800000,44253,44256,44574,270,1,43,null,null,null,null,null,null,"X",null,0.86261982083386324]
[1,21,2021,"FDLRUU-CD-021-2021","https://community.secop.gov.co/Public/Tendering/OpportunityDetail/Index?noticeUID=CO1.NTC.1722020&isFromPublicArea=True&isModal=False\n","Contratos de prestación de servicios profesionales y de apoyo a la gestión","Contratación directa","Prestación de servicios profesionales y de apoyo a la gestión, o para la ejecución de trabajos artísticos que sólo puedan encomendarse a determinadas personas naturales;","“PRESTAR SUS SERVICIOS DE APOYO TECNICO ADMINISTRATIVO EN LOS ASUNTOS RELACIONADOS CON LA CONTRATACION EN EL AREA DE GESTIÓN DEL DESARROLLO LOCAL DE LA ALCALDÍA LOCAL DE RAFAEL URIBE URIBE”","Inversión","Un Nuevo Contrato Social y Ambiental para la Bogotá del Siglo XXI",57,{"$f":"IF(ISERROR(VLOOKUP(L376,Proposito_programa!$C$2:$E$59,2,FALSE)),\" \",VLOOKUP(L376,Proposito_programa!$C$2:$E$59,2,FALSE))","v":"Gestión pública local"},{"$f":"IF(ISERROR(VLOOKUP(L376,Proposito_programa!$C$2:$E$59,3,FALSE)),\" \",VLOOKUP(L376,Proposito_programa!$C$2:$E$59,3,FALSE))","v":"Propósito 5: Construir Bogotá - Región con gobierno abierto, transparente y ciudadanía consciente"},"133011605570000001697",1,41799594,"ANA CONSUELO TRIVIÑO MORALES ","Persona Natural",null,null,null,39000000,null,1,5460000,44460000,38870000,44228,44229,44574,300,1,42,null,null,null,null,null,null,"X",null,0.8742690058479532]
[1,461,2020,"FDLRUU-SAMC-354-2020","https://community.secop.gov.co/Public/Tendering/OpportunityDetail/Index?noticeUID=CO1.NTC.1592323&isFromPublicArea=True&isModal=False\n","Contratos de prestación de servicios","Selección abreviada","Selección abreviada por menor cuantía ","CONTRATAR A MONTO AGOTABLE EL DIAGNÓSTICO, MANTENIMIENTO PREVENTIVO Y CORRECTIVO INCLUYENDO MANO DE OBRA Y/O SUMINISTRO DE REPUESTOS ORIGINALES, KITS DE ELEMENTOS, LUBRICANTES, SUMINISTRO DE LLANTAS Y DESPINCHES PARA LOS VEHÍCULOS LIVIANOS DEL FONDO DE DESARROLLO LOCAL RAFAEL URIBE URIBE","Funcionamiento","Un Nuevo Contrato Social y Ambiental para la Bogotá del Siglo XXI","No aplica",{"$f":"IF(ISERROR(VLOOKUP(L377,Proposito_programa!$C$2:$E$59,2,FALSE)),\" \",VLOOKUP(L377,Proposito_programa!$C$2:$E$59,2,FALSE))","v":" "},{"$f":"IF(ISERROR(VLOOKUP(L377,Proposito_programa!$C$2:$E$59,3,FALSE)),\" \",VLOOKUP(L377,Proposito_programa!$C$2:$E$59,3,FALSE))","v":" "},"1310202010203",1,860076670,"AMERICANA AUTOMOTRIZ S.AS","Persona Jurídica",null,null,null,null,null,1,20000000,20000000,0,44407,44407,44624,420,2,240,null,null,null,null,null,"X",null,null,0]
[1,83,2021,"FDLRUU-CD-083-2021","https://community.secop.gov.co/Public/Tendering/OpportunityDetail/Index?noticeUID=CO1.NTC.1767059&isFromPublicArea=True&isModal=False\n","Contratos de prestación de servicios profesionales y de apoyo a la gestión","Contratación directa","Prestación de servicios profesionales y de apoyo a la gestión, o para la ejecución de trabajos artísticos que sólo puedan encomendarse a determinadas personas naturales;","PRESTAR LOS SERVICIOS PROFESIONALES PARA EL APOYO EN LA ELABORACIÓN DE ESTUDIOS PREVIOS Y APOYAR LA SUPERVISIÓN DE LOS PROCESOS ADELANTADOS PARA EL FUNCIONAMIENTO DE LA ENTIDAD EN EL ÁREA DE GESTIÓN DE DESARROLLO LOCAL DE LA ALCALDÍA LOCAL DE RAFAEL URIBE URIBE","Inversión","Un Nuevo Contrato Social y Ambiental para la Bogotá del Siglo XXI",57,{"$f":"IF(ISERROR(VLOOKUP(L378,Proposito_programa!$C$2:$E$59,2,FALSE)),\" \",VLOOKUP(L378,Proposito_programa!$C$2:$E$59,2,FALSE))","v":"Gestión pública local"},{"$f":"IF(ISERROR(VLOOKUP(L378,Proposito_programa!$C$2:$E$59,3,FALSE)),\" \",VLOOKUP(L378,Proposito_programa!$C$2:$E$59,3,FALSE))","v":"Propósito 5: Construir Bogotá - Región con gobierno abierto, transparente y ciudadanía consciente"},"133011605570000001697",1,19398360,"ALVARO DE JESUS APARICIO CELY","Persona Natural",null,null,null,60000000,null,1,5600000,65600000,57000000,44242,44243,44574,300,1,28,null,null,null,null,null,null,"X",null,0.86890243902439024]
[1,176,2021,"FDLRUU-CD-176-2021","https://community.secop.gov.co/Public/Tendering/OpportunityDetail/Index?noticeUID=CO1.NTC.1804384&isFromPublicArea=True&isModal=False\n","Contratos de prestación de servicios profesionales y de apoyo a la gestión","Contratación directa","Prestación de servicios profesionales y de apoyo a la gestión, o para la ejecución de trabajos artísticos que sólo puedan encomendarse a determinadas personas naturales;","PRESTAR LOS SERVICIOS DE APOYO A LA GESTIÓN EN LAS LABORES ADMINISTRATIVAS, OPERATIVAS Y LOGISTICAS QUE SE REQUIERAN EN EL ÁREA DE GESTIÓN DEL DESARROLLO-ALMACEN DE LA ALCALDÍA LOCAL DE RAFAEL URIBE URIBE","Inversión","Un Nuevo Contrato Social y Ambiental para la Bogotá del Siglo XXI",57,{"$f":"IF(ISERROR(VLOOKUP(L379,Proposito_programa!$C$2:$E$59,2,FALSE)),\" \",VLOOKUP(L379,Proposito_programa!$C$2:$E$59,2,FALSE))","v":"Gestión pública local"},{"$f":"IF(ISERROR(VLOOKUP(L379,Proposito_programa!$C$2:$E$59,3,FALSE)),\" \",VLOOKUP(L379,Proposito_programa!$C$2:$E$59,3,FALSE))","v":"Propósito 5: Construir Bogotá - Región con gobierno abierto, transparente y ciudadanía consciente"},"133011605570000001697",1,79303323,"ALVARO CASTAÑEDA ALDANA ","Persona Natural",null,null,null,26000000,null,null,null,26000000,23400000,44253,44256,44561,300,null,null,null,null,null,null,null,null,"X",null,0.9]
[1,83022,2021,"OC-83022","https://colombiacompra.gov.co/tienda-virtual-del-estado-colombiano/ordenes-compra/83022","Compraventa de bienes muebles","Selección abreviada","Acuerdo marco de precios ","ADQUISICION DE EQUIPOS DE COMPUTO PARA EL FUNCIONAMIENTO DE LA ALCALDÍA LOCAL DE RAFAEL URIBE URIBE”\n","Funcionamiento","Un Nuevo Contrato Social y Ambiental para la Bogotá del Siglo XXI","No aplica",{"$f":"IF(ISERROR(VLOOKUP(L380,Proposito_programa!$C$2:$E$59,2,FALSE)),\" \",VLOOKUP(L380,Proposito_programa!$C$2:$E$59,2,FALSE))","v":" "},{"$f":"IF(ISERROR(VLOOKUP(L380,Proposito_programa!$C$2:$E$59,3,FALSE)),\" \",VLOOKUP(L380,Proposito_programa!$C$2:$E$59,3,FALSE))","v":" "},"1310201010102",1,890900608,"ALMACENES EXITO S A","Persona Jurídica",null,null,null,17596000,null,null,null,17596000,0,44547,44547,44613,65,null,null,null,null,null,null,null,"X",null,null,0]
[1,2,2021,"FDLRUU-CD-002-2021","https://community.secop.gov.co/Public/Tendering/OpportunityDetail/Index?noticeUID=CO1.NTC.1685098&isFromPublicArea=True&isModal=False\n","Contratos de prestación de servicios profesionales y de apoyo a la gestión","Contratación directa","Prestación de servicios profesionales y de apoyo a la gestión, o para la ejecución de trabajos artísticos que sólo puedan encomendarse a determinadas personas naturales;","APOYAR ADMINISTRATIVA Y ASISTENCIALMENTE A LAS INSPECCIONES DE POLICÍA DE LA LOCALIDAD DE RAFAEL URIBE URIBE","Inversión","Un Nuevo Contrato Social y Ambiental para la Bogotá del Siglo XXI",57,{"$f":"IF(ISERROR(VLOOKUP(L381,Proposito_programa!$C$2:$E$59,2,FALSE)),\" \",VLOOKUP(L381,Proposito_programa!$C$2:$E$59,2,FALSE))","v":"Gestión pública local"},{"$f":"IF(ISERROR(VLOOKUP(L381,Proposito_programa!$C$2:$E$59,3,FALSE)),\" \",VLOOKUP(L381,Proposito_programa!$C$2:$E$59,3,FALSE))","v":"Propósito 5: Construir Bogotá - Región con gobierno abierto, transparente y ciudadanía consciente"},"133011605570000001698",1,1023955863,"ALISON KATHERINE PEREZ MENDEZ ","Persona Natural",null,null,null,10500000,null,1,5250000,15750000,15750000,44221,44225,44497,180,1,90,null,null,null,null,null,null,"X",null,1]
[1,150,2021,"FDLRUU-CD-150-2021","https://community.secop.gov.co/Public/Tendering/OpportunityDetail/Index?noticeUID=CO1.NTC.1800149&isFromPublicArea=True&isModal=False\n","Contratos de prestación de servicios profesionales y de apoyo a la gestión","Contratación directa","Prestación de servicios profesionales y de apoyo a la gestión, o para la ejecución de trabajos artísticos que sólo puedan encomendarse a determinadas personas naturales;","EL CONTRATISTA SE OBLIGA CON EL FONDO DE DESARROLLO LOCAL DE RAFAEL URIBE URIBE A PRESTAR SUS SERVICIOS DE APOYO A LA GESTION LOCAL Y TERRITORIAL DE LOS TEMAS DE SEGURIDAD Y CONVIVENCIA CIUDADANA PARA LA ALCALDIA LOCAL DE RAFAEL URIBE URIBE","Inversión","Un Nuevo Contrato Social y Ambiental para la Bogotá del Siglo XXI",43,{"$f":"IF(ISERROR(VLOOKUP(L382,Proposito_programa!$C$2:$E$59,2,FALSE)),\" \",VLOOKUP(L382,Proposito_programa!$C$2:$E$59,2,FALSE))","v":"Cultura ciudadana para la confianza, la convivencia y la participación desde la vida cotidiana"},{"$f":"IF(ISERROR(VLOOKUP(L382,Proposito_programa!$C$2:$E$59,3,FALSE)),\" \",VLOOKUP(L382,Proposito_programa!$C$2:$E$59,3,FALSE))","v":"Propósito 3: Inspirar confianza y legitimidad para vivir sin miedo y ser epicentro de cultura ciudadana, paz y reconciliación"},"133011603430000001680",1,79908252,"ALEXANDER ARAGON ORTEGA","Persona Natural",null,null,null,19800000,null,1,3080000,22880000,19726667,44253,44257,44574,270,1,42,null,null,null,null,null,null,"X",null,0.86217950174825175]
[1,191,2021,"FDLRUU-CD-191-2021","https://community.secop.gov.co/Public/Tendering/OpportunityDetail/Index?noticeUID=CO1.NTC.1838231&isFromPublicArea=True&isModal=False\n","Contratos de prestación de servicios profesionales y de apoyo a la gestión","Contratación directa","Prestación de servicios profesionales y de apoyo a la gestión, o para la ejecución de trabajos artísticos que sólo puedan encomendarse a determinadas personas naturales;","PRESTAR LOS SERVICIOS TECNICOS PARA APOYAR LOS TRÁMITES Y PROCEDIMIENTOS ADELANTADOS EN EL ÁREA DE GESTIÓN DE DESARROLLO LOCAL - PRESUPUESTO- DEL FONDO DE DESARROLLO LOCAL DE RAFAEL URIBE URIBE”","Inversión","Un Nuevo Contrato Social y Ambiental para la Bogotá del Siglo XXI",57,{"$f":"IF(ISERROR(VLOOKUP(L383,Proposito_programa!$C$2:$E$59,2,FALSE)),\" \",VLOOKUP(L383,Proposito_programa!$C$2:$E$59,2,FALSE))","v":"Gestión pública local"},{"$f":"IF(ISERROR(VLOOKUP(L383,Proposito_programa!$C$2:$E$59,3,FALSE)),\" \",VLOOKUP(L383,Proposito_programa!$C$2:$E$59,3,FALSE))","v":"Propósito 5: Construir Bogotá - Región con gobierno abierto, transparente y ciudadanía consciente"},"133011605570000001697",1,52856517,"ALBA MERIDA SEGURA GARCIA","Persona Natural",null,null,null,37700000,null,null,null,37700000,33020000,44266,44272,44567,290,null,null,null,null,null,null,null,null,"X",null,0.87586206896551722]
[1,262,2021,"FDLRUU-CD-262-2021","https://community.secop.gov.co/Public/Tendering/OpportunityDetail/Index?noticeUID=CO1.NTC.2166082&isFromPublicArea=True&isModal=False\n","Contratos de prestación de servicios profesionales y de apoyo a la gestión","Contratación directa","Prestación de servicios profesionales y de apoyo a la gestión, o para la ejecución de trabajos artísticos que sólo puedan encomendarse a determinadas personas naturales;","PRESTAR SUS SERVICIOS ASISTENCIALES PARA LA GESTIÓN DEL RIESGO, EN EL MARCO DE LOS VIGÍAS DEL RIESGO DE LA LOCALIDAD DE RAFAEL URIBE URIBE","Inversión","Un Nuevo Contrato Social y Ambiental para la Bogotá del Siglo XXI",30,{"$f":"IF(ISERROR(VLOOKUP(L384,Proposito_programa!$C$2:$E$59,2,FALSE)),\" \",VLOOKUP(L384,Proposito_programa!$C$2:$E$59,2,FALSE))","v":"Eficiencia en la atención de emergencias"},{"$f":"IF(ISERROR(VLOOKUP(L384,Proposito_programa!$C$2:$E$59,3,FALSE)),\" \",VLOOKUP(L384,Proposito_programa!$C$2:$E$59,3,FALSE))","v":"Propósito 2 : Cambiar Nuestros Hábitos de Vida para Reverdecer a Bogotá y Adaptarnos y Mitigar la Crisis Climática"},"133011602300000001665",1,1023952787,"ADRIANA PAOLA DIAZ CHAVEZ","Persona Natural",null,null,null,8100000,null,null,null,8100000,6240000,44419,44425,44562,135,null,null,null,null,null,null,null,null,"X",null,0.77037037037037037]
[1,273,2021,"FLDRUU-CD-273-2021","https://community.secop.gov.co/Public/Tendering/OpportunityDetail/Index?noticeUID=CO1.NTC.2183657&isFromPublicArea=True&isModal=False\n","Contratos de prestación de servicios profesionales y de apoyo a la gestión","Contratación directa","Prestación de servicios profesionales y de apoyo a la gestión, o para la ejecución de trabajos artísticos que sólo puedan encomendarse a determinadas personas naturales;","PRESTAR SERVICIOS PROFESIONALES PARA REALIZACIÓN DE ACUERDOS QUE PROMUEVAN LA CONVIVENCIA ARMÓNICA ENTRE LA\nCIUDADANÍA Y LOS VENDEDORES INFORMALES Y ESTACIONARIOS ORIENTADOS A LA SOLUCIÓN DE LOS CONFLICTOS DERIVADOS DEL USO\nDEL ESPACIO PÚBLICO CONTEMPLADOS EN EL PROYECTO DE INVERSIÓN 1681 CULTURA CIUDADANA Y USO OPTIMO DEL ESPACIO PUBLICO EN RAFAEL URIBE URIBE","Inversión","Un Nuevo Contrato Social y Ambiental para la Bogotá del Siglo XXI",45,{"$f":"IF(ISERROR(VLOOKUP(L385,Proposito_programa!$C$2:$E$59,2,FALSE)),\" \",VLOOKUP(L385,Proposito_programa!$C$2:$E$59,2,FALSE))","v":"Espacio público más seguro y construido colectivamente"},{"$f":"IF(ISERROR(VLOOKUP(L385,Proposito_programa!$C$2:$E$59,3,FALSE)),\" \",VLOOKUP(L385,Proposito_programa!$C$2:$E$59,3,FALSE))","v":"Propósito 3: Inspirar confianza y legitimidad para vivir sin miedo y ser epicentro de cultura ciudadana, paz y reconciliación"},"133011603450000001681",1,1014178675,"ADRIANA MARITZA ANGULO LEON ","Persona Natural",null,null,null,20000000,null,null,null,20000000,15666667,44427,44435,44556,120,null,null,null,null,null,null,null,null,"X",null,0.78333335000000004]
[1,99,2021,"FDLRUU-CD-099-2021","https://community.secop.gov.co/Public/Tendering/OpportunityDetail/Index?noticeUID=CO1.NTC.1771898&isFromPublicArea=True&isModal=False","Contratos de prestación de servicios profesionales y de apoyo a la gestión","Contratación directa","Prestación de servicios profesionales y de apoyo a la gestión, o para la ejecución de trabajos artísticos que sólo puedan encomendarse a determinadas personas naturales;","APOYAR AL EQUIPO DE PRENSA Y COMUNICACIONES DE LA ALCALDÍA LOCAL EN LA REALIZACIÓN Y PUBLICACIÓN DE CONTENIDOS DE REDES SOCIALES Y CANALES DE DIVULGACIÓN DIGITAL (SITIO WEB) DE LA ALCALDÍA LOCAL","Inversión","Un Nuevo Contrato Social y Ambiental para la Bogotá del Siglo XXI",57,{"$f":"IF(ISERROR(VLOOKUP(L386,Proposito_programa!$C$2:$E$59,2,FALSE)),\" \",VLOOKUP(L386,Proposito_programa!$C$2:$E$59,2,FALSE))","v":"Gestión pública local"},{"$f":"IF(ISERROR(VLOOKUP(L386,Proposito_programa!$C$2:$E$59,3,FALSE)),\" \",VLOOKUP(L386,Proposito_programa!$C$2:$E$59,3,FALSE))","v":"Propósito 5: Construir Bogotá - Región con gobierno abierto, transparente y ciudadanía consciente"},"133011605570000001697",1,1013661860," JOAN SEBASTIAN\nCALVO CONDE","Persona Natural",null,null,null,52000000,null,1,2080000,54080000,48880000,44243,44246,44561,300,1,12,80165000,"CESAR ALBERTO SANCHEZ CERERO",44533,2773333,null,null,"X",null,0.90384615384615385]
[1,200,2021,"FDLRUU-CD-200-2021","https://community.secop.gov.co/Public/Tendering/OpportunityDetail/Index?noticeUID=CO1.NTC.1850890&isFromPublicArea=True&isModal=False\n","Contratos de prestación de servicios profesionales y de apoyo a la gestión","Contratación directa","Prestación de servicios profesionales y de apoyo a la gestión, o para la ejecución de trabajos artísticos que sólo puedan encomendarse a determinadas personas naturales;","APOYAR JURÍDICAMENTE LA EJECUCIÓN DE LAS ACCIONES REQUERIDAS PARA LA DEPURACIÓN DE LAS ACTUACIONES ADMISNITRATIVAS QUE CURSAN EN LA ALCALDÍA LOCAL\t ","Inversión","Un Nuevo Contrato Social y Ambiental para la Bogotá del Siglo XXI",57,{"$f":"IF(ISERROR(VLOOKUP(L387,Proposito_programa!$C$2:$E$59,2,FALSE)),\" \",VLOOKUP(L387,Proposito_programa!$C$2:$E$59,2,FALSE))","v":"Gestión pública local"},{"$f":"IF(ISERROR(VLOOKUP(L387,Proposito_programa!$C$2:$E$59,3,FALSE)),\" \",VLOOKUP(L387,Proposito_programa!$C$2:$E$59,3,FALSE))","v":"Propósito 5: Construir Bogotá - Región con gobierno abierto, transparente y ciudadanía consciente"},"133011605570000001698",1,1090394855," INÉS ANDREA PÉREZ MANTILLA","Persona Natural",null,null,null,31200000,null,null,null,31200000,17506667,44272,44278,44439,180,null,null,79434206,"WILLIAM OSWALDO AVILA CORTES ",44392,11613333,null,null,null,"X",0.56111112179487177]
[1,103,2021,"FDLRUU-CD-103-2021","https://community.secop.gov.co/Public/Tendering/OpportunityDetail/Index?noticeUID=CO1.NTC.1763836&isFromPublicArea=True&isModal=False\n","Contratos de prestación de servicios profesionales y de apoyo a la gestión","Contratación directa","Prestación de servicios profesionales y de apoyo a la gestión, o para la ejecución de trabajos artísticos que sólo puedan encomendarse a determinadas personas naturales;","PRESTAR LOS SERVICIOS PROFESIONALES COMO ABOGADO PARA APOYAR LA GESTIÓN CONTRACTUAL DEL ÁREA GESTIÓN DEL DESARROLLO LOCAL DE LA ALCALDÍA LOCAL DE RAFAEL URIBE URIBE EN LOS DIFERENTES PROCESOS DE SELECCIÓN EN SUS ETAPAS PRECONTRACTUAL, CONTRACTUAL Y POSTCONTRACTUAL","Inversión","Un Nuevo Contrato Social y Ambiental para la Bogotá del Siglo XXI",57,{"$f":"IF(ISERROR(VLOOKUP(L388,Proposito_programa!$C$2:$E$59,2,FALSE)),\" \",VLOOKUP(L388,Proposito_programa!$C$2:$E$59,2,FALSE))","v":"Gestión pública local"},{"$f":"IF(ISERROR(VLOOKUP(L388,Proposito_programa!$C$2:$E$59,3,FALSE)),\" \",VLOOKUP(L388,Proposito_programa!$C$2:$E$59,3,FALSE))","v":"Propósito 5: Construir Bogotá - Región con gobierno abierto, transparente y ciudadanía consciente"},"133011605570000001697",1,80188169," HERNANDO \nFERNÁNDEZ MUÑOZ","Persona Natural",null,null,null,67000000,null,1,6253333,73253333,63650000,44242,44243,44574,300,1,28,1013608357,"MONICA JULIANA SANMIGUEL ROJAS ",44456,19876667,null,null,"X",null,0.86890244297826014]
[null,null,2021,null,null,"Otros gastos","Otros gastos","Otros gastos","OBLIGACIONES POR PAGAR VIGENCIAS ANTERIORES ","Funcionamiento","Un Nuevo Contrato Social y Ambiental para la Bogotá del Siglo XXI","No aplica",null,null,"131089001 - 131089002",null,null,"OBLIGACIONES POR PAGAR VIGENCIAS ANTERIORES ",null,null,null,null,686352977,null,null,null,686352977,640782288,null,null,null,null,null,null,null,null,null,null,null,null,null,null,0.93360458754155007]
[null,"Total",null,null,null,null,null,null,null,null,null,null,null,null,null,null,null,null,null,null,null,null,{"$f":"SUM(W14:W389)","v":56063685256},{"$f":"SUM(X14:X389)","v":-62373333},{"$f":"SUM(Y14:Y389)","v":165},5086181118,61087493041,39923733449,null,null,null,null,null,null,null,null,null,null,null,null,null,null,{"$f":"SUM(AQ14:AQ388)","v":251.25005218395751}]

{"sheet":"CORRECIONES A REALIZAR 1","index":4,"n_rows":140,"n_cols":17,"rows_kept":140,"cut":false,"hidden":false,"merged":[[229,6,229,10],[220,6,220,10],[221,6,221,10],[222,6,222,10],[223,6,223,10],[224,6,224,10],[225,6,225,10],[226,6,226,10],[227,6,227,10],[228,6,228,10],[211,6,211,10],[212,6,212,10],[213,6,213,10],[214,6,214,10],[215,6,215,10],[216,6,216,10],[217,6,217,10],[218,6,218,10],[219,6,219,10],[202,6,202,10],[203,6,203,10],[204,6,204,10],[205,6,205,10],[206,6,206,10],[207,6,207,10],[208,6,208,10],[209,6,209,10],[210,6,210,10],[193,6,193,10],[194,6,194,10],[195,6,195,10],[196,6,196,10],[197,6,197,10],[198,6,198,10],[199,6,199,10],[200,6,200,10],[201,6,201,10],[184,6,184,10],[185,6,185,10],[186,6,186,10],[187,6,187,10],[188,6,188,10],[189,6,189,10],[190,6,190,10],[191,6,191,10],[192,6,192,10],[175,6,175,10],[176,6,176,10],[177,6,177,10],[178,6,178,10],[179,6,179,10],[180,6,180,10],[181,6,181,10],[182,6,182,10],[183,6,183,10],[166,6,166,10],[167,6,167,10],[168,6,168,10],[169,6,169,10],[170,6,170,10],[171,6,171,10],[172,6,172,10],[173,6,173,10],[174,6,174,10],[157,6,157,10],[158,6,158,10],[159,6,159,10],[160,6,160,10],[161,6,161,10],[162,6,162,10],[163,6,163,10],[164,6,164,10],[165,6,165,10],[148,6,148,10],[149,6,149,10],[150,6,150,10],[151,6,151,10],[152,6,152,10],[153,6,153,10],[154,6,154,10],[155,6,155,10],[156,6,156,10],[139,6,139,10],[140,6,140,10],[141,6,141,10],[142,6,142,10],[143,6,143,10],[144,6,144,10],[145,6,145,10],[146,6,146,10],[147,6,147,10],[130,6,130,10],[131,6,131,10],[132,6,132,10],[133,6,133,10],[134,6,134,10],[135,6,135,10],[136,6,136,10],[137,6,137,10],[138,6,138,10],[121,6,121,10],[122,6,122,10],[123,6,123,10],[124,6,124,10],[125,6,125,10],[126,6,126,10],[127,6,127,10],[128,6,128,10],[129,6,129,10],[113,7,113,8],[113,9,113,10],[115,7,115,8],[115,9,115,10],[117,7,117,8],[117,9,117,10],[119,7,119,8],[119,9,119,10],[0,6,0,10],[103,7,103,8],[103,9,103,10],[105,7,105,8],[105,9,105,10],[107,7,107,8],[107,9,107,10],[109,7,109,8],[109,9,109,10],[111,7,111,8],[111,9,111,10],[93,7,93,8],[93,9,93,10],[95,7,95,8],[95,9,95,10],[97,7,97,8],[97,9,97,10],[99,7,99,8],[99,9,99,10],[101,7,101,8],[101,9,101,10],[83,7,83,8],[83,9,83,10],[85,7,85,8],[85,9,85,10],[87,7,87,8],[87,9,87,10],[89,7,89,8],[89,9,89,10],[91,7,91,8],[91,9,91,10],[73,7,73,8],[73,9,73,10],[75,7,75,8],[75,9,75,10],[77,7,77,8],[77,9,77,10],[79,7,79,8],[79,9,79,10],[81,7,81,8],[81,9,81,10],[63,7,63,8],[63,9,63,10],[65,7,65,8],[65,9,65,10],[67,7,67,8],[67,9,67,10],[69,7,69,8],[69,9,69,10],[71,7,71,8],[71,9,71,10],[53,7,53,8],[53,9,53,10],[55,7,55,8],[55,9,55,10],[57,7,57,8],[57,9,57,10],[59,7,59,8],[59,9,59,10],[61,7,61,8],[61,9,61,10],[43,7,43,8],[43,9,43,10],[45,7,45,8],[45,9,45,10],[47,7,47,8],[47,9,47,10],[49,7,49,8],[49,9,49,10],[51,7,51,8],[51,9,51,10],[33,7,33,8],[33,9,33,10],[35,7,35,8],[35,9,35,10],[37,7,37,8],[37,9,37,10],[39,7,39,8],[39,9,39,10],[41,7,41,8],[41,9,41,10],[23,7,23,8],[23,9,23,10],[25,7,25,8],[25,9,25,10],[27,7,27,8],[27,9,27,10],[29,7,29,8],[29,9,29,10],[31,7,31,8],[31,9,31,10],[13,7,13,8],[13,9,13,10],[15,7,15,8],[15,9,15,10],[17,7,17,8],[17,9,17,10],[19,7,19,8],[19,9,19,10],[21,7,21,8],[21,9,21,10],[3,7,3,8],[3,9,3,10],[5,7,5,8],[5,9,5,10],[7,7,7,8],[7,9,7,10],[9,7,9,8],[9,9,9,10],[11,7,11,8],[11,9,11,10],[117,1,117,2],[117,3,117,4],[119,1,119,2],[119,3,119,4],[111,1,111,2],[111,3,111,4],[113,1,113,2],[113,3,113,4],[115,1,115,2],[115,3,115,4],[105,1,105,2],[105,3,105,4],[107,1,107,2],[107,3,107,4],[109,1,109,2],[109,3,109,4],[99,1,99,2],[99,3,99,4],[101,1,101,2],[101,3,101,4],[103,1,103,2],[103,3,103,4],[93,1,93,2],[93,3,93,4],[95,1,95,2],[95,3,95,4],[97,1,97,2],[97,3,97,4],[87,1,87,2],[87,3,87,4],[89,1,89,2],[89,3,89,4],[91,1,91,2],[91,3,91,4],[81,1,81,2],[81,3,81,4],[83,1,83,2],[83,3,83,4],[85,1,85,2],[85,3,85,4],[75,1,75,2],[75,3,75,4],[77,1,77,2],[77,3,77,4],[79,1,79,2],[79,3,79,4],[69,1,69,2],[69,3,69,4],[71,1,71,2],[71,3,71,4],[73,1,73,2],[73,3,73,4],[63,1,63,2],[63,3,63,4],[65,1,65,2],[65,3,65,4],[67,1,67,2],[67,3,67,4],[25,1,25,2],[25,3,25,4],[35,1,35,2],[35,3,35,4],[37,1,37,2],[37,3,37,4],[29,1,29,2],[29,3,29,4],[31,1,31,2],[31,3,31,4],[33,1,33,2],[33,3,33,4],[57,1,57,2],[57,3,57,4],[59,1,59,2],[59,3,59,4],[61,1,61,2],[61,3,61,4],[51,1,51,2],[51,3,51,4],[53,1,53,2],[53,3,53,4],[55,1,55,2],[55,3,55,4],[45,1,45,2],[45,3,45,4],[47,1,47,2],[47,3,47,4],[49,1,49,2],[49,3,49,4],[0,0,0,4],[3,1,3,2],[3,3,3,4],[5,1,5,2],[5,3,5,4],[7,1,7,2],[7,3,7,4],[121,0,121,4],[15,1,15,2],[15,3,15,4],[17,1,17,2],[17,3,17,4],[19,1,19,2],[19,3,19,4],[9,1,9,2],[9,3,9,4],[11,1,11,2],[11,3,11,4],[13,1,13,2],[13,3,13,4],[27,1,27,2],[27,3,27,4],[21,1,21,2],[21,3,21,4],[39,1,39,2],[39,3,39,4],[41,1,41,2],[41,3,41,4],[43,1,43,2],[43,3,43,4],[23,1,23,2],[23,3,23,4],[122,0,122,4],[123,0,123,4],[124,0,124,4],[125,0,125,4],[126,0,126,4],[127,0,127,4],[128,0,128,4],[129,0,129,4],[130,0,130,4],[140,0,140,4],[141,0,141,4],[142,0,142,4],[131,0,131,4],[132,0,132,4],[133,0,133,4],[134,0,134,4],[135,0,135,4],[136,0,136,4],[137,0,137,4],[138,0,138,4],[139,0,139,4],[143,0,143,4],[144,0,144,4],[145,0,145,4],[146,0,146,4],[147,0,147,4],[148,0,148,4],[149,0,149,4],[150,0,150,4],[151,0,151,4],[152,0,152,4],[153,0,153,4],[154,0,154,4],[155,0,155,4],[156,0,156,4],[157,0,157,4],[158,0,158,4],[159,0,159,4],[160,0,160,4],[161,0,161,4],[162,0,162,4],[163,0,163,4],[164,0,164,4],[165,0,165,4],[166,0,166,4],[167,0,167,4],[168,0,168,4],[169,0,169,4],[170,0,170,4],[171,0,171,4],[172,0,172,4],[173,0,173,4],[174,0,174,4],[175,0,175,4],[176,0,176,4],[177,0,177,4],[178,0,178,4],[179,0,179,4],[180,0,180,4],[181,0,181,4],[182,0,182,4],[183,0,183,4],[184,0,184,4],[185,0,185,4],[186,0,186,4],[187,0,187,4],[188,0,188,4],[189,0,189,4],[190,0,190,4],[191,0,191,4],[192,0,192,4],[193,0,193,4],[194,0,194,4],[195,0,195,4],[196,0,196,4],[197,0,197,4],[198,0,198,4],[199,0,199,4],[200,0,200,4],[201,0,201,4],[202,0,202,4],[203,0,203,4],[204,0,204,4],[205,0,205,4],[206,0,206,4],[207,0,207,4],[208,0,208,4],[209,0,209,4],[210,0,210,4],[211,0,211,4],[212,0,212,4],[213,0,213,4],[214,0,214,4],[215,0,215,4],[216,0,216,4],[217,0,217,4],[218,0,218,4],[219,0,219,4],[220,0,220,4],[221,0,221,4],[222,0,222,4],[223,0,223,4],[224,0,224,4],[225,0,225,4],[226,0,226,4],[227,0,227,4],[228,0,228,4],[229,0,229,4],[230,0,230,4],[231,0,231,4],[232,0,232,4],[233,0,233,4],[234,0,234,4],[235,0,235,4],[236,0,236,4],[237,0,237,4],[238,0,238,4],[239,0,239,4],[240,0,240,4],[241,0,241,4],[242,0,242,4],[243,0,243,4],[244,0,244,4],[245,0,245,4],[246,0,246,4],[247,0,247,4],[248,0,248,4],[249,0,249,4],[250,0,250,4],[251,0,251,4],[252,0,252,4],[253,0,253,4],[254,0,254,4],[255,0,255,4],[256,0,256,4],[257,0,257,4],[258,0,258,4],[259,0,259,4],[260,0,260,4],[261,0,261,4],[262,0,262,4],[263,0,263,4],[264,0,264,4],[265,0,265,4],[266,0,266,4],[267,0,267,4],[268,0,268,4],[269,0,269,4],[270,0,270,4],[271,0,271,4],[272,0,272,4],[273,0,273,4],[274,0,274,4],[275,0,275,4],[276,0,276,4],[277,0,277,4],[278,0,278,4],[279,0,279,4],[280,0,280,4],[281,0,281,4],[282,0,282,4],[283,0,283,4],[284,0,284,4],[285,0,285,4],[286,0,286,4],[287,0,287,4],[288,0,288,4],[289,0,289,4],[290,0,290,4],[291,0,291,4],[292,0,292,4],[293,0,293,4],[294,0,294,4],[295,0,295,4],[296,0,296,4],[297,0,297,4],[298,0,298,4],[299,0,299,4],[300,0,300,4],[301,0,301,4],[302,0,302,4],[303,0,303,4],[304,0,304,4],[305,0,305,4],[306,0,306,4],[307,0,307,4],[308,0,308,4],[309,0,309,4],[310,0,310,4],[311,0,311,4],[312,0,312,4],[313,0,313,4],[314,0,314,4],[315,0,315,4],[316,0,316,4],[317,0,317,4],[318,0,318,4],[319,0,319,4],[320,0,320,4],[321,0,321,4],[322,0,322,4],[323,0,323,4],[324,0,324,4],[325,0,325,4],[326,0,326,4],[327,0,327,4],[328,0,328,4],[329,0,329,4],[330,0,330,4],[331,0,331,4],[332,0,332,4],[333,0,333,4],[334,0,334,4],[335,0,335,4],[336,0,336,4],[337,0,337,4],[338,0,338,4],[339,0,339,4],[340,0,340,4],[341,0,341,4],[342,0,342,4],[343,0,343,4],[344,0,344,4],[345,0,345,4],[346,0,346,4],[347,0,347,4],[348,0,348,4],[349,0,349,4],[350,0,350,4],[351,0,351,4],[352,0,352,4],[353,0,353,4],[354,0,354,4],[355,0,355,4],[356,0,356,4],[357,0,357,4],[358,0,358,4],[359,0,359,4],[360,0,360,4],[361,0,361,4],[362,0,362,4],[363,0,363,4],[364,0,364,4],[365,0,365,4],[366,0,366,4],[367,0,367,4],[368,0,368,4],[369,0,369,4],[370,0,370,4],[371,0,371,4],[372,0,372,4],[373,0,373,4],[374,0,374,4],[375,0,375,4],[376,0,376,4],[377,0,377,4],[378,0,378,4],[379,0,379,4],[380,0,380,4],[381,0,381,4],[382,0,382,4],[383,0,383,4],[384,0,384,4],[385,0,385,4],[386,0,386,4],[387,0,387,4],[388,0,388,4],[389,0,389,4],[390,0,390,4],[391,0,391,4],[392,0,392,4],[393,0,393,4],[394,0,394,4],[395,0,395,4],[396,0,396,4],[397,0,397,4],[398,0,398,4],[399,0,399,4],[400,0,400,4],[401,0,401,4],[402,0,402,4],[403,0,403,4],[404,0,404,4],[405,0,405,4],[406,0,406,4],[407,0,407,4],[408,0,408,4],[409,0,409,4],[410,0,410,4],[411,0,411,4],[412,0,412,4],[413,0,413,4],[414,0,414,4],[415,0,415,4],[416,0,416,4],[417,0,417,4],[418,0,418,4],[419,0,419,4],[420,0,420,4],[421,0,421,4],[422,0,422,4],[423,0,423,4],[424,0,424,4],[425,0,425,4],[426,0,426,4],[427,0,427,4],[428,0,428,4],[429,0,429,4],[430,0,430,4],[431,0,431,4],[432,0,432,4],[433,0,433,4],[434,0,434,4],[435,0,435,4],[436,0,436,4],[437,0,437,4],[438,0,438,4],[439,0,439,4],[440,0,440,4],[441,0,441,4],[442,0,442,4],[443,0,443,4],[444,0,444,4],[445,0,445,4],[446,0,446,4],[447,0,447,4],[448,0,448,4],[449,0,449,4],[450,0,450,4],[451,0,451,4],[452,0,452,4],[453,0,453,4],[454,0,454,4],[455,0,455,4],[456,0,456,4],[457,0,457,4],[458,0,458,4],[459,0,459,4],[460,0,460,4],[461,0,461,4],[462,0,462,4],[463,0,463,4],[464,0,464,4],[465,0,465,4],[466,0,466,4],[467,0,467,4],[468,0,468,4],[469,0,469,4],[470,0,470,4],[471,0,471,4],[472,0,472,4],[473,0,473,4],[474,0,474,4],[475,0,475,4],[476,0,476,4],[477,0,477,4],[478,0,478,4],[479,0,479,4],[480,0,480,4],[481,0,481,4],[482,0,482,4],[483,0,483,4],[484,0,484,4],[485,0,485,4],[486,0,486,4],[487,0,487,4],[488,0,488,4],[489,0,489,4],[490,0,490,4],[491,0,491,4],[492,0,492,4],[493,0,493,4],[494,0,494,4],[495,0,495,4],[496,0,496,4],[497,0,497,4],[498,0,498,4],[499,0,499,4],[500,0,500,4],[501,0,501,4],[502,0,502,4],[503,0,503,4],[504,0,504,4],[505,0,505,4],[506,0,506,4],[507,0,507,4],[508,0,508,4],[509,0,509,4],[510,0,510,4],[511,0,511,4],[512,0,512,4],[513,0,513,4],[514,0,514,4],[515,0,515,4],[516,0,516,4],[517,0,517,4],[518,0,518,4],[519,0,519,4],[520,0,520,4],[521,0,521,4],[522,0,522,4],[523,0,523,4],[524,0,524,4],[525,0,525,4],[526,0,526,4],[527,0,527,4],[528,0,528,4],[529,0,529,4],[530,0,530,4],[531,0,531,4],[532,0,532,4],[533,0,533,4],[534,0,534,4],[535,0,535,4],[536,0,536,4],[537,0,537,4],[538,0,538,4],[539,0,539,4],[540,0,540,4],[541,0,541,4],[542,0,542,4],[543,0,543,4],[544,0,544,4],[545,0,545,4],[546,0,546,4],[547,0,547,4],[548,0,548,4],[549,0,549,4],[550,0,550,4],[551,0,551,4],[552,0,552,4],[553,0,553,4],[554,0,554,4],[555,0,555,4],[556,0,556,4],[557,0,557,4],[558,0,558,4],[559,0,559,4],[560,0,560,4],[561,0,561,4],[562,0,562,4],[563,0,563,4],[564,0,564,4],[565,0,565,4],[566,0,566,4],[567,0,567,4],[568,0,568,4],[569,0,569,4],[570,0,570,4],[571,0,571,4],[572,0,572,4],[573,0,573,4],[574,0,574,4],[575,0,575,4],[576,0,576,4],[577,0,577,4],[578,0,578,4],[579,0,579,4],[580,0,580,4],[581,0,581,4],[582,0,582,4],[583,0,583,4],[584,0,584,4],[585,0,585,4],[586,0,586,4],[587,0,587,4],[588,0,588,4],[589,0,589,4],[590,0,590,4],[591,0,591,4],[592,0,592,4],[593,0,593,4],[594,0,594,4],[595,0,595,4],[596,0,596,4],[597,0,597,4],[598,0,598,4],[599,0,599,4],[600,0,600,4],[601,0,601,4],[602,0,602,4],[603,0,603,4],[604,0,604,4],[605,0,605,4],[606,0,606,4],[607,0,607,4],[608,0,608,4],[609,0,609,4],[610,0,610,4],[611,0,611,4],[612,0,612,4],[613,0,613,4],[614,0,614,4],[615,0,615,4],[616,0,616,4],[617,0,617,4],[618,0,618,4],[619,0,619,4],[620,0,620,4],[621,0,621,4],[622,0,622,4],[623,0,623,4],[624,0,624,4],[625,0,625,4],[626,0,626,4],[627,0,627,4],[628,0,628,4],[629,0,629,4],[630,0,630,4],[631,0,631,4],[632,0,632,4],[633,0,633,4],[634,0,634,4],[635,0,635,4],[636,0,636,4],[637,0,637,4],[638,0,638,4],[639,0,639,4],[640,0,640,4],[641,0,641,4],[642,0,642,4],[643,0,643,4],[644,0,644,4],[645,0,645,4],[646,0,646,4],[647,0,647,4],[648,0,648,4],[649,0,649,4],[650,0,650,4],[651,0,651,4],[652,0,652,4],[653,0,653,4],[654,0,654,4],[655,0,655,4],[656,0,656,4],[657,0,657,4],[658,0,658,4],[659,0,659,4],[660,0,660,4],[661,0,661,4],[662,0,662,4],[663,0,663,4],[664,0,664,4],[665,0,665,4],[666,0,666,4],[667,0,667,4],[668,0,668,4],[669,0,669,4],[670,0,670,4],[671,0,671,4],[672,0,672,4],[673,0,673,4],[674,0,674,4],[675,0,675,4],[676,0,676,4],[677,0,677,4],[678,0,678,4],[679,0,679,4],[680,0,680,4],[681,0,681,4],[682,0,682,4],[683,0,683,4],[684,0,684,4],[685,0,685,4],[686,0,686,4],[687,0,687,4],[688,0,688,4],[689,0,689,4],[690,0,690,4],[691,0,691,4],[692,0,692,4],[693,0,693,4],[694,0,694,4],[695,0,695,4],[696,0,696,4],[697,0,697,4],[698,0,698,4],[699,0,699,4],[700,0,700,4],[701,0,701,4],[702,0,702,4],[703,0,703,4],[704,0,704,4],[705,0,705,4],[706,0,706,4],[707,0,707,4],[708,0,708,4],[709,0,709,4],[710,0,710,4],[711,0,711,4],[712,0,712,4],[713,0,713,4],[714,0,714,4],[715,0,715,4],[716,0,716,4],[717,0,717,4],[718,0,718,4],[719,0,719,4],[720,0,720,4],[721,0,721,4],[722,0,722,4],[723,0,723,4],[724,0,724,4],[725,0,725,4],[726,0,726,4],[727,0,727,4],[728,0,728,4],[729,0,729,4],[730,0,730,4],[731,0,731,4],[732,0,732,4],[733,0,733,4],[734,0,734,4],[735,0,735,4],[736,0,736,4],[737,0,737,4],[738,0,738,4],[739,0,739,4],[740,0,740,4],[741,0,741,4],[742,0,742,4],[743,0,743,4],[744,0,744,4],[745,0,745,4],[746,0,746,4],[747,0,747,4],[748,0,748,4],[749,0,749,4],[750,0,750,4],[751,0,751,4],[752,0,752,4],[753,0,753,4],[754,0,754,4],[755,0,755,4],[756,0,756,4],[757,0,757,4],[758,0,758,4],[759,0,759,4],[760,0,760,4],[761,0,761,4],[762,0,762,4],[763,0,763,4],[764,0,764,4],[765,0,765,4],[766,0,766,4],[767,0,767,4],[768,0,768,4],[769,0,769,4],[770,0,770,4],[771,0,771,4],[772,0,772,4],[773,0,773,4]],"merged_total":1322,"flags":["merged_cut"]}
["INFORME BOG DATA VS INFORME ENVIADO POR ALCALDIA LOCAL DE RAFAEL URIBE URIBE",null,null,null,null,null,"TERCERAS CORRECCIONES INFORME BOG DATA VS INFORME ENVIADO POR ALCALDIA LOCAL DE RAFAEL URIBE URIBE",null,null,null,null,null,"TERCERAS CORRECCIONES INFORME BOG DATA VS INFORME ENVIADO POR ALCALDIA LOCAL DE RAFAEL URIBE URIBE"]
[18,"VALOR FINAL BOGDATA","VALOR FINAL INFORMADOS","ACUMULADO GIROS BOG DATA","GIROS INFORMADOS",null,18,"VALOR FINAL BOGDATA","VALOR FINAL INFORMADOS","ACUMULADO GIROS BOG DATA","GIROS INFORMADOS",null,18,"VALOR FINAL BOGDATA","VALOR FINAL INFORMADOS","ACUMULADO GIROS BOG DATA","GIROS INFORMADOS"]
["FUNCIONAMIENTO",3360105795,3360105795,2564206812,2564206812,null,"FUNCIONAMIENTO",3360105795,3360105815,2564206812,2564206812,null,"FUNCIONAMIENTO",3360105795,3360105795,2564206812,2564206812]
["DIFERENCIAS",{"$f":"C3-B3","v":0},null,{"$f":"E3-D3","v":0},null,null,"DIFERENCIAS",{"$f":"I3-H3","v":20},null,{"$f":"K3-J3","v":0},null,null,"DIFERENCIAS",{"$f":"O3-N3","v":0},null,{"$f":"Q3-P3","v":0}]
["INVERSION",57727387246,57727387246,37359526637,37359526637,null,"INVERSION",57727387246,57727387246,37359526637,37359526637,null,"INVERSION",57727387246,57727387246,37359526637,37359526637]
["DIFERENCIAS",{"$f":"C5-B5","v":0},null,{"$f":"E5-D5","v":0},null,null,"DIFERENCIAS",{"$f":"I5-H5","v":0},null,{"$f":"K5-J5","v":0},null,null,"DIFERENCIAS",{"$f":"O5-N5","v":0},null,{"$f":"Q5-P5","v":0}]
["PROPÓSITO 01:Hacer un nuevo contrato social con igualdad de oportunidades para la inclusión social, productiva y política",34381375750,{"$f":"+C9+C15+C25+C29+C33+C37+C41+C45","v":34381375750},28002189315,{"$f":"+E9+E15+E25+E29+E33+E37+E41+E45","v":28002189315},null,"PROPÓSITO 01:Hacer un nuevo contrato social con igualdad de oportunidades para la inclusión social, productiva y política",34381375750,34655114750,28002189315,28002189315,null,"PROPÓSITO 01:Hacer un nuevo contrato social con igualdad de oportunidades para la inclusión social, productiva y política",34381375750,34381375750,28002189315,28002189315]
["DIFERENCIAS",{"$f":"C7-B7","v":0},null,{"$f":"E7-D7","v":0},null,null,"DIFERENCIAS",{"$f":"I7-H7","v":273739000},null,{"$f":"K7-J7","v":0},null,null,"DIFERENCIAS",{"$f":"O7-N7","v":0},null,{"$f":"Q7-P7","v":0}]
["PROGRAMA 01:Subsidios y transferencias para la equidad",21089323564,21089323564,20620749996,{"$f":"+E11+E13","v":20620749996},null,"PROGRAMA 01:Subsidios y transferencias para la equidad",21089323564,21089323564,20620749996,20620749996,null,"PROGRAMA 01:Subsidios y transferencias para la equidad",21089323564,21089323564,20620749996,20620749996]
["DIFERENCIAS",{"$f":"C9-B9","v":0},null,{"$f":"E9-D9","v":0},null,null,"DIFERENCIAS",{"$f":"I9-H9","v":0},null,{"$f":"K9-J9","v":0},null,null,"DIFERENCIAS",{"$f":"O9-N9","v":0},null,{"$f":"Q9-P9","v":0}]
["1636.",11103620001,11103620001,10878656302,10878656302,null,"1636.",11103620001,11103620001,10878656302,10878656302,null,"1636.",11103620001,11103620001,10878656302,10878656302]
["DIFERENCIAS",{"$f":"C11-B11","v":0},null,{"$f":"E11-D11","v":0},null,null,"DIFERENCIAS",{"$f":"I11-H11","v":0},null,{"$f":"K11-J11","v":0},null,null,"DIFERENCIAS",{"$f":"O11-N11","v":0},null,{"$f":"Q11-P11","v":0}]
["2213.",9985703563,9985703563,9742093694,9742093694,null,"2213.",9985703563,9985703563,9742093694,9742093694,null,"2213.",9985703563,9985703563,9742093694,9742093694]
["DIFERENCIAS",{"$f":"C13-B13","v":0},null,{"$f":"E13-D13","v":0},null,null,"DIFERENCIAS",{"$f":"I13-H13","v":0},null,{"$f":"K13-J13","v":0},null,null,"DIFERENCIAS",{"$f":"O13-N13","v":0},null,{"$f":"Q13-P13","v":0}]
["PROGRAMA 06:Sistema Distrital del Cuidado",6861918563,{"$f":"+C17+C19+C21+C23","v":6861918563},3096342841,{"$f":"+E17+E19+E21+E23","v":3096342841},null,"PROGRAMA 06:Sistema Distrital del Cuidado",6861918563,6861918563,3096342841,3096342841,null,"PROGRAMA 06:Sistema Distrital del Cuidado",6861918563,6861918563,3096342841,3096342841]
["DIFERENCIAS",{"$f":"C15-B15","v":0},null,{"$f":"E15-D15","v":0},null,null,"DIFERENCIAS",{"$f":"I15-H15","v":0},null,{"$f":"K15-J15","v":0},null,null,"DIFERENCIAS",{"$f":"O15-N15","v":0},null,{"$f":"Q15-P15","v":0}]
["1653.",3736079000,3736079000,2810345388,2810345388,null,"1653.",3736079000,3736079000,2810345388,2810345388,null,"1653.",3736079000,3736079000,2810345388,2810345388]
["DIFERENCIAS",{"$f":"C17-B17","v":0},null,{"$f":"E17-D17","v":0},null,null,"DIFERENCIAS",{"$f":"I17-H17","v":0},null,{"$f":"K17-J17","v":0},null,null,"DIFERENCIAS",{"$f":"O17-N17","v":0},null,{"$f":"Q17-P17","v":0}]
["1656.",873696700,873696700,0,0,null,"1656.",873696700,873696700,0,0,null,"1656.",873696700,873696700,0,0]
["DIFERENCIAS",{"$f":"C19-B19","v":0},null,{"$f":"E19-D19","v":0},null,null,"DIFERENCIAS",{"$f":"I19-H19","v":0},null,{"$f":"K19-J19","v":0},null,null,"DIFERENCIAS",{"$f":"O19-N19","v":0},null,{"$f":"Q19-P19","v":0}]
["1657.",617666000,617666000,247066400,247066400,null,"1657.",617666000,617666000,247066400,247066400,null,"1657.",617666000,617666000,247066400,247066400]
["DIFERENCIAS ",{"$f":"C21-B21","v":0},null,{"$f":"E21-D21","v":0},null,null,"DIFERENCIAS ",{"$f":"I21-H21","v":0},null,{"$f":"K21-J21","v":0},null,null,"DIFERENCIAS ",{"$f":"O21-N21","v":0},null,{"$f":"Q21-P21","v":0}]
["1658.",1634476863,1634476863,38931053,38931053,null,"1658.",1634476863,1634476863,38931053,38931053,null,"1658.",1634476863,1634476863,38931053,38931053]
["DIFERENCIAS",{"$f":"C23-B23","v":0},null,{"$f":"E23-D23","v":0},null,null,"DIFERENCIAS",{"$f":"I23-H23","v":0},null,{"$f":"K23-J23","v":0},null,null,"DIFERENCIAS",{"$f":"O23-N23","v":0},null,{"$f":"Q23-P23","v":0}]
["PROGRAMA 08:Prevención y atención de maternidad temprana",221560645,221560645,44312129,44312129,null,"PROGRAMA 08:Prevención y atención de maternidad temprana",221560645,221560645,44312129,44312129,null,"PROGRAMA 08:Prevención y atención de maternidad temprana",221560645,221560645,44312129,44312129]
["DIFERENCIAS",{"$f":"C25-B25","v":0},null,{"$f":"E25-D25","v":0},null,null,"DIFERENCIAS",{"$f":"I25-H25","v":0},null,{"$f":"K25-J25","v":0},null,null,"DIFERENCIAS",{"$f":"O25-N25","v":0},null,{"$f":"Q25-P25","v":0}]
["1659.",221560645,221560645,44312129,44312129,null,"1659.",221560645,221560645,44312129,44312129,null,"1659.",221560645,221560645,44312129,44312129]
["DIFERENCIAS",{"$f":"C27-B27","v":0},null,{"$f":"E27-D27","v":0},null,null,"DIFERENCIAS",{"$f":"I27-H27","v":0},null,{"$f":"K27-J27","v":0},null,null,"DIFERENCIAS",{"$f":"O27-N27","v":0},null,{"$f":"Q27-P27","v":0}]
["PROGRAMA 14:Formación integral: más y mejor tiempo en los colegios",666799000,666799000,0,0,null,"PROGRAMA 14:Formación integral: más y mejor tiempo en los colegios",666799000,666799000,0,0,null,"PROGRAMA 14:Formación integral: más y mejor tiempo en los colegios",666799000,666799000,0,0]
["DIFERENCIAS ",{"$f":"C29-B29","v":0},null,0,null,null,"DIFERENCIAS ",{"$f":"I29-H29","v":0},null,0,null,null,"DIFERENCIAS ",{"$f":"O29-N29","v":0},null,0]
["1640.",666799000,666799000,0,0,null,"1640.",666799000,666799000,0,null,null,"1640.",666799000,666799000,0,0]
["DIFERENCIAS",{"$f":"C31-B31","v":0},null,0,null,null,"DIFERENCIAS",{"$f":"I31-H31","v":0},null,0,null,null,"DIFERENCIAS",{"$f":"O31-N31","v":0},null,0]
["PROGRAMA 17:Jóvenes con capacidades: Proyecto de vida para la ciudadanía, la innovación y el trabajo del siglo XXI",2531277000,2531277000,2531277000,2531277000,null,"PROGRAMA 17:Jóvenes con capacidades: Proyecto de vida para la ciudadanía, la innovación y el trabajo del siglo XXI",2531277000,2531277000,2531277000,2531277000,null,"PROGRAMA 17:Jóvenes con capacidades: Proyecto de vida para la ciudadanía, la innovación y el trabajo del siglo XXI",2531277000,2531277000,2531277000,2531277000]
["DIFERENCIAS ",{"$f":"C33-B33","v":0},null,{"$f":"E33-D33","v":0},null,null,"DIFERENCIAS ",{"$f":"I33-H33","v":0},null,{"$f":"K33-J33","v":0},null,null,"DIFERENCIAS ",{"$f":"O33-N33","v":0},null,{"$f":"Q33-P33","v":0}]
["1642.",2531277000,2531277000,2531277000,2531277000,null,"1642.",2531277000,2531277000,2531277000,2531277000,null,"1642.",2531277000,2531277000,2531277000,2531277000]
["DIFERENCIAS ",{"$f":"C35-B35","v":0},null,{"$f":"E35-D35","v":0},null,null,"DIFERENCIAS ",{"$f":"I35-H35","v":0},null,{"$f":"K35-J35","v":0},null,null,"DIFERENCIAS ",{"$f":"O35-N35","v":0},null,{"$f":"Q35-P35","v":0}]
["PROGRAMA 20:Bogotá, referente en cultura, deporte, recreación y actividad física, con parques para el desarrollo y la salud",314463771,314463771,181761349,181761349,null,"PROGRAMA 20:Bogotá, referente en cultura, deporte, recreación y actividad física, con parques para el desarrollo y la salud",314463771,314463771,181761349,181761349,null,"PROGRAMA 20:Bogotá, referente en cultura, deporte, recreación y actividad física, con parques para el desarrollo y la salud",314463771,314463771,181761349,181761349]
["DIFERENCIAS ",{"$f":"C37-B37","v":0},null,{"$f":"E37-D37","v":0},null,null,"DIFERENCIAS ",{"$f":"I37-H37","v":0},null,{"$f":"K37-J37","v":0},null,null,"DIFERENCIAS ",{"$f":"O37-N37","v":0},null,{"$f":"Q37-P37","v":0}]
[1646,314463771,314463771,181761349,181761349,null,1646,314463771,314463771,181761349,181761349,null,1646,314463771,314463771,181761349,181761349]
["DIFERENCIAS ",{"$f":"C39-B39","v":0},null,{"$f":"E39-D39","v":0},null,null,"DIFERENCIAS ",{"$f":"I39-H39","v":0},null,{"$f":"K39-J39","v":0},null,null,"DIFERENCIAS ",{"$f":"O39-N39","v":0},null,{"$f":"Q39-P39","v":0}]
["PROGRAMA 21:Creación y vida cotidiana: Apropiación ciudadana del arte, la cultura y el patrimonio, para la democracia cultural",1450673207,{"$f":"+C43","v":1450673207},1053466000,{"$f":"+E43","v":1053466000},null,"PROGRAMA 21:Creación y vida cotidiana: Apropiación ciudadana del arte, la cultura y el patrimonio, para la democracia cultural",1450673207,1924953207,1053466000,152774600,null,"PROGRAMA 21:Creación y vida cotidiana: Apropiación ciudadana del arte, la cultura y el patrimonio, para la democracia cultural",1450673207,1450673207,1053466000,1053466000]
["DIFERENCIAS ",{"$f":"C41-B41","v":0},null,{"$f":"E41-D41","v":0},null,null,"DIFERENCIAS ",{"$f":"I41-H41","v":474280000},null,{"$f":"K41-J41","v":-900691400},null,null,"DIFERENCIAS ",{"$f":"O41-N41","v":0}]
["1647.",1450673207,1450673207,1053466000,1053466000,null,"1647.",1450673207,1450673207,1053466000,1053466000,null,"1647.",1450673207,1450673207,1053466000,1053466000]
["DIFERENCIAS",{"$f":"C43-B43","v":0},null,{"$f":"E43-D43","v":0},null,null,"DIFERENCIAS",{"$f":"I43-H43","v":0},null,{"$f":"K43-J43","v":0},null,null,"DIFERENCIAS",{"$f":"O43-N43","v":0},null,{"$f":"Q43-P43","v":0}]
["PROGRAMA 24:Bogotá región emprendedora e innovadora",1245360000,{"$f":"+C47+C49","v":1245360000},474280000,{"$f":"+E47+E49","v":474280000},null,"PROGRAMA 24:Bogotá región emprendedora e innovadora",1245360000,1044819000,474280000,0,null,"PROGRAMA 24:Bogotá región emprendedora e innovadora",1245360000,1245360000,474280000,474280000]
["DIFERENCIAS ",{"$f":"C45-B45","v":0},null,{"$f":"E45-D45","v":0},null,null,"DIFERENCIAS ",{"$f":"I45-H45","v":-200541000},null,{"$f":"K45-J45","v":-474280000},null,null,"DIFERENCIAS ",{"$f":"O45-N45","v":0},null,{"$f":"Q45-P45","v":0}]
["1649.",771080000,771080000,0,0,null,"1649.",771080000,771080000,0,0,null,"1649.",771080000,771080000,0,0]
["DIFERENCIAS",{"$f":"C47-B47","v":0},null,0,null,null,"DIFERENCIAS",{"$f":"I47-H47","v":0},null,0,null,null,"DIFERENCIAS",{"$f":"O47-N47","v":0},null,0]
["1650.",474280000,474280000,474280000,474280000,null,"1650.",474280000,474280000,474280000,474280000,null,"1650.",474280000,474280000,474280000,474280000]
["DIFERENCIAS ",{"$f":"C49-B49","v":0},null,{"$f":"E49-D49","v":0},null,null,"DIFERENCIAS ",{"$f":"I49-H49","v":0},null,{"$f":"K49-J49","v":0},null,null,"DIFERENCIAS ",{"$f":"O49-N49","v":0},null,{"$f":"Q49-P49","v":0}]
["PROPÓSITO 02:Cambiar nuestros hábitos de vida para reverdecer a Bogotá y adaptarnos y mitigar la crisis climática",7457064154,{"$f":"+C53+C57+C61+C65+C71+C75","v":7457064154},133633333,{"$f":"+E53+E57+E61+E65","v":133633333},null,"PROPÓSITO 02:Cambiar nuestros hábitos de vida para reverdecer a Bogotá y adaptarnos y mitigar la crisis climática",7457064154,7183325154,133633333,133633333,null,"PROPÓSITO 02:Cambiar nuestros hábitos de vida para reverdecer a Bogotá y adaptarnos y mitigar la crisis climática",7457064154,7457064154,133633333,133633333]
["DIFERENCIAS ",{"$f":"C51-B51","v":0},null,{"$f":"E51-D51","v":0},null,null,"DIFERENCIAS ",{"$f":"I51-H51","v":-273739000},null,{"$f":"K51-J51","v":0},null,null,"DIFERENCIAS ",{"$f":"O51-N51","v":0},null,{"$f":"Q51-P51","v":0}]
["PROGRAMA 27:Cambio cultural para la gestión de la crisis climática",1092949000,{"$f":"+C55","v":1092949000},0,0,null,"PROGRAMA 27:Cambio cultural para la gestión de la crisis climática",1092949000,1092949000,0,0,null,"PROGRAMA 27:Cambio cultural para la gestión de la crisis climática",1092949000,1092949000,0,0]
["DIFERENCIAS ",{"$f":"C53-B53","v":0},null,0,null,null,"DIFERENCIAS ",{"$f":"I53-H53","v":0},null,0,null,null,"DIFERENCIAS ",{"$f":"O53-N53","v":0},null,0]
["1660.",1092949000,1092949000,0,0,null,"1660.",1092949000,null,0,null,null,"1660.",1092949000,1092949000,0,0]
["DIFERENCIAS",{"$f":"C55-B55","v":0},null,0,null,null,"DIFERENCIAS",{"$f":"I55-H55","v":-1092949000},null,0,null,null,"DIFERENCIAS",{"$f":"O55-N55","v":0},null,0]
["PROGRAMA 28:Bogotá protectora de sus recursos naturales",495336000,{"$f":"+C59","v":495336000},0,0,null,"PROGRAMA 28:Bogotá protectora de sus recursos naturales",495336000,null,0,null,null,"PROGRAMA 28:Bogotá protectora de sus recursos naturales",495336000,495336000,0,0]
["DIFERENCIAS ",{"$f":"C57-B57","v":0},null,0,null,null,"DIFERENCIAS ",{"$f":"I57-H57","v":-495336000},null,0,null,null,"DIFERENCIAS ",{"$f":"O57-N57","v":0},null,0]
["1661.",495336000,495336000,0,0,null,"1661.",495336000,null,0,null,null,"1661.",495336000,495336000,0,0]
["DIFERENCIAS ",{"$f":"C59-B59","v":0},null,0,null,null,"DIFERENCIAS ",{"$f":"I59-H59","v":-495336000},null,0,null,null,"DIFERENCIAS ",{"$f":"O59-N59","v":0},null,0]
["PROGRAMA 30:Eficiencia en la atención de emergencias",2677610113,2677610113,133633333,{"$f":"+E63","v":133633333},null,"PROGRAMA 30:Eficiencia en la atención de emergencias",2677610113,null,133633333,null,null,"PROGRAMA 30:Eficiencia en la atención de emergencias",2677610113,2677610113,133633333,133633333]
["DIFERENCIAS ",{"$f":"C61-B61","v":0},null,{"$f":"E61-D61","v":0},null,null,"DIFERENCIAS ",{"$f":"I61-H61","v":-2677610113},null,{"$f":"K61-J61","v":-133633333},null,null,"DIFERENCIAS ",{"$f":"O61-N61","v":0},null,{"$f":"Q61-P61","v":0}]
["1665.",2677610113,2677610113,133633333,133633333,null,"1665.",2677610113,null,133633333,null,null,"1665.",2677610113,2677610113,133633333,133633333]
["DIFERENCIAS ",{"$f":"C63-B63","v":0},null,{"$f":"E63-D63","v":0},null,null,"DIFERENCIAS ",{"$f":"I63-H63","v":-2677610113},null,{"$f":"K63-J63","v":-133633333},null,null,"DIFERENCIAS ",{"$f":"O63-N63","v":0},null,{"$f":"Q63-P63","v":0}]
["PROGRAMA 33:Más árboles y más y mejor espacio público",1191012081,{"$f":"+C67+C69","v":1191012081},0,0,null,"PROGRAMA 33:Más árboles y más y mejor espacio público",1191012081,null,0,null,null,"PROGRAMA 33:Más árboles y más y mejor espacio público",1191012081,1191012081,0,0]
["DIFERENCIAS ",{"$f":"C65-B65","v":0},null,0,null,null,"DIFERENCIAS ",{"$f":"I65-H65","v":-1191012081},null,0,null,null,"DIFERENCIAS ",{"$f":"O65-N65","v":0},null,0]
["1667.",165447000,165447000,0,0,null,"1667.",165447000,null,0,null,null,"1667.",165447000,165447000,0,0]
["DIFERENCIAS ",{"$f":"C67-B67","v":0},null,0,null,null,"DIFERENCIAS ",{"$f":"I67-H67","v":-165447000},null,0,null,null,"DIFERENCIAS ",{"$f":"O67-N67","v":0},null,0]
["1670.",1025565081,1025565081,0,0,null,"1670.",1025565081,null,0,null,null,"1670.",1025565081,1025565081,0,0]
["DIFERENCIAS ",{"$f":"C69-B69","v":0},null,0,null,null,"DIFERENCIAS ",{"$f":"I69-H69","v":-1025565081},null,0,null,null,"DIFERENCIAS ",{"$f":"O69-N69","v":0},null,0]
["PROGRAMA 34:Bogotá protectora de los animales",837259000,837259000,0,0,null,"PROGRAMA 34:Bogotá protectora de los animales",837259000,null,0,null,null,"PROGRAMA 34:Bogotá protectora de los animales",837259000,837259000,0,0]
["DIFERENCIAS ",{"$f":"C71-B71","v":0},null,0,null,null,"DIFERENCIAS ",{"$f":"I71-H71","v":-837259000},null,0,null,null,"DIFERENCIAS ",{"$f":"O71-N71","v":0},null,0]
["1673.",837259000,837259000,0,0,null,"1673.",837259000,null,0,null,null,"1673.",837259000,837259000,0,0]
["DIFERENCIAS ",{"$f":"C73-B73","v":0},null,0,null,null,"DIFERENCIAS ",{"$f":"I73-H73","v":-837259000},null,0,null,null,"DIFERENCIAS ",{"$f":"O73-N73","v":0},null,0]
["PROGRAMA 38:Ecoeficiencia, reciclaje, manejo de residuos e inclusión de la población recicladora",1162897960,1162897960,0,0,null,"PROGRAMA 38:Ecoeficiencia, reciclaje, manejo de residuos e inclusión de la población recicladora",1162897960,null,0,null,null,"PROGRAMA 38:Ecoeficiencia, reciclaje, manejo de residuos e inclusión de la población recicladora",1162897960,1162897960,0,0]
["DIFERENCIAS ",0,null,0,null,null,"DIFERENCIAS ",0,null,0,null,null,"DIFERENCIAS ",0,null,0]
["1675.",1162897960,1162897960,0,0,null,"1675.",1162897960,null,0,null,null,"1675.",1162897960,1162897960,0]
["DIFERENCIAS ",0,null,0,null,null,"DIFERENCIAS ",0,null,0,null,null,"DIFERENCIAS ",0,null,0]
["PROPÓSITO 03:Inspirar confianza y legitimidad para vivir sin miedo y ser epicentro de cultura ciudadana, paz y reconciliación",3376883142,{"$f":"+C81+C85+C89+C93+C97","v":3376883142},1855809222,{"$f":"+E81+E85+E89+E93+E97","v":1855809222},null,"PROPÓSITO 03:Inspirar confianza y legitimidad para vivir sin miedo y ser epicentro de cultura ciudadana, paz y reconciliación",3376883142,3382027242,1855809222,1860953322,null,"PROPÓSITO 03:Inspirar confianza y legitimidad para vivir sin miedo y ser epicentro de cultura ciudadana, paz y reconciliación",3376883142,3376883142,1855809222,1855809222]
["DIFERENCIAS ",{"$f":"C79-B79","v":0},null,{"$f":"E79-D79","v":0},null,null,"DIFERENCIAS ",{"$f":"I79-H79","v":5144100},null,{"$f":"K79-J79","v":5144100},null,null,"DIFERENCIAS ",{"$f":"O79-N79","v":0},null,{"$f":"Q79-P79","v":0}]
["PROGRAMA 39:Bogotá territorio de paz y atención integral a las víctimas del conflicto armado",358968000,358968000,251277600,251277600,null,"PROGRAMA 39:Bogotá territorio de paz y atención integral a las víctimas del conflicto armado",358968000,null,251277600,null,null,"PROGRAMA 39:Bogotá territorio de paz y atención integral a las víctimas del conflicto armado",358968000,358968000,251277600,251277600]
["DIFERENCIAS ",0,null,0,null,null,"DIFERENCIAS ",0,null,0,null,null,"DIFERENCIAS ",{"$f":"O81-N81","v":0},null,0]
["1678.",358968000,358968000,251277600,251277600,null,"1678.",358968000,null,251277600,null,null,"1678.",358968000,358968000,251277600,251277600]
["DIFERENCIAS ",0,null,0,null,null,"DIFERENCIAS ",0,null,0,null,null,"DIFERENCIAS ",{"$f":"O83-N83","v":0},null,0]
["PROGRAMA 40:Más mujeres viven una vida libre de violencias, se sienten seguras y acceden con confianza al sistema de justicia",1010227000,{"$f":"+C87","v":1010227000},404090800,{"$f":"+E87","v":404090800},null,"PROGRAMA 40:Más mujeres viven una vida libre de violencias, se sienten seguras y acceden con confianza al sistema de justicia",1010227000,null,404090800,null,null,"PROGRAMA 40:Más mujeres viven una vida libre de violencias, se sienten seguras y acceden con confianza al sistema de justicia",1010227000,1010227000,404090800,404090800]
["DIFERENCIAS ",0,null,0,null,null,"DIFERENCIAS ",0,null,0,null,null,"DIFERENCIAS ",{"$f":"O85-N85","v":0},null,{"$f":"Q85-P85","v":0}]
["1679.",1010227000,1010227000,404090800,404090800,null,"1679.",1010227000,null,404090800,null,null,"1679.",1010227000,1010227000,404090800,404090800]
["DIFERENCIAS ",0,null,0,null,null,"DIFERENCIAS ",0,null,0,null,null,"DIFERENCIAS ",{"$f":"O87-N87","v":0},null,{"$f":"Q87-P87","v":0}]
["PROGRAMA 43:Cultura ciudadana para la confianza, la convivencia y la participación desde la vida cotidiana",703044492,{"$f":"+C91","v":703044492},589454556,{"$f":"+E91","v":589454556},null,"PROGRAMA 43:Cultura ciudadana para la confianza, la convivencia y la participación desde la vida cotidiana",703044492,null,589454556,null,null,"PROGRAMA 43:Cultura ciudadana para la confianza, la convivencia y la participación desde la vida cotidiana",703044492,703044492,589454556,589454556]
["DIFERENCIAS ",{"$f":"C89-B89","v":0},null,{"$f":"E89-D89","v":0},null,null,"DIFERENCIAS ",{"$f":"I89-H89","v":-703044492},null,{"$f":"K89-J89","v":-589454556},null,null,"DIFERENCIAS ",{"$f":"O89-N89","v":0},null,{"$f":"Q89-P89","v":0}]
["1680.",703044492,703044492,589454556,589454556,null,"1680.",703044492,null,589454556,null,null,"1680.",703044492,703044492,589454556,589454556]
["DIFERENCIAS ",{"$f":"C91-B91","v":0},null,{"$f":"E91-D91","v":0},null,null,"DIFERENCIAS ",{"$f":"I91-H91","v":-703044492},null,{"$f":"K91-J91","v":-589454556},null,null,"DIFERENCIAS ",{"$f":"O91-N91","v":0},null,{"$f":"Q91-P91","v":0}]
["PROGRAMA 45:Espacio público más seguro y construido colectivamente",563260000,563260000,173606666,173606666,null,"PROGRAMA 45:Espacio público más seguro y construido colectivamente",563260000,null,173606666,null,null,"PROGRAMA 45:Espacio público más seguro y construido colectivamente",563260000,563260000,173606666,173606666]
["DIFERENCIAS ",{"$f":"C93-B93","v":0},null,{"$f":"E93-D93","v":0},null,null,"DIFERENCIAS ",{"$f":"I93-H93","v":-563260000},null,{"$f":"K93-J93","v":-173606666},null,null,"DIFERENCIAS ",{"$f":"O93-N93","v":0},null,{"$f":"Q93-P93","v":0}]
["1681.",563260000,563260000,173606666,173606666,null,"1681.",563260000,null,173606666,null,null,"1681.",563260000,563260000,173606666,173606666]
["DIFERENCIAS ",0,null,{"$f":"E95-D95","v":0},null,null,"DIFERENCIAS ",0,null,{"$f":"K95-J95","v":-173606666},null,null,"DIFERENCIAS ",0,null,{"$f":"Q95-P95","v":0}]
["PROGRAMA 48:Plataforma institucional para la seguridad y justicia",741383650,{"$f":"+C99+C101","v":741383650},437379600,{"$f":"+E99","v":437379600},null,"PROGRAMA 48:Plataforma institucional para la seguridad y justicia",741383650,null,437379600,null,null,"PROGRAMA 48:Plataforma institucional para la seguridad y justicia",741383650,741383650,437379600,437379600]
["DIFERENCIAS ",{"$f":"C97-B97","v":0},null,{"$f":"E97-D97","v":0},null,null,"DIFERENCIAS ",{"$f":"I97-H97","v":-741383650},null,{"$f":"K97-J97","v":-437379600},null,null,"DIFERENCIAS ",{"$f":"O97-N97","v":0},null,{"$f":"Q97-P97","v":0}]
["1682.",728966000,728966000,437379600,437379600,null,"1682.",728966000,null,437379600,null,null,"1682.",728966000,728966000,437379600,437379600]
["DIFERENCIAS ",0,null,0,null,null,"DIFERENCIAS ",0,null,0,null,null,"DIFERENCIAS ",0,null,0]
["1684.",12417650,12417650,0,0,null,"1684.",12417650,null,0,null,null,"1684.",12417650,12417650,0,0]
["DIFERENCIAS ",0,null,0,null,null,"DIFERENCIAS ",0,null,0,null,null,"DIFERENCIAS ",{"$f":"O101-N101","v":0},null,{"$f":"Q101-P101","v":0}]
["PROPÓSITO 04:Hacer de Bogotá Región un modelo de movilidad multimodal, incluyente y sostenible",3108570108,3108570108,165013416,165013416,null,"PROPÓSITO 04:Hacer de Bogotá Región un modelo de movilidad multimodal, incluyente y sostenible",3108570108,3108570108,165013416,165013416,null,"PROPÓSITO 04:Hacer de Bogotá Región un modelo de movilidad multimodal, incluyente y sostenible",3108570108,3108570108,165013416,165013416]
["DIFERENCIAS ",{"$f":"C103-B103","v":0},null,{"$f":"E103-D103","v":0},null,null,"DIFERENCIAS ",{"$f":"I103-H103","v":0},null,{"$f":"K103-J103","v":0},null,null,"DIFERENCIAS ",{"$f":"O103-N103","v":0},null,{"$f":"Q103-P103","v":0}]
["PROGRAMA 49Movilidad segura, sostenible y accesible",3108570108,3108570108,165013416,165013416,null,"PROGRAMA 49Movilidad segura, sostenible y accesible",3108570108,3108570108,165013416,165013416,null,"PROGRAMA 49Movilidad segura, sostenible y accesible",3108570108,3108570108,165013416,165013416]
["DIFERENCIAS ",{"$f":"C105-B105","v":0},null,{"$f":"E105-D105","v":0},null,null,"DIFERENCIAS ",{"$f":"I105-H105","v":0},null,{"$f":"K105-J105","v":0},null,null,"DIFERENCIAS ",{"$f":"O105-N105","v":0},null,{"$f":"Q105-P105","v":0}]
["1685.",3108570108,3108570108,165013416,165013416,null,"1685.",3108570108,3108570108,165013416,165013416,null,"1685.",3108570108,3108570108,165013416,165013416]
["DIFERENCIAS ",{"$f":"C107-B107","v":0},null,{"$f":"E107-D107","v":0},null,null,"DIFERENCIAS ",{"$f":"I107-H107","v":0},null,{"$f":"K107-J107","v":0},null,null,"DIFERENCIAS ",{"$f":"O107-N107","v":0},null,{"$f":"Q107-P107","v":0}]
["PROPÓSITO 5:Construir Bogotá Región con gobierno abierto, transparente y ciudadanía consciente",9403494092,{"$f":"+C111+C115","v":9403494092},7202881351,{"$f":"+E111+E115","v":7202881351},null,"PROPÓSITO 5:Construir Bogotá Región con gobierno abierto, transparente y ciudadanía consciente",9403494092,9398349992,7202881351,7197737251,null,"PROPÓSITO 5:Construir Bogotá Región con gobierno abierto, transparente y ciudadanía consciente",9403494092,9403494092,7202881351,7202881351]
["DIFERENCIAS ",{"$f":"C109-B109","v":0},null,{"$f":"E109-D109","v":0},null,null,"DIFERENCIAS ",{"$f":"I109-H109","v":-5144100},null,{"$f":"K109-J109","v":-5144100},null,null,"DIFERENCIAS ",{"$f":"O109-N109","v":0},null,{"$f":"Q109-P109","v":0}]
["PROGRAMA 55:Fortalecimiento de Cultura Ciudadana y su institucionalidad",1139995031,1139995031,119437360,119437360,null,"PROGRAMA 55:Fortalecimiento de Cultura Ciudadana y su institucionalidad",1139995031,null,119437360,null,null,"PROGRAMA 55:Fortalecimiento de Cultura Ciudadana y su institucionalidad",1139995031,1139995031,119437360,119437360]
["DIFERENCIAS ",{"$f":"C111-B111","v":0},null,{"$f":"E111-D111","v":0},null,null,"DIFERENCIAS ",{"$f":"I111-H111","v":-1139995031},null,{"$f":"K111-J111","v":-119437360},null,null,"DIFERENCIAS ",{"$f":"O111-N111","v":0},null,{"$f":"Q111-P111","v":0}]
["1689.",1139995031,1139995031,119437360,119437360,null,"1689.",1139995031,null,119437360,null,null,"1689.",1139995031,1139995031,119437360,119437360]
["DIFERENCIAS ",{"$f":"C113-B113","v":0},null,{"$f":"E113-D113","v":0},null,null,"DIFERENCIAS ",{"$f":"I113-H113","v":-1139995031},null,{"$f":"K113-J113","v":-119437360},null,null,"DIFERENCIAS ",{"$f":"O113-N113","v":0},null,{"$f":"Q113-P113","v":0}]
["PROGRAMA 57:Gestión Pública Local",8263499061,8263499061,7083443991,{"$f":"+E117+E119","v":7083443991},null,"PROGRAMA 57:Gestión Pública Local",8263499061,null,7083443991,null,null,"PROGRAMA 57:Gestión Pública Local",8263499061,8263499061,7083443991,7083443991]
["DIFERENCIAS ",{"$f":"C115-B115","v":0},null,{"$f":"E115-D115","v":0},null,null,"DIFERENCIAS ",{"$f":"I115-H115","v":-8263499061},null,{"$f":"K115-J115","v":-7083443991},null,null,"DIFERENCIAS ",{"$f":"O115-N115","v":0},null,{"$f":"Q115-P115","v":0}]
["1697.",5763225728,5763225728,4932653990,4932653990,null,"1697.",5763225728,null,4932653990,null,null,"1697.",5763225728,5763225728,4932653990,4932653990]
["DIFERENCIAS ",{"$f":"C117-B117","v":0},null,{"$f":"E117-D117","v":0},null,null,"DIFERENCIAS ",{"$f":"I117-H117","v":-5763225728},null,{"$f":"K117-J117","v":-4932653990},null,null,"DIFERENCIAS ",{"$f":"O117-N117","v":0},null,{"$f":"Q117-P117","v":0}]
[1698,2500273333,2500273333,2150790001,2150790001,null,1698,2500273333,null,2150790001,null,null,1698,2500273333,2500273333,2150790001,2150790001]
["DIFERENCIAS ",{"$f":"C119-B119","v":0},null,{"$f":"E119-D119","v":0},null,null,"DIFERENCIAS ",{"$f":"I119-H119","v":-2500273333},null,{"$f":"K119-J119","v":-2150790001},null,null,"DIFERENCIAS ",{"$f":"O119-N119","v":0},null,{"$f":"Q119-P119","v":0}]
[]
["OBSERVACIONES PRESUPUESTALES.",null,null,null,null,null,"OBSERRVACIONES PRESUPUESTALES"]
["1. Como puede observarse en el cuadro inmediatamente anterior, hay diferencias entre lo reportado por uds (página 1. INFORMACIÓN ACUMULADA), y lo reportado por BOG DATA en el rubro de FUNCIONAMIENTO, tanto para el valor final como para los giros (de gastos contractuales y otros gastos) ",null,null,null,null,null,"1. El proyecto 1650 no pertenece al programa 21 pertenece al programa 24"]
["2. Así mismo, es importante verificar la información del Rubro de Inversión, hay diferencias siginificativas entre lo que uds reportan en la hoja información acumulada y lo reportado por BOG DATA en el tema de GIROS. ",null,null,null,null,null,"2. Al programa 24 pertenecen los programas 1649 y el 1650 no es el 1660"]
["3. Es importante mencionar que cada propósito, programa y proyecto deben coincider con lo reportado por BOG DATA, como puede verse en el cuadro mencionado, hay diferencias significativas tanto en el valor final, como en los giros, verificar uno a uno con la infomación presupestal que se adjuntara al presente informe.",null,null,null,null,null,"3. El programa 1660 pertenece al propósito 2, no al propósito 1 y menos al programa 24, pertenece al programa 27"]
["4. Se recalca que cada contrato tiene su proyecto y programa, si hay uno o varios contratos para los cuales se obtuvo el presupuesto de varios propósitos, programas o proyectos, se debe diligenciar en lineas distintas, de acuerdo al valor que se obtuvo de cada item mencionado, no pueden ir en la misma linea asi como esta relacionado",null,null,null,null,null,"4. Cómo puede verse, persisten las falencias presupuestalemente hablando en: EL RUBRO DE FUNCIONAMIENTO arroja una diferencia en el valor final versus lo reportado por bog data, asi mismo hay diferencias en los propósitos 1, 2, 3 ,5, se hizo la verificación del propósito uno, y hay varios programas y proyectos que tienen diferencias, no se realizó la verificación de los demás propósitos, ya que es evidente que esta desajustado el presupuesto de cada uno de los programas y proyectos de los propósitos mencionados. El problema según lo observado es que hay varios proyectos que no pertenecen al programa relacionado, y hay unos programas y proyectos que no pertenecen al propósito que lo relacionaron.  Una vez más se solciita verificar uno a uno tanto los programas. proyectos y propósitos versus lo reportado en el informe de ejecución presupuestal, es decir, es un problema de orden, verificar también los giros hay varios de los items mencionados que no se encuentran conciliados."]
["5. Por favor verificar el proyecto de número 1697, el cual no pertenetece al propósito 3 y por ende tampoco al programa 48.",null,null,null,null,null,"5. Se anexa una entidad guia para que por favor verifiquen los porcentajes de los contratos, está columna debe estar formulada de manera correcta"]
["6. No hay reporte del programa 40, que pertenece al propósito 3, por favor verificar y proceder a su corrección "]
["OBSERVACIONES PAA"]
["No hay observaciones "]
["OBSERVACIONES GENERALES (TIPOLOGIAS, MODALIDADES, CONTRATISTAS Y OTROS)"]
["1. Los contratos suscritos con uniones temporales y consorcios deben diligenciarse tal y como lo explica el instructivo de la matriz, es decir el valor del contrato en una linea, mientras que en las lineas continuas a la información del contrato, la información correspondiente a los datos de los socios.  RESPUESTA ALRUU: OK CORREGIDO"]
["2. El consorcio CONSORCIO MITIGACION 2021 no tiene nit de identificación RESPUESTA ALRUU: EL CONTRATISTA ESTA EN EXPEDICIÓN DE RUT"]
["3. Varios contratos susctirtos en vigencias anteriores y que cuya adición abarco la vigencia 2021, no tienen relacionado las fechas de fecha de suscripción y terminación del contrato, es importante resaltar, que las fechas solicitadas son las del registro, inicio y terminación de la adición 2021 RESPUESTA ALRUU: OK CORREGIDO"]
["4. Hay varios contratos de la vigencia 2021 que no tienen diligenciada las fechas de acta de inicio y suscripción de los contratos, si son contratos suscritos en diciembre y de los cuales hasta el 31 no se tenia conocimieto de  dichas fechas por favor, poner en trámite dichas columnas y relacionarlo en el estado celebrado o por iniciar, caso contrario todos los contratos deben relacionar las fechas solicitadas, y su plazo en dias. RESPUESTA ALRUU: OK CORREGIDO"]
["5. Para los contratos cedidos unicmente se debe diligenciar la información del último cesionario. RESPUESTA ALRUU: OK CORREGIDO"]
["6.El consorcio CONSORCIO INTER MITIGACION 2022, no tiene relacionado su número de nit. RESPUESTA ALRUU: OK CORREGIDO"]
["7. Las cedúlas de los contratistas deben relacionarse sin puntos, ni dígito de verificación RESPUESTA ALRUU: OK CORREGIDO"]
["8. Los nombres de los contratistas deben relacionarse en MAYUSCULAS  RESPUESTA ALRUU: OK CORREGIDO"]
["Asi las cosas, informamos que la información recibida no puede ser tenida en cuenta y por ello requerimos se corrija y verifique en su totalidad, de acuerdo con las instrucciones contenidas en la matriz. Pedimos muy comedidamente que la información sea remitida, a más tardar, este MIERCOLES 23 de FEBRERO de 2022, teniendo en cuenta la necesidad de procesarla."]

{"sheet":"2. PAA","index":5,"n_rows":13,"n_cols":7,"rows_kept":13,"cut":false,"hidden":false,"merged":[[9,1,9,6],[6,2,6,3],[6,5,6,6],[2,1,2,7],[3,1,3,7],[4,1,4,7],[5,2,5,3],[5,5,5,6]]}
[]
[]
[null,"PLAN ANUAL DE ADQUISIONES"]
[null,2021]
[]
[null,"Entidad","FONDO DE DESARROLLO LOCAL DE RAFEL URIBE URIBE",null,"Sector","GOBIERNO"]
[null,"Responsable diligenciamiento","Mónica Yamile Quevedo Correa",null,"Número contacto y correo electrónico","321 2327585 - monica.quevedo@gobiernobogota.gov.co"]
[]
[]
[null,"A continuación registre la información del Plan Anual de Adquisiciones vigencia 2021,  diligencie el presupuesto total,  el presupuesto programado y contratado del 1 de septiembre al 31 de diciembre de 2021, igualmente la fecha de la primera y ultima públicación del PAA en SECOP, y el número de modificaciones realizadas."]
[]
[null,"Presupuesto Total PAA","Presupuesto programado\nSeptiembre 1 a 31 de diciembre de 2021","Presupuesto contratado\nSeptiembre 1 a 31 de diciembre de 2021","Fecha Primera Publicación\nD/M/A","Última fecha de modificación\nD/M/A","Número modificaciones"]
[null,56271097374,14831049126,10890760005,"10/14/2021","11/18/2021",5]

{"sheet":"3. CONSOLIDADO","index":6,"n_rows":57,"n_cols":20,"rows_kept":57,"cut":false,"hidden":false,"merged":[[16,2,16,16],[17,17,17,19],[19,2,21,2],[19,3,21,3],[11,9,11,10],[17,2,17,16],[11,15,11,16],[19,4,19,17],[19,18,20,19],[20,4,20,5],[20,6,20,7],[20,8,20,9],[20,10,20,11],[20,12,20,13],[20,14,20,15],[20,16,20,17],[11,21,11,22],[1,4,1,18],[2,4,2,18],[7,2,8,16],[10,2,12,2],[10,3,12,3],[10,4,10,8],[10,9,10,16],[11,4,11,5],[11,6,11,8],[11,19,11,20],[11,11,11,12],[11,13,11,14],[11,17,11,18],[9,2,9,16],[4,2,5,16],[26,2,26,11],[58,2,60,5],[28,2,30,2],[29,3,29,4],[29,5,29,6],[29,7,29,8],[28,3,28,8]]}
[]
[null,null,null,null,"GESTIÓN CONTRACTUAL "]
[null,null,null,null,"Período de Evaluación: Septiembre 1 a 31 de diciembre de 2021"]
[]
[null,null,"La información consolidada que registra en esta hoja debe coincidir con la información que reporta en las hojas 1 \"INFORMACION ACUMULADA\" y 2 \"INFORMACION II CUATRIMESTRE\". En relación con las adiciones a contratos de años anteriores con cargo al periodo a reportar deben registrarse en filas independientes en los numerales 1 (información general, naturaleza jurídica) y 2 (modalidad). Ej. vigencia =2019; No. Contratos Adicionados:3; Número de adiciones: 4"]
[]
[]
[null,null,"1. Diligenciar en Información General el total de contratos que la entidad suscribió del 1 de septiembre al 31 de diciembre de 2021 y el valor total de ellos, igual el número de contratos que presentaron adiciones, el número de adiciones y el valor total de ellas. Respecto a la Naturaleza jurídica del contratista, diligenciar el número total de contratos suscritos y su valor por: personas naturales, jurídicas, consorcios y uniones temporales"]
[]
[]
[null,null,"Entidad","Vigencia","Información General",null,null,null,null,"Naturaleza jurídica del contratista"]
[null,null,null,null,"Contratos Suscritos",null,"Adiciones",null,null,"Contratos suscritos con personas naturales",null,"Contratos suscritos con personas jurídicas",null,"Contratos suscritos con uniones temporales",null,"Contratos suscritos con consorcios"]
[null,null,null,null,"Número Contratos","Valor Total","Número Contratos Adicionados","Número de Adiciones","Valor Total","Número Contratos y/o adiciones","Valor Total","Número Contratos y/o adiciones","Valor Total","Número Contratos y/o adiciones","Valor Total","Número Contratos y/o adiciones","Valor Total"]
[null,null,"RAFAEL URIBE URIBE",2021,60,10890760005,153,157,1820599537,19,316480153,39,8186995297,null,null,3,2387284555]
[]
[]
[]
[null,null,"2. Registrar el número y valor total de los contratos y/o adiciones que se suscribieron del 1 de septiembre al 31 de diciembre de 2021 por cada modalidad. Igualmente en la tipología de contratos de prestación de servicios profesionales y de apoyo a la gestión."]
[]
[null,null,"Entidad","Vigencia","Modalidad",null,null,null,null,null,null,null,null,null,null,null,null,null,"Contratos realizados mediante la tipología de contratos de prestación de servicios profesionales y de apoyo a la gestión"]
[null,null,null,null,"Concurso de méritos",null,"Contratación directa",null,"Contratación mínima cuantia",null,"Selección abreviada",null,"Licitación pública",null,"Régimen privado",null,"Régimen especial"]
[null,null,null,null,"Número Contratos","Valor Total","Número Contratos","Valor Total","Número Contratos","Valor Total","Número Contratos","Valor Total","Número Contratos","Valor Total","Número Contratos","Valor Total","Número Contratos","Valor Total","Número Contratos","Valor Total"]
[null,null,"RAFAEL URIBE URIBE",2021,3,413512485,24,3295697226,9,157990935,21,3495744208,3,3527815151]
[]
[]
[]
[null,null,"3. Detalle cada uno de los procesos de selección adelantados en el cuatrimestre por la entidad de acuerdo a cada modalidad de selección (licitación pública, selección abreviada o concurso de méritos), y diligencie el número de proponentes que se presentaron en cada uno de ellos"]
[]
[null,null,"Entidad","Proponentes (que se presentaron a los proceso de selección)"]
[null,null,null,"Concurso de méritos",null,"Selección abreviada",null,"Licitación pública"]
[null,null,null,"Número del proceso contractual en SECOP","Número de proponentes","Número del proceso contractual en SECOP","Número de proponentes","Número del proceso contractual en SECOP","Número de proponentes"]
[null,null,"RAFAEL URIBE URIBE","FDLRUU-CMA-317-2021 ",3]
[null,null,"RAFAEL URIBE URIBE","FDLRUU-CMA-311-2021 ",2]
[null,null,"RAFAEL URIBE URIBE","FDLRUU-CMA-316-2021 ",2]
[null,null,"RAFAEL URIBE URIBE",null,null,"FDLRUU-SASI-253-2021",9]
[null,null,"RAFAEL URIBE URIBE",null,null,"FDLRUU-SAMC-252-2021",20]
[null,null,"RAFAEL URIBE URIBE",null,null,"FDLRUU-SASI-254-2021",5]
[null,null,"RAFAEL URIBE URIBE",null,null,"FDLRUU-SAMC-249-2021",6]
[null,null,"RAFAEL URIBE URIBE",null,null,"FDLRUU-SAMC-248-2021 ",4]
[null,null,"RAFAEL URIBE URIBE",null,null,"OC-78708",1]
[null,null,"RAFAEL URIBE URIBE",null,null,"FDLRUU-SASI-295-2021",3]
[null,null,"RAFAEL URIBE URIBE",null,null,"FDLRUU-SAMC-306-2021",1]
[null,null,"RAFAEL URIBE URIBE",null,null,"FDLRUU-SAMC-310-2021",4]
[null,null,"RAFAEL URIBE URIBE",null,null,"FDLRUU-SAMC-308-2021",15]
[null,null,"RAFAEL URIBE URIBE",null,null,"FDLRUU-SAMC-314-2021",2]
[null,null,"RAFAEL URIBE URIBE",null,null,"FDLRUU-SASI-307-2021",3]
[null,null,"RAFAEL URIBE URIBE",null,null,"FDLRUU-SAMC-315-2021 ",7]
[null,null,"RAFAEL URIBE URIBE",null,null,"FDLRUU-SAMC-313-2021",11]
[null,null,"RAFAEL URIBE URIBE",null,null,"FDLRUU-SAMC-318-2021",4]
[null,null,"RAFAEL URIBE URIBE",null,null,"OC-82202",1]
[null,null,"RAFAEL URIBE URIBE",null,null,"OC-82982",1]
[null,null,"RAFAEL URIBE URIBE",null,null,"OC-83022",1]
[null,null,"RAFAEL URIBE URIBE",null,null,"OC-83979",1]
[null,null,"RAFAEL URIBE URIBE",null,null,"OC-83980",1]
[null,null,"RAFAEL URIBE URIBE",null,null,null,null,"FDLRUU-LP-288-2021",2]
[null,null,"RAFAEL URIBE URIBE",null,null,null,null,"FDLRUU-LP-293-2021 ",4]
[null,null,"RAFAEL URIBE URIBE",null,null,null,null,"FDLRUU-LP-301-2021",8]

{"sheet":"4. INSTRUCTIVO","index":7,"n_rows":105,"n_cols":4,"rows_kept":105,"cut":false,"hidden":false,"merged":[[76,1,77,1],[76,2,77,2],[71,1,71,3],[103,1,103,3],[85,1,85,3],[86,1,87,1],[86,2,87,2],[100,1,100,3],[94,1,94,3],[72,1,74,1],[72,2,74,2],[79,2,82,2],[79,1,82,1],[57,1,60,1],[59,2,60,2],[63,1,68,1],[8,1,8,3],[12,1,12,3],[23,1,23,3],[52,1,54,1],[52,2,54,2],[33,2,34,2],[29,2,30,2],[27,1,28,1],[24,1,25,1],[24,2,25,2],[29,1,51,1],[10,1,10,3],[1,1,1,3],[2,1,2,3],[9,1,9,3],[3,1,3,3],[4,1,4,3],[5,1,5,3],[7,1,7,3],[6,1,6,3]]}
[]
[null,"INSTRUCTIVO FORMATO"]
[null,"Recomendamos leer cuidadosamente y poner en práctica las instrucciones que se explican en este instructivo. De la calidad de la información que se registre, depende en gran medida la calidad del informe de rendición de cuentas de la Gestión Contractual que presenta el Alcalde Mayor, consolidado por la Veeduría Distrital.\nEn este formato se deberán relacionar:\nHoja 1. \"INFORMACION ACUMULADA\", diligenciar en esta hoja la totalidad de la información contractual desde el 1 de enero al 31 de diciembre de 2021.\nHoja 2. “PLAN ANUAL DE ADQUISICIONES – PAA”, se pide información sobre el Plan Anual de Adquisiciones y sus modificaciones, por lo cual se deberá precisar el presupuesto total del plan; el programado del 1 de septiembre al 31 de diciembre de 2021; el efectivamente contratado en este período; la primera fecha de publicación del PAA; la última fecha de modificación y el número total de modificaciones realizadas durante este mismo período. \nHoja 3. “CONSOLIDADO”, se pide totalizar la información reportada en la hoja 1, sólo respecto a los contratos y adiciones suscritas entre el 1 de septiembre y el 31 de diciembre de 2021, por lo cual debe coincidir. Es así que en el numeral 1, se debe diligenciar el total de contratos suscritos por la entidad entre el 1 de septiembre y el 31 de diciembre de 2021, periodo de evaluación y su valor; el número total de contratos adicionados, el número total de adiciones y su valor; el número total de contratos celebrados con personas naturales, jurídicas, uniones temporales y consorcios, y su valor; en el numeral 2, se debe registrar en el periodo mencionado, el número total de contratos celebrados según la modalidad de selección y el valor total por cada modalidad; igualmente, es necesario precisar que se deberán relacionar los contratos celebrados mediante la tipología de prestación de servicios profesionales y de apoyo a la gestión y el valor total de ellos. En el numeral 3, se deberá indicar en las modalidades de licitación pública, concurso de méritos y selección abreviada, el número de procesos de selección en los que se presentaron 1 o más proponentes.\nHoja 4.“INSTRUCTIVO”, se dan las instrucciones para el diligenciamiento de la información, explicando paso a paso cada uno de los datos de la base y la manera de diligenciarla para efectos de que la información reportada sea veraz y no presente inconsistencias."]
[null,"La base en Excel a diligenciar NO debe modificarse, debe utilizar versión Excel 2010 o posteriores, la versión 2007 no habilita los macros. El formato está controlado y algunas celdas tienen opciones de selección y solo se debe escoger una de ellas.  El nombre de las hojas no se debe modificar o renombrar debido a que tiene macros. No incluya columnas con otro tipo de información que la Veeduría Distrital no está solicitando o que cambie el formato de celda establecido. Debe diliigencar la totalidad de las celdas, no combinarlas, registrar la información contractual en filas independientes. Las celdas donde se requieren relacionar valores, deben diligenciarse sin puntos, tildes, comas, ni caracteres especiales."]
[null,"Para insertar una o varias filas, en el encabezado del formato, se encuentra un botón denominado \"Insertar Filas\" en el cual se debe hacer click  y digite el número de filas a insertar. Si usted no sigue este procedimiento las filas que inserte no tomarán el formato de las filas anteriores. Se recomienda que antes de iniciar el registro de información inserte las filas que requiera, sin embargo, en cualquier momento que necesite puede hacer este paso"]
[null,"Si requiere insertar una o varias filas realícelo después de la fila A14 para que tomen el formato de las filas anteriores."]
[null,"Si necesita pegar información debe hacerlo por secciones debido a que hay columnas formuladas que están protegidas que no permiten realizar esta opción. Utilice la opción de pegado especial valores para no borrar las listas desplegables ni los formatos de las columnas. Si al pegar quedan textos en rojo,  verifique y ajuste la información, el dato que adiciono no se encuentra en la lista desplegable o no corresponde con el criterio definido en el columna."]
[null,"En primer lugar, diligencie toda la información correspondiente a los contratos suscritos con cargo la vigencia 2021."]
[null,"Una vez incluidos todos los contratos  de la vigencia 2021, a continuación diligencie el formato completo con la información correspondiente a las adiciones efectuadas con cargo a la vigencia 2021 de contratos suscritos en vigencias anteriores. La información general del contrato como: modalidad de selección, tipología contractual, objeto, entre otros, debe corresponder a la información del contrato adicionado o modificado. Respecto al valor, sólo se diligencia el valor en la columna adición, es decir, la columna de valor inicial debe quedar en blanco. No olvide registrar el número de adiciones realizadas en la columna correspondiente."]
[null,"La información que se registre en esta base de datos debe coincidir con los reportes en BOGDATA  y adicionalmente con SECOP.  Es así que la sumatoria del valor final de los contratos y adiciones, por eje/pilar/propósito, programa y proyecto registrada por la Entidad, debe coincidir con la ejecución presupuestal de la entidad, reporte de BOGDATA con corte a 31 de diciembre de 2021, es decir, se debe verificar su coincidencia por rubro con el total del compromiso acumulado; igualmente respecto al valor acumulado de los giros."]
[null,"En caso de haber realizado apropiaciones presupuestales en la vigencia a través de resoluciones, caja menor, honorarios ediles, servicios públicos, debe relacionar dicha información en una sola fila al final de la base, indicando de que se trata la apropiación y número de proyecto si hay lugar a ello. En el tipo de contrato se registra con la opción \"Otros gastos\"."]
[]
[null,"ENCABEZADO DEL FORMATO"]
[null,1,"Entidad","Indique el nombre completo de la Entidad."]
[null,2,"Sector","Seleccione el sector al cual pertenece la Entidad."]
[null,3,"Presupuesto Disponible Inversión Directa","Indique el valor total del presupuesto disponible de inversión directa, de acuerdo con el Informe de ejecución presupuestal de la entidad (BOGDATA), a 31 de diciembre de 2021."]
[null,4,"Presupuesto Comprometido de Inversión Directa ","Escriba el valor total del presupuesto comprometido de inversión directa, de acuerdo con el Informe de ejecución presupuestal de la entidad (BOGDATA), a 31 de diciembre de 2021."]
[null,5,"Presupuesto Disponible Funcionamiento","Indique el valor total del presupuesto de funcionamiento disponible, de acuerdo con el con el Informe de ejecución presupuestal de la entidad (BOGDATA), a 31 de diciembre de 2021."]
[null,6,"Presupuesto Comprometido funcionamiento ","Escriba el monto del presupuesto de funcionamiento, comprometido mediante contratos, de acuerdo con el Informe de ejecución presupuestal de la entidad (BOGDATA), a 31 de diciembre de 2021."]
[null,7,"Presupuesto Disponible Operación","Coloque el monto del presupuesto de operación disponible, de acuerdo con el Informe de ejecución presupuestal de la entidad (BOGDATA), a 31 de diciembre de 2021. Los gastos de operación corresponden solamente a aquellas entidades de régimen de contratación  privado."]
[null,8,"Presupuesto Comprometido operación mediante contratos","Escriba el monto del presupuesto de operación comprometido mediante contratos a 31 de diciembre de 2021."]
[null,9,"Nombre de quien diligencia el formato","Indique el nombre completo, cargo, número de teléfono con extensión y correo electrónico del profesional que diligencia el formato y que posteriormente realizará los ajustes y aclaraciones a que haya lugar por solicitud de la Veeduría Distrital."]
[]
[null,"1- INFORMACIÓN GENERAL"]
[null,1,"Número de Contrato","En estricto orden consecutivo registre el número del contrato, sin incluir los contratos que fueron anulados, ni comodatos."]
[null,null,null,"Una vez terminado el registro de los contratos celebrados con cargo a la vigencia 2021, en las siguientes filas registre la información correspondiente a las adiciones efectuadas con cargo a la vigencia 2021 de contratos suscritos en vigencias anteriores, especificando el año de suscripción en la columna dos."]
[null,2,"Año","Registre el año de celebración del contrato."]
[null,3,"Número de proceso en el SECOP","Relacione el número de proceso de selección con el cual se encuentra publicado el contrato en el SECOP, mas no el link o enlace. Ejemplo IDU-CMA-DTDP-240-2021"]
[null,null,"Link proceso SECOP","Registre el enlace del proceso en SECOP. Ejemplo  https://community.secop.gov.co/Public/xxxxxx"]
[null,4,"Tipo de Contrato","En esta columna seleccione de la lista, el tipo de contrato que corresponde al contrato suscrito. El formato no permite incluir tipo de contratos diferentes a los señaladas en la lista desplegable.  Se debe escoger de las tipologías contractuales que se relacionan a continuación:  "]
[null,null,null,"Para las adiciones a contratos suscritos en la vigencia 2021 y adiciones a contratos sucritos de años anteriores se debe diligenciar la tipología del contrato adicionado o modificado"]
[null,null,"Obra ","Son contratos de obra los que celebren las entidades estatales para la construcción, mantenimiento, instalación y, en general, para la realización de cualquier otro trabajo material sobre bienes inmuebles, cualquiera que sea la modalidad de ejecución y pago. Numeral 1 del artículo 32 de la Ley 80 de 1993"]
[null,null,"Consultoría","Aquellos que celebran las entidades estatales, referidos a los estudios necesarios para la ejecución de proyectos de inversión, de diagnósticos, prefactibilidad o factibilidad para programas o proyectos específicos, así como  las asesorías técnicas de coordinación, control y supervisión. Numeral 2 del artículo 32 de la Ley 80 de 1993"]
[null,null,"Interventoría","Son también  contratos de consultoría los que tienen por objeto la Interventoría, asesoría, gerencia de obras o de proyectos, dirección, programación y la ejecución de diseños, planos, anteproyectos y proyectos. Numeral 2 del artículo 32 de la Ley 80 de 1993"]
[null,null,null,"El contrato de Interventoría tiene por objeto la  supervisión, seguimiento y vigilancia a la ejecución material de un contrato principal"]
[null,null,"Contrato de Prestación de servicios","Son contratos de prestación de servicios los que celebren las entidades estatales para desarrollar actividades relacionadas con la administración o funcionamiento de la entidad. Numeral 3 del artículo 32 de la Ley 80 de 1993"]
[null,null,"Contrato de Prestación de servicios profesionales y de apoyo a la gestión","Corresponden a aquellos de naturaleza intelectual diferentes a los de consultoría que se derivan del cumplimiento de las funciones de la entidad estatal; así como los relacionados con actividades operativas, logísticas, o asistenciales. Art. 2.2.1.2.1.4.9. del Decreto 1082 de 2015"]
[null,null,"Compraventa de bienes muebles","Son aquellos contratos donde se transfiere el dominio de un bien mueble (aquellos susceptibles de ser trasladadas de un lugar a otro sin alterar ni su forma ni su esencia, tal es el caso del mobiliario y equipo de oficina, maquinaria, automóviles, etc.), cuya ejecución se agota de manera instantánea. Artículo 660, Código Civil"]
[null,null,"Compraventa de bienes inmuebles","Son aquellos contratos donde se transfiere el dominio de un bien inmueble (todos aquellos bienes considerados bienes raíces, por tener de común la circunstancia de estar íntimamente ligados al suelo, unidos de modo inseparable, física o jurídicamente, al terreno). Artículo 656, Código Civil"]
[null,null,"Arrendamiento de bienes muebles","Es un contrato que tiene por objeto, conceder el uso y goce de un bien mueble a cambio de un precio determinado. Artículo 1974, Código Civil"]
[null,null,"Arrendamiento de bienes inmuebles","Es un contrato que tiene por objeto, conceder el uso y goce de un bien inmueble a cambio de un precio determinado. Artículo 2.2.1.2.1.4.11 del Decreto 1082 de 2015"]
[null,null,"Seguros","El seguro es un contrato, en virtud del cual una persona jurídica llamada asegurador, asume, a cambio de una prima, un riesgo que le es trasladado por una persona natural o jurídica llamado tomador y en el cual éste tiene un interés asegurable, con el fin de indemnizarlo, en el evento de que ocurra la realización del riesgo amparado, de conformidad con el Título V, del Libro Cuarto del Código de Comercio"]
[null,null,"Suministro","El suministro es el contrato por el cual una parte se obliga, a cambio de una contraprestación, a cumplir en favor de otra, en forma independiente, prestaciones periódicas o continuadas de cosas o servicios. Artículo 968, Código de Comercio"]
[null,null,"Empréstitos","Son contratos de empréstito los que tienen por objeto proveer a la entidad estatal contratante de recursos en moneda nacional o extranjera con plazo para su pago. Artículo 7, Decreto 2681 de 1993"]
[null,null,"Fiducia mercantil o encargo fiduciario","Son contratos que tienen por objeto la administración o el manejo de los recursos vinculados a los contratos que tales entidades celebren. Numeral 5 del artículo 32 de la Ley 80 de 1993"]
[null,null,"Concesión","Este contrato tiene por objeto otorgar a una persona llamada concesionario la prestación, operación, explotación, organización o gestión, total o parcial, de un servicio público, o la construcción, explotación o conservación total o parcial, de una obra o bien destinados al servicio o uso público, así como todas aquellas actividades necesarias para la adecuada prestación o funcionamiento de la obra o servicio por cuenta y riesgo del concesionario, y bajo la vigilancia y control de la entidad concedente, a cambio de una remuneración que puede consistir en derechos, tarifas, tasas, valorización, o en la participación que se le otorgue en la explotación del bien, obra o servicio, o en una suma periódica, única o porcentual, y en general, en cualquier otra modalidad de contraprestación que las partes acuerden. Numeral 4 del artículo 32 de la Ley 80 de 1993"]
[null,null,"Convenios de cooperación","Son aquellos mediante los cuales se formaliza la asistencia, ayuda, auxilio, soporte o colaboración entre entidades de una misma nación, de distintos países o por parte de organizaciones internacionales de naturaleza pública o privada a favor de entidades públicas. Artículo 20 de la Ley 1150 de 2007"]
[null,null,"Convenios/Contratos interadministrativos","El convenio interadministrativo es el negocio jurídico en el cual están presentes dos entidades públicas en desarrollo de relaciones interadministrativas cuyo objeto es coordinar, cooperar, colaborar o distribuir competencias en la realización de funciones administrativas de interés común a los sujetos negociales. Artículo 95 de la Ley 489 de 1998"]
[null,null,"Convenios de Apoyo y/o Convenios de Asociación","Los contratos que en desarrollo de lo dispuesto en el segundo inciso del artículo 355 de la Constitución Política celebren la Nación, los Departamentos, Distritos y Municipios con entidades privadas sin ánimo de lucro y de reconocida idoneidad, con el propósito de impulsar programas y actividades de interés público. Reglamentado mediante Decreto 92 de 2017"]
[null,null,"Asociaciones Público Privadas","Los contratos con personas naturales o jurídicas que se celebran en desarrollo de lo dispuesto en la Ley 1508 de 2012"]
[null,null,"Otros","Los demás tipos de contratos que no se encuentren definidos en las anteriores tipologías"]
[null,null,"Otros gastos","Incluye los gastos no contractuales, estos se registran al final de la base, no cuentan con número de contrato, tipo, proceso o modalidad.  Estos gastos en los que no media un acuerdo de voluntades, en caso de ser del rubro de inversiòn, se deben discriminar por programa y proyecto. En el caso de ser del rubro de funcionamiento no requieren ser discriminados sino totalizados en una sola fila."]
[null,5,"Modalidad de Selección","Al ubicarse en la celda, se despliega una lista de modalidades de selección, de las cuales debe seleccionar la indicada"]
[null,null,null,"Para las adiciones a contratos suscritos en vigencias anteriores se debe diligenciar la modalidad de selección del contrato adicionado o modificado"]
[null,null,null,"La modalidad régimen especial se refiere a todos los contratos realizados en cumplimiento del Decreto 92 de 2017, convenios de asociación con ESAL. Régimen privado es para todas aquellas entidades que no se rigen por el Estatuto General de Contratación Pública (Ley 80 de 1993 y normas complementarias), caso en el que todos sus contratos deben ser identificados con esta modalidad"]
[null,6,"Procedimiento o causal","Esta columna solo se habilita y debe ser diligenciada, para las modalidades de selección abreviada y contratación directa. Al ubicarse en la celda, se despliega una lista de procedimientos o causales, de las cuales debe seleccionar la indicada. El formato no permite incluir procedimientos o causales diferentes a las señaladas en la lista desplegable.  "]
[null,7,"Objeto","Registre el objeto del contrato"]
[null,8,"Afectación ","Registre la afectación según la clasificación de cuentas del presupuesto de gastos. Funcionamiento, Inversión y Operación, esta última aplica únicamente para entidades de régimen privado. La celda solamente permite registrar estas tres opciones."]
[null,null,"Planes de Desarrollo Distrital","Seleccionar el PDD de acuerdo con los diferentes contratos suscritos, automáticamente en la columna K se activan  los números de programa de acuerdo al PDD."]
[null,null,"Número Programa","Si en la columna anterior “Afectación”,  indicó funcionamiento u operación deje en blanco el número de programa, es decir esta columna solamente aplica para gastos de Inversión."]
[null,null,null,"Identifíquelo de acuerdo con el código presupuestal del Plan de Desarrollo  \"Un Nuevo Contrato Social y Ambiental para la Bogotá del Siglo XXI\". Si un mismo contrato afecta más de un código presupuestal discrimine el contrato por cada código que afecte en filas separadas. Si se registra el número del programa, automáticamente en la columna L y M se despliega el nombre del programa y el  propósito según corresponda. "]
[null,9,"Número Proyecto","Indique el código presupuestal con el que se identifica el proyecto. Si un mismo contrato afecta más de un proyecto, discriminar el contrato por cada proyecto que afecte en filas separadas."]
[null,10,"Número de proponentes","Diligencie el número de proponentes que participaron en el proceso de selección adelantado que dio como resultado el contrato que se está diligenciando"]
[null,11,"Número de Identificación del contratista","Indicar el número de identificación del contratista persona natural o jurídica o contratistas plurales (uniones temporales y consorcios) con quien se suscribió el contrato, sin comas, tildes, puntos ni caracteres especiales, y si es NIT sin dígito de verificación"]
[null,null,"Nombre del Contratista","Indicar el nombre del contratista, persona natural o jurídica  o contratistas plurales (uniones temporales y consorcios) en mayúscula sostenida, sin comas, tildes, puntos ni caracteres especiales. Si se trata de personas jurídicas, diligenciar razón social y tipo societario, sin comas, tildes, puntos ni caracteres especiales. Si se trata de personas naturales diligenciar primero los nombres seguidos de los apellidos en la misma columna (nombre 1, nombre 2, apellido 1 y apellido 2)"]
[null,null,"Naturaleza Jurídica","Seleccione la naturaleza jurídica que corresponde al contratista, según las opciones"]
[null,null,"Número  de Identificación de los integrantes del Consorcio o U.T.\n(NIT sin digito de verificación)","Diligenciar este numeral sólo en los casos en que el contratista sea un Consorcio o Union Temporal, relacione en filas independientes (si son varios integrantes puede insertar filas adicionales), cada uno de los números de identificación de los integrantes de los consorcios o uniones temporales sin comas, tildes, puntos ni caracteres especiales, y si es NIT sin dígito de verificación. "]
[null,null,"Nombre del Integrante del Consorcio o U.T.","Diligenciar este numeral sólo en los casos en que el contratista sea un Consorcio o Union Temporal, relacione en filas independientes cada uno de los nombres de los integrantes de los consorcios o uniones temporales, si es persona jurídica la Razón social, es decir el nombre legal de la Empresa; si es persona natural relacione los nombres seguidos de los apellidos en mayúscula sostenida, sin comas, tildes, puntos ni caracteres especiales. Igualmente en el nombre relacione el Tipo societario de cada uno de ellos, entre los cuales se encuentra Sociedades por Acciones Simplificadas (SAS), Sociedad de Responsabilidad Limitada (LTDA), Sociedad en Comandita simple (SCS), Sociedad en Comandita por Acciones (SCA), Sociedad Colectiva, a manera de ejemplo: SOCIEDAD 1 LTDA"]
[null,null,"% Participación","Registre el porcentaje de participación de cada integrante del consorcio o unión temporal, registre sólo números, sin caracteres especiales"]
[]
[]
[null,"2- INFORMACIÓN FINANCIERA"]
[null,12,"Valor Inicial ","Registre el valor inicial del contrato con cargo al segundo cuatrimestre de la vigencia 2021. Esta columna sólo debe contener información numérica"]
[null,null,null,"En el caso de adiciones a contratos de años anteriores, no diligencie esta columna, registrar el valor en la columna 15 \"Valor Total Adiciones\".\nEn caso de adiciones a contratos suscritos en el primer cuatrimestre del 2021, no diligencie esta columna, registrar el valor en la columna 15 \"Valor Total Adiciones\""]
[null,null,null,"Excluya las reservas de apropiación y cuentas por pagar"]
[null,13,"Valor total reducciones (En valor negativo)","Registre el valor de la reducción del contrato en caso de haberse realizado, en negativo, durante la vigencia 2021"]
[null,14,"Número de adiciones ","Diligencie esta columna solo en el caso de adiciones al valor inicial que aumenten el valor del contrato con cargo a la vigencia."]
[null,null,null,"Registre en esta celda el número de adiciones que se realizaron al contrato"]
[null,15,"Valor total de adiciones","Registre el valor total de las adiciones que se realizaron al contrato,  el formato de celda no permite guiones, comas o texto. Esta columna solo debe contener información numérica."]
[null,16,"Valor Final","Esta columna se encuentra formulada por favor no modifique ni quite la fórmula; la fórmula suma las columnas valor inicial, valor de reducciones y valor de adiciones"]
[null,null,null,"La sumatoria de la columna 16 (valor final) para los contratos de Inversión Directa, de funcionamiento y/o operación, cuando aplique, deberán coincidir con el valor del rubro registrado en el encabezado 4, Presupuesto comprometido de inversión según BOGDATA, con el encabezado 6, Presupuesto Comprometido Funcionamiento según BOGDATA y con el encabezado 8, Presupuesto Comprometido Operación mediante contratos, respectivamente. A la vez, estos valores deben coincidir con los informes de ejecución presupuestal del BOGDATA.  "]
[null,null,null,"Si los valores no coinciden debe especificarse al final del formato en qué está representada la diferencia Otros gastos(discriminando los conceptos por Programa y Proyecto de inversión, si es el caso), con sus respectivos valores."]
[null,null,null,"Las bases donde dichos valores no coincidan serán devueltas por la Veeduría Distrital a cada entidad para los respectivos ajustes."]
[null,17,"Giros","Registre el valor total de los giros que se realizaron al contrato,  el formato de celda no permite guiones, comas o texto. Esta columna solo debe contener información numérica."]
[]
[null,"3- PLAZOS"]
[null,18,"Fecha de suscripción","Relacionar la fecha en que se suscribió el contrato original. La celda solo admite el formato Día/Mes/Año, por ejemplo: 17/02/2021"]
[null,null,null,"Para las adiciones a contratos de años anteriores se debe registrar en esta columna la fecha de suscripción de la adición en la vigencia 2021"]
[null,19,"Fecha de inicio","Indicar la fecha de inicio del contrato. Para las adiciones a contratos de años anteriores se debe diligenciar la fecha de inicio de la adición en la vigencia 2021. La celda solo admite el formato Día/Mes/Año así  13/03/2021."]
[null,20,"Fecha de terminación","Indicar la fecha efectiva de terminación del contrato. La celda solo admite el formato Día/Mes/Año así  15/02/2021."]
[null,21,"Plazo en días","Esta columna contiene el plazo inicial del contrato con el número total de días a ejecutar (sólo número de días, no mes, no texto). "]
[null,22,"Número de prórrogas","Registre en esta celda el número de prórrogas que se realizaron al contrato en la vigencia 2021."]
[null,23,"Prórroga en días","En caso de presentarse este evento, indicar en días, el tiempo por el cual se prorrogó el contrato a partir de la fecha inicial de terminación (sólo número de días, no mes, no texto)."]
[]
[null,"4- CESIÓN"]
[null,24,"Número  de Identificación del cesionario\n(NIT con digito de verificación)","Indicar el número de identificación del cesionario persona natural o jurídica con quien se suscribió la cesión, con digito de verificación (DV), el formato de celda no permite guiones o comas, solo números. Si hay más de una cesión adicione una fila y registre número de contrato, año, número proceso contractual SECOP y demás información que corresponda."]
[null,25,"Nombre cesionario","Indicar el nombre del cesionario, persona natural o jurídica."]
[null,26,"Fecha cesión","Relacionar la fecha en que se suscribió la cesión del contrato. La celda solo admite el formato Día/Mes/Año así  17/02/2021."]
[null,27,"Valor cesión","Registre el valor correspondiente a la cesión con cargo a la vigencia 2021, el formato de celda no permite guiones, comas o texto. Esta columna solo debe contener información numérica."]
[]
[null,"5- ESTADO A 31 DE DICIEMBRE DE 2021"]
[null,28,"Estado","Marque con una X en la respectiva columna si el contrato se encuentra a 31 de diciembre de 2021 Celebrado o por Iniciar, En Ejecución, Terminado o Liquidado."]
[]
[null,"5- PORCENTAJE DE AVANCE Y/O CUMPLIMIENTO"]
[null,29,"% Avance y/o cumplimiento","Indica el porcentaje de avance o de cumplimiento en términos presupuestales a 31 de diciembre de 2021, es decir lo efectivamente pagado al contratista. Si no se ha iniciado la ejecución, el % de avance es 0%. La celda se encuentra formulada y protegida. Es la relación entre el valor de los giros y el valor final del contrato. Si el porcentaje de avance no coincide, se debe revisar los valores que se registraron en estas columnas.  Este porcentaje no debe ser superior al 100%"]

{"sheet":"Proposito_programa","index":8,"n_rows":59,"n_cols":5,"rows_kept":59,"cut":false,"hidden":false,"merged":[]}
[]
[null,"PDD","No. Programa","Programa","Propósito"]
["Acuerdo 761 2020","Un Nuevo Contrato Social y Ambiental para la Bogotá del Siglo XXI",1,"Subsidios y transferencias para la equidad","Propósito 1: Hacer un nuevo contrato social para incrementar la inclusión social, productiva y política"]
["Pag. 51","Un Nuevo Contrato Social y Ambiental para la Bogotá del Siglo XXI",{"$f":"+C3+1","v":2},"Igualdad de oportunidades y desarrollo de capacidades para las mujeres","Propósito 1: Hacer un nuevo contrato social para incrementar la inclusión social, productiva y política"]
[null,"Un Nuevo Contrato Social y Ambiental para la Bogotá del Siglo XXI",{"$f":"+C4+1","v":3},"Movilidad social integral","Propósito 1: Hacer un nuevo contrato social para incrementar la inclusión social, productiva y política"]
[null,"Un Nuevo Contrato Social y Ambiental para la Bogotá del Siglo XXI",4,"Prevención de la exclusión por razones étnicas, religiosas, sociales, políticas y de orientación sexual","Propósito 1: Hacer un nuevo contrato social para incrementar la inclusión social, productiva y política"]
[null,"Un Nuevo Contrato Social y Ambiental para la Bogotá del Siglo XXI",5,"Promoción de la igualdad, el desarrollo de capacidades y el reconocimiento de las mujeres","Propósito 1: Hacer un nuevo contrato social para incrementar la inclusión social, productiva y política"]
[null,"Un Nuevo Contrato Social y Ambiental para la Bogotá del Siglo XXI",6,"Sistema Distrital de Cuidado","Propósito 1: Hacer un nuevo contrato social para incrementar la inclusión social, productiva y política"]
[null,"Un Nuevo Contrato Social y Ambiental para la Bogotá del Siglo XXI",7,"Mejora de la gestión de instituciones de salud","Propósito 1: Hacer un nuevo contrato social para incrementar la inclusión social, productiva y política"]
[null,"Un Nuevo Contrato Social y Ambiental para la Bogotá del Siglo XXI",8,"Prevención y atención de maternidad temprana","Propósito 1: Hacer un nuevo contrato social para incrementar la inclusión social, productiva y política"]
[null,"Un Nuevo Contrato Social y Ambiental para la Bogotá del Siglo XXI",9,"Prevención y cambios para mejorar la salud de la población","Propósito 1: Hacer un nuevo contrato social para incrementar la inclusión social, productiva y política"]
[null,"Un Nuevo Contrato Social y Ambiental para la Bogotá del Siglo XXI",10,"Salud para la vida y el bienestar","Propósito 1: Hacer un nuevo contrato social para incrementar la inclusión social, productiva y política"]
[null,"Un Nuevo Contrato Social y Ambiental para la Bogotá del Siglo XXI",11,"Salud y bienestar para niñas y niños","Propósito 1: Hacer un nuevo contrato social para incrementar la inclusión social, productiva y política"]
[null,"Un Nuevo Contrato Social y Ambiental para la Bogotá del Siglo XXI",12,"Educación inicial: Bases sólidas para la vida.","Propósito 1: Hacer un nuevo contrato social para incrementar la inclusión social, productiva y política"]
[null,"Un Nuevo Contrato Social y Ambiental para la Bogotá del Siglo XXI",13,"Educación para todos y todas: acceso y permanencia con equidad y énfasis en educación rural","Propósito 1: Hacer un nuevo contrato social para incrementar la inclusión social, productiva y política"]
[null,"Un Nuevo Contrato Social y Ambiental para la Bogotá del Siglo XXI",14,"Formación integral: más y mejor tiempo en los colegios","Propósito 1: Hacer un nuevo contrato social para incrementar la inclusión social, productiva y política"]
[null,"Un Nuevo Contrato Social y Ambiental para la Bogotá del Siglo XXI",15,"Plan Distrital de Lectura, Escritura y Oralidad: \"Leer para la vida\"","Propósito 1: Hacer un nuevo contrato social para incrementar la inclusión social, productiva y política"]
[null,"Un Nuevo Contrato Social y Ambiental para la Bogotá del Siglo XXI",16,"Transformación pedagógica y mejoramiento de la gestión educativa. Es con los maestros y maestras.","Propósito 1: Hacer un nuevo contrato social para incrementar la inclusión social, productiva y política"]
[null,"Un Nuevo Contrato Social y Ambiental para la Bogotá del Siglo XXI",17,"Jóvenes con capacidades: Proyecto de vida para la ciudadanía, la innovación y el trabajo del siglo XXI","Propósito 1: Hacer un nuevo contrato social para incrementar la inclusión social, productiva y política"]
[null,"Un Nuevo Contrato Social y Ambiental para la Bogotá del Siglo XXI",18,"Cierre de brechas para la inclusión productiva urbano rural","Propósito 1: Hacer un nuevo contrato social para incrementar la inclusión social, productiva y política"]
[null,"Un Nuevo Contrato Social y Ambiental para la Bogotá del Siglo XXI",19,"Vivienda y entornos dignos en el territorio urbano y rural","Propósito 1: Hacer un nuevo contrato social para incrementar la inclusión social, productiva y política"]
[null,"Un Nuevo Contrato Social y Ambiental para la Bogotá del Siglo XXI",20,"Bogotá, referente en cultura, deporte, recreación y actividad física, con parques para el desarrollo y la salud","Propósito 1: Hacer un nuevo contrato social para incrementar la inclusión social, productiva y política"]
[null,"Un Nuevo Contrato Social y Ambiental para la Bogotá del Siglo XXI",21,"Creación y vida cotidiana: Apropiación ciudadana del arte, la cultura y el patrimonio, para la democracia cultural","Propósito 1: Hacer un nuevo contrato social para incrementar la inclusión social, productiva y política"]
[null,"Un Nuevo Contrato Social y Ambiental para la Bogotá del Siglo XXI",22,"Transformación cultural para la conciencia ambiental y el cuidado de la fauna doméstica","Propósito 1: Hacer un nuevo contrato social para incrementar la inclusión social, productiva y política"]
[null,"Un Nuevo Contrato Social y Ambiental para la Bogotá del Siglo XXI",23,"Bogotá rural","Propósito 1: Hacer un nuevo contrato social para incrementar la inclusión social, productiva y política"]
[null,"Un Nuevo Contrato Social y Ambiental para la Bogotá del Siglo XXI",24,"Bogotá región emprendedora e innovadora","Propósito 1: Hacer un nuevo contrato social para incrementar la inclusión social, productiva y política"]
[null,"Un Nuevo Contrato Social y Ambiental para la Bogotá del Siglo XXI",25,"Bogotá región productiva y competitiva","Propósito 1: Hacer un nuevo contrato social para incrementar la inclusión social, productiva y política"]
[null,"Un Nuevo Contrato Social y Ambiental para la Bogotá del Siglo XXI",26,"Bogotá - región, el mejor destino para visitar","Propósito 1: Hacer un nuevo contrato social para incrementar la inclusión social, productiva y política"]
[null,"Un Nuevo Contrato Social y Ambiental para la Bogotá del Siglo XXI",27,"Cambio cultural para la gestión de la crisis climática","Propósito 2 : Cambiar Nuestros Hábitos de Vida para Reverdecer a Bogotá y Adaptarnos y Mitigar la Crisis Climática"]
[null,"Un Nuevo Contrato Social y Ambiental para la Bogotá del Siglo XXI",{"$f":"+C29+1","v":28},"Bogotá protectora de sus recursos naturales","Propósito 2 : Cambiar Nuestros Hábitos de Vida para Reverdecer a Bogotá y Adaptarnos y Mitigar la Crisis Climática"]
[null,"Un Nuevo Contrato Social y Ambiental para la Bogotá del Siglo XXI",{"$f":"+C30+1","v":29},"Asentamientos y entornos protectores","Propósito 2 : Cambiar Nuestros Hábitos de Vida para Reverdecer a Bogotá y Adaptarnos y Mitigar la Crisis Climática"]
[null,"Un Nuevo Contrato Social y Ambiental para la Bogotá del Siglo XXI",30,"Eficiencia en la atención de emergencias","Propósito 2 : Cambiar Nuestros Hábitos de Vida para Reverdecer a Bogotá y Adaptarnos y Mitigar la Crisis Climática"]
[null,"Un Nuevo Contrato Social y Ambiental para la Bogotá del Siglo XXI",31," Protección y valoración del patrimonio tangible e intangible en Bogotá y la región","Propósito 2 : Cambiar Nuestros Hábitos de Vida para Reverdecer a Bogotá y Adaptarnos y Mitigar la Crisis Climática"]
[null,"Un Nuevo Contrato Social y Ambiental para la Bogotá del Siglo XXI",32,"Revitalización urbana para la competitividad","Propósito 2 : Cambiar Nuestros Hábitos de Vida para Reverdecer a Bogotá y Adaptarnos y Mitigar la Crisis Climática"]
[null,"Un Nuevo Contrato Social y Ambiental para la Bogotá del Siglo XXI",33,"Más árboles y más y mejor espacio público","Propósito 2 : Cambiar Nuestros Hábitos de Vida para Reverdecer a Bogotá y Adaptarnos y Mitigar la Crisis Climática"]
[null,"Un Nuevo Contrato Social y Ambiental para la Bogotá del Siglo XXI",34,"Bogotá protectora de los animales","Propósito 2 : Cambiar Nuestros Hábitos de Vida para Reverdecer a Bogotá y Adaptarnos y Mitigar la Crisis Climática"]
[null,"Un Nuevo Contrato Social y Ambiental para la Bogotá del Siglo XXI",35,"Manejo y prevención de contaminación","Propósito 2 : Cambiar Nuestros Hábitos de Vida para Reverdecer a Bogotá y Adaptarnos y Mitigar la Crisis Climática"]
[null,"Un Nuevo Contrato Social y Ambiental para la Bogotá del Siglo XXI",36,"Manejo y saneamiento de los cuerpos de agua","Propósito 2 : Cambiar Nuestros Hábitos de Vida para Reverdecer a Bogotá y Adaptarnos y Mitigar la Crisis Climática"]
[null,"Un Nuevo Contrato Social y Ambiental para la Bogotá del Siglo XXI",37,"Provisión y mejoramiento de servicios públicos","Propósito 2 : Cambiar Nuestros Hábitos de Vida para Reverdecer a Bogotá y Adaptarnos y Mitigar la Crisis Climática"]
[null,"Un Nuevo Contrato Social y Ambiental para la Bogotá del Siglo XXI",38,"Ecoeficiencia, reciclaje, manejo de residuos e inclusión de la población recicladora","Propósito 2 : Cambiar Nuestros Hábitos de Vida para Reverdecer a Bogotá y Adaptarnos y Mitigar la Crisis Climática"]
[null,"Un Nuevo Contrato Social y Ambiental para la Bogotá del Siglo XXI",39,"Bogotá territorio de paz y atención integral a las víctimas del conflicto armado","Propósito 3: Inspirar confianza y legitimidad para vivir sin miedo y ser epicentro de cultura ciudadana, paz y reconciliación"]
[null,"Un Nuevo Contrato Social y Ambiental para la Bogotá del Siglo XXI",{"$f":"+C41+1","v":40},"Más mujeres viven una vida libre de violencias, se sienten seguras y acceden con confianza al sistema de justicia","Propósito 3: Inspirar confianza y legitimidad para vivir sin miedo y ser epicentro de cultura ciudadana, paz y reconciliación"]
[null,"Un Nuevo Contrato Social y Ambiental para la Bogotá del Siglo XXI",{"$f":"+C42+1","v":41},"Sin machismo ni violencias contra las mujeres, las niñas y los niños","Propósito 3: Inspirar confianza y legitimidad para vivir sin miedo y ser epicentro de cultura ciudadana, paz y reconciliación"]
[null,"Un Nuevo Contrato Social y Ambiental para la Bogotá del Siglo XXI",42,"Conciencia y cultura ciudadana para la seguridad, la convivencia y la construcción de confianza","Propósito 3: Inspirar confianza y legitimidad para vivir sin miedo y ser epicentro de cultura ciudadana, paz y reconciliación"]
[null,"Un Nuevo Contrato Social y Ambiental para la Bogotá del Siglo XXI",43,"Cultura ciudadana para la confianza, la convivencia y la participación desde la vida cotidiana","Propósito 3: Inspirar confianza y legitimidad para vivir sin miedo y ser epicentro de cultura ciudadana, paz y reconciliación"]
[null,"Un Nuevo Contrato Social y Ambiental para la Bogotá del Siglo XXI",44,"Autoconciencia, respeto y cuidado en el espacio público","Propósito 3: Inspirar confianza y legitimidad para vivir sin miedo y ser epicentro de cultura ciudadana, paz y reconciliación"]
[null,"Un Nuevo Contrato Social y Ambiental para la Bogotá del Siglo XXI",45,"Espacio público más seguro y construido colectivamente","Propósito 3: Inspirar confianza y legitimidad para vivir sin miedo y ser epicentro de cultura ciudadana, paz y reconciliación"]
[null,"Un Nuevo Contrato Social y Ambiental para la Bogotá del Siglo XXI",46,"Atención a jóvenes y adultos infractores con impacto en su proyecto de vida","Propósito 3: Inspirar confianza y legitimidad para vivir sin miedo y ser epicentro de cultura ciudadana, paz y reconciliación"]
[null,"Un Nuevo Contrato Social y Ambiental para la Bogotá del Siglo XXI",47,"Calidad de Vida y Derechos de la Población privada de la libertad","Propósito 3: Inspirar confianza y legitimidad para vivir sin miedo y ser epicentro de cultura ciudadana, paz y reconciliación"]
[null,"Un Nuevo Contrato Social y Ambiental para la Bogotá del Siglo XXI",48,"Plataforma institucional para la seguridad y justicia","Propósito 3: Inspirar confianza y legitimidad para vivir sin miedo y ser epicentro de cultura ciudadana, paz y reconciliación"]
[null,"Un Nuevo Contrato Social y Ambiental para la Bogotá del Siglo XXI",49,"Movilidad segura, sostenible y accesible","Propósito 4: Hacer de Bogotá Región un modelo de movilidad multimodal, incluyente y sostenible"]
[null,"Un Nuevo Contrato Social y Ambiental para la Bogotá del Siglo XXI",{"$f":"+C51+1","v":50},"Red de metros","Propósito 4: Hacer de Bogotá Región un modelo de movilidad multimodal, incluyente y sostenible"]
[null,"Un Nuevo Contrato Social y Ambiental para la Bogotá del Siglo XXI",51,"Gobierno Abierto","Propósito 5: Construir Bogotá - Región con gobierno abierto, transparente y ciudadanía consciente"]
[null,"Un Nuevo Contrato Social y Ambiental para la Bogotá del Siglo XXI",{"$f":"+C53+1","v":52},"Integración regional, distrital y local","Propósito 5: Construir Bogotá - Región con gobierno abierto, transparente y ciudadanía consciente"]
[null,"Un Nuevo Contrato Social y Ambiental para la Bogotá del Siglo XXI",{"$f":"+C54+1","v":53},"Información para la toma de decisiones","Propósito 5: Construir Bogotá - Región con gobierno abierto, transparente y ciudadanía consciente"]
[null,"Un Nuevo Contrato Social y Ambiental para la Bogotá del Siglo XXI",54,"Transformación digital y gestión de TIC para un territorio inteligente","Propósito 5: Construir Bogotá - Región con gobierno abierto, transparente y ciudadanía consciente"]
[null,"Un Nuevo Contrato Social y Ambiental para la Bogotá del Siglo XXI",55,"Fortalecimiento de cultura ciudadana y su institucionalidad","Propósito 5: Construir Bogotá - Región con gobierno abierto, transparente y ciudadanía consciente"]
[null,"Un Nuevo Contrato Social y Ambiental para la Bogotá del Siglo XXI",56,"Gestión pública efectiva","Propósito 5: Construir Bogotá - Región con gobierno abierto, transparente y ciudadanía consciente"]
[null,"Un Nuevo Contrato Social y Ambiental para la Bogotá del Siglo XXI",57,"Gestión pública local","Propósito 5: Construir Bogotá - Región con gobierno abierto, transparente y ciudadanía consciente"]

{"sheet":"Tipo","index":9,"n_rows":40,"n_cols":5,"rows_kept":40,"cut":false,"hidden":true,"merged":[]}
[null,"Tipo","Modalidad de Selección","afectacion","Naturaleza Jurídica"]
[1,"Obra pública","Concurso de méritos","Funcionamiento","Persona Natural"]
[2,"Consultoría","Contratación directa","Inversión","Persona Jurídica"]
[3,"Interventoría","Contratación mínima cuantia","Operación","Unión Temporal"]
[4,"Contratos de prestación de servicios","Selección abreviada",null,"Consorcio"]
[5,"Contratos de prestación de servicios profesionales y de apoyo a la gestión","Licitación pública"]
[6,"Compraventa de bienes muebles","Régimen privado"]
[7,"Compraventa de bienes inmuebles","Régimen especial"]
[8,"Arrendamiento de bienes muebles"]
[9,"Arrendamiento de bienes inmuebles"]
[10,"Seguros","Selección abreviada"]
[11,"Suministro","Subasta inversa "]
[12,"Empréstitos","Bolsas de productos"]
[13,"Fiducia mercantil o encargo fiduciario","Acuerdo marco de precios "]
[14,"Concesión ","Selección abreviada por menor cuantía "]
[15,"Convenios de cooperacion"]
[16,"Contratos interadministrativos","contratacion directa"]
[17,"Convenios de apoyo y/o convenios de asociación ","Urgencia manifiesta"]
[18,"Asociaciones público privadas","Contratación de empréstitos"]
[19,"Otros","Contratos interadministrativos"]
[20,"Otros gastos","Contratación de bienes y servicios en el sector Defensa y en el Departamento Administrativo de Seguridad, DAS"]
[null,"SECTOR","Contratos para el desarrollo de actividades científicas y tecnológicas"]
[1,"Gestión Pública","Contratos de encargo fiduciario que celebren las entidades territoriales cuando inician el Acuerdo de Reestructuración de Pasivos"]
[{"$f":"+A23+1","v":2},"Gobierno","Cuando no exista pluralidad de oferentes en el mercado"]
[{"$f":"+A24+1","v":3},"Hacienda","Prestación de servicios profesionales y de apoyo a la gestión, o para la ejecución de trabajos artísticos que sólo puedan encomendarse a determinadas personas naturales;"]
[4,"Planeación","El arrendamiento o adquisición de inmuebles"]
[5,"Desarrollo Económico, Industria y Turismo","Contratación de bienes y servicios de la Dirección Nacional de Inteligencia (DNI)"]
[6,"Educación"]
[7,"Salud"]
[8,"Integración Social","Decreto 92 de 2017"]
[9,"Cultura, Recreación y Deporte","No aplica"]
[10,"Ambiente"]
[11,"Movilidad","SECOP I"]
[12,"Hábitat","SECOP II"]
[13,"Mujeres"]
[14,"Seguridad, Convivencia y Justicia","Bogotá Mejor para Todos"]
[15,"Gestión Juridíca","Un Nuevo Contrato Social y Ambiental para la Bogotá del Siglo XXI"]
[16,"descentralizado territorialmente"]
[]
[null,"16 - AL"]

{"sheet":"Eje_Pilar_Prop1","index":10,"n_rows":104,"n_cols":5,"rows_kept":104,"cut":false,"hidden":true,"merged":[]}
[]
[null,"PDD","No. Programa","Programa","Pilar /Eje / propósito"]
[null,"Bogotá Mejor para Todos",1,"Prevención y atención de la maternidad y la paternidad tempranas","Pilar 1 Igualdad de Calidad de Vida"]
[null,"Bogotá Mejor para Todos",2,"Desarrollo integral desde la gestación hasta la adolescencia","Pilar 1 Igualdad de Calidad de Vida"]
[null,"Bogotá Mejor para Todos",3,"Igualdad y autonomía para una Bogotá incluyente","Pilar 1 Igualdad de Calidad de Vida"]
[null,"Bogotá Mejor para Todos",4,"Familias protegidas y adaptadas al cambio climático","Pilar 1 Igualdad de Calidad de Vida"]
[null,"Bogotá Mejor para Todos",5,"Desarrollo integral para la felicidad y el ejercicio de la ciudadanía","Pilar 1 Igualdad de Calidad de Vida"]
[null,"Bogotá Mejor para Todos",6,"Calidad educativa para todos","Pilar 1 Igualdad de Calidad de Vida"]
[null,"Bogotá Mejor para Todos",7,"Inclusión educativa para la equidad","Pilar 1 Igualdad de Calidad de Vida"]
[null,"Bogotá Mejor para Todos",8,"Acceso con calidad a la educación superior","Pilar 1 Igualdad de Calidad de Vida"]
[null,"Bogotá Mejor para Todos",9,"Atención integral y eficiente en salud","Pilar 1 Igualdad de Calidad de Vida"]
[null,"Bogotá Mejor para Todos",10,"Modernización de la infraestructura física y tecnológica en salud","Pilar 1 Igualdad de Calidad de Vida"]
[null,"Bogotá Mejor para Todos",11,"Mejores oportunidades para el desarrollo a través de la cultura, la recreación y el deporte","Pilar 1 Igualdad de Calidad de Vida"]
[null,"Bogotá Mejor para Todos",12,"Mujeres protagonistas, activas y empoderadas en el cierre de brechas de género","Pilar 1 Igualdad de Calidad de Vida"]
[null,"Bogotá Mejor para Todos",13,"Infraestructura para el desarrollo del hábitat","Pilar 2 Democracía Urbana"]
[null,"Bogotá Mejor para Todos",14,"Intervenciones integrales del hábitat","Pilar 2 Democracía Urbana"]
[null,"Bogotá Mejor para Todos",15,"Recuperación, incorporación, vida urbana y control de la ilegalidad","Pilar 2 Democracía Urbana"]
[null,"Bogotá Mejor para Todos",16,"Integración social para una ciudad de oportunidades","Pilar 2 Democracía Urbana"]
[null,"Bogotá Mejor para Todos",17,"Espacio público, derecho de todos","Pilar 2 Democracía Urbana"]
[null,"Bogotá Mejor para Todos",18,"Mejor movilidad para todos","Pilar 2 Democracía Urbana"]
[null,"Bogotá Mejor para Todos",19,"Seguridad y convivencia para todos","Pilar 3 Construcción de Comunidad y Cultura Ciudadana"]
[null,"Bogotá Mejor para Todos",20,"Fortalecimiento del Sistema de Protección Integral a Mujeres Víctimas de Violencia - SOFIA","Pilar 3 Construcción de Comunidad y Cultura Ciudadana"]
[null,"Bogotá Mejor para Todos",21,"Justicia para todos: consolidación del Sistema Distrital de Justicia","Pilar 3 Construcción de Comunidad y Cultura Ciudadana"]
[null,"Bogotá Mejor para Todos",22,"Bogotá vive los derechos humanos","Pilar 3 Construcción de Comunidad y Cultura Ciudadana"]
[null,"Bogotá Mejor para Todos",23,"Bogotá mejor para las víctimas, la paz y la reconciliación","Pilar 3 Construcción de Comunidad y Cultura Ciudadana"]
[null,"Bogotá Mejor para Todos",24,"Equipo por la educación para el reencuentro, la reconciliación y la paz","Pilar 3 Construcción de Comunidad y Cultura Ciudadana"]
[null,"Bogotá Mejor para Todos",25,"Cambio cultural y construcción del tejido social para la vida","Pilar 3 Construcción de Comunidad y Cultura Ciudadana"]
[null,"Bogotá Mejor para Todos",26,"Información relevante e integral para la planeación territorial","Eje Transversal 1 Nuevo Ordenamiento Territorial"]
[null,"Bogotá Mejor para Todos",27,"Proyectos urbanos integrales con visión de ciudad","Eje Transversal 1 Nuevo Ordenamiento Territorial"]
[null,"Bogotá Mejor para Todos",28,"Suelo para reducir el déficit habitacional de suelo urbanizable, vivienda y soportes urbanos","Eje Transversal 1 Nuevo Ordenamiento Territorial"]
[null,"Bogotá Mejor para Todos",29,"Articulación regional y planeación integral del transporte","Eje Transversal 1 Nuevo Ordenamiento Territorial"]
[null,"Bogotá Mejor para Todos",30,"Financiación para el Desarrollo Territorial","Eje Transversal 1 Nuevo Ordenamiento Territorial"]
[null,"Bogotá Mejor para Todos",31,"Fundamentar el desarrollo económico en la generación y uso del conocimiento para mejorar la competitividad de la Ciudad Región","Eje Transversal 2 Desarrollo Económico basado en el conocimiento"]
[null,"Bogotá Mejor para Todos",32,"Generar alternativas de ingreso y empleo de mejor calidad","Eje Transversal 2 Desarrollo Económico basado en el conocimiento"]
[null,"Bogotá Mejor para Todos",33,"Elevar la eficiencia de los mercados de la ciudad","Eje Transversal 2 Desarrollo Económico basado en el conocimiento"]
[null,"Bogotá Mejor para Todos",34,"Mejorar y fortalecer el recaudo tributario de la ciudad e impulsar el uso de mecanismos de vinculación de capital privado","Eje Transversal 2 Desarrollo Económico basado en el conocimiento"]
[null,"Bogotá Mejor para Todos",35,"Bogotá, ciudad inteligente","Eje Transversal 2 Desarrollo Económico basado en el conocimiento"]
[null,"Bogotá Mejor para Todos",36,"Bogotá, una ciudad digital","Eje Transversal 2 Desarrollo Económico basado en el conocimiento"]
[null,"Bogotá Mejor para Todos",37,"Consolidar el turismo como factor de desarrollo, confianza y felicidad para Bogotá Región","Eje Transversal 2 Desarrollo Económico basado en el conocimiento"]
[null,"Bogotá Mejor para Todos",38,"Recuperación y manejo de la Estructura Ecológica Principal","Eje Transversal 3 Sostenibilidad Ambiental basada en la eficiencia energética"]
[null,"Bogotá Mejor para Todos",39,"Ambiente sano para la equidad y disfrute del ciudadano","Eje Transversal 3 Sostenibilidad Ambiental basada en la eficiencia energética"]
[null,"Bogotá Mejor para Todos",40,"Gestión de la huella ambiental urbana","Eje Transversal 3 Sostenibilidad Ambiental basada en la eficiencia energética"]
[null,"Bogotá Mejor para Todos",41,"Desarrollo rural sostenible","Eje Transversal 3 Sostenibilidad Ambiental basada en la eficiencia energética"]
[null,"Bogotá Mejor para Todos",42,"Transparencia, gestión pública y servicio a la ciudadanía","Eje Transversal 4 Gobierno Legitimo, Fortalecimiento Local y Eficiencia"]
[null,"Bogotá Mejor para Todos",43,"Modernización institucional","Eje Transversal 4 Gobierno Legitimo, Fortalecimiento Local y Eficiencia"]
[null,"Bogotá Mejor para Todos",44,"Gobierno y ciudadanía digital","Eje Transversal 4 Gobierno Legitimo, Fortalecimiento Local y Eficiencia"]
[null,"Bogotá Mejor para Todos",45,"Gobernanza e influencia local, regional e internacional","Eje Transversal 4 Gobierno Legitimo, Fortalecimiento Local y Eficiencia"]
["Acuerdo 761 2020","Un Nuevo Contrato Social y Ambiental para la Bogotá del Siglo XXI","1.","Subsidios y transferencias para la equidad","Propósito 1: Hacer un nuevo contrato social para incrementar la inclusión social, productiva y política"]
["Pag. 51","Un Nuevo Contrato Social y Ambiental para la Bogotá del Siglo XXI","2.","Igualdad de oportunidades y desarrollo de capacidades para las mujeres","Propósito 1: Hacer un nuevo contrato social para incrementar la inclusión social, productiva y política"]
[null,"Un Nuevo Contrato Social y Ambiental para la Bogotá del Siglo XXI","3.","Movilidad social integral","Propósito 1: Hacer un nuevo contrato social para incrementar la inclusión social, productiva y política"]
[null,"Un Nuevo Contrato Social y Ambiental para la Bogotá del Siglo XXI","4.","Prevención de la exclusión por razones étnicas, religiosas, sociales, políticas y de orientación sexual","Propósito 1: Hacer un nuevo contrato social para incrementar la inclusión social, productiva y política"]
[null,"Un Nuevo Contrato Social y Ambiental para la Bogotá del Siglo XXI","5.","Promoción de la igualdad, el desarrollo de capacidades y el reconocimiento de las mujeres","Propósito 1: Hacer un nuevo contrato social para incrementar la inclusión social, productiva y política"]
[null,"Un Nuevo Contrato Social y Ambiental para la Bogotá del Siglo XXI","6.","Sistema Distrital de Cuidado","Propósito 1: Hacer un nuevo contrato social para incrementar la inclusión social, productiva y política"]
[null,"Un Nuevo Contrato Social y Ambiental para la Bogotá del Siglo XXI","7.","Mejora de la gestión de instituciones de salud","Propósito 1: Hacer un nuevo contrato social para incrementar la inclusión social, productiva y política"]
[null,"Un Nuevo Contrato Social y Ambiental para la Bogotá del Siglo XXI","8.","Prevención y atención de maternidad temprana","Propósito 1: Hacer un nuevo contrato social para incrementar la inclusión social, productiva y política"]
[null,"Un Nuevo Contrato Social y Ambiental para la Bogotá del Siglo XXI","9.","Prevención y cambios para mejorar la salud de la población","Propósito 1: Hacer un nuevo contrato social para incrementar la inclusión social, productiva y política"]
[null,"Un Nuevo Contrato Social y Ambiental para la Bogotá del Siglo XXI","10.","Salud para la vida y el bienestar","Propósito 1: Hacer un nuevo contrato social para incrementar la inclusión social, productiva y política"]
[null,"Un Nuevo Contrato Social y Ambiental para la Bogotá del Siglo XXI","11.","Salud y bienestar para niñas y niños","Propósito 1: Hacer un nuevo contrato social para incrementar la inclusión social, productiva y política"]
[null,"Un Nuevo Contrato Social y Ambiental para la Bogotá del Siglo XXI","12.","Educación inicial: Bases sólidas para la vida.","Propósito 1: Hacer un nuevo contrato social para incrementar la inclusión social, productiva y política"]
[null,"Un Nuevo Contrato Social y Ambiental para la Bogotá del Siglo XXI","13.","Educación para todos y todas: acceso y permanencia con equidad y énfasis en educación rural","Propósito 1: Hacer un nuevo contrato social para incrementar la inclusión social, productiva y política"]
[null,"Un Nuevo Contrato Social y Ambiental para la Bogotá del Siglo XXI","14.","Formación integral: más y mejor tiempo en los colegios","Propósito 1: Hacer un nuevo contrato social para incrementar la inclusión social, productiva y política"]
[null,"Un Nuevo Contrato Social y Ambiental para la Bogotá del Siglo XXI","15.","Plan Distrital de Lectura, Escritura y Oralidad: \"Leer para la vida\"","Propósito 1: Hacer un nuevo contrato social para incrementar la inclusión social, productiva y política"]
[null,"Un Nuevo Contrato Social y Ambiental para la Bogotá del Siglo XXI","16.","Transformación pedagógica y mejoramiento de la gestión educativa. Es con los maestros y maestras.","Propósito 1: Hacer un nuevo contrato social para incrementar la inclusión social, productiva y política"]
[null,"Un Nuevo Contrato Social y Ambiental para la Bogotá del Siglo XXI","17.","Jóvenes con capacidades: Proyecto de vida para la ciudadanía, la innovación y el trabajo del siglo XXI","Propósito 1: Hacer un nuevo contrato social para incrementar la inclusión social, productiva y política"]
[null,"Un Nuevo Contrato Social y Ambiental para la Bogotá del Siglo XXI","18.","Cierre de brechas para la inclusión productiva urbano rural","Propósito 1: Hacer un nuevo contrato social para incrementar la inclusión social, productiva y política"]
[null,"Un Nuevo Contrato Social y Ambiental para la Bogotá del Siglo XXI","19.","Vivienda y entornos dignos en el territorio urbano y rural","Propósito 1: Hacer un nuevo contrato social para incrementar la inclusión social, productiva y política"]
[null,"Un Nuevo Contrato Social y Ambiental para la Bogotá del Siglo XXI","20.","Bogotá, referente en cultura, deporte, recreación y actividad física, con parques para el desarrollo y la salud","Propósito 1: Hacer un nuevo contrato social para incrementar la inclusión social, productiva y política"]
[null,"Un Nuevo Contrato Social y Ambiental para la Bogotá del Siglo XXI","21.","Creación y vida cotidiana: Apropiación ciudadana del arte, la cultura y el patrimonio, para la democracia cultural","Propósito 1: Hacer un nuevo contrato social para incrementar la inclusión social, productiva y política"]
[null,"Un Nuevo Contrato Social y Ambiental para la Bogotá del Siglo XXI","22.","Transformación cultural para la conciencia ambiental y el cuidado de la fauna doméstica","Propósito 1: Hacer un nuevo contrato social para incrementar la inclusión social, productiva y política"]
[null,"Un Nuevo Contrato Social y Ambiental para la Bogotá del Siglo XXI","23.","Bogotá rural","Propósito 1: Hacer un nuevo contrato social para incrementar la inclusión social, productiva y política"]
[null,"Un Nuevo Contrato Social y Ambiental para la Bogotá del Siglo XXI","24.","Bogotá región emprendedora e innovadora","Propósito 1: Hacer un nuevo contrato social para incrementar la inclusión social, productiva y política"]
[null,"Un Nuevo Contrato Social y Ambiental para la Bogotá del Siglo XXI","25.","Bogotá región productiva y competitiva","Propósito 1: Hacer un nuevo contrato social para incrementar la inclusión social, productiva y política"]
[null,"Un Nuevo Contrato Social y Ambiental para la Bogotá del Siglo XXI","26.","Bogotá - región, el mejor destino para visitar","Propósito 1: Hacer un nuevo contrato social para incrementar la inclusión social, productiva y política"]
[null,"Un Nuevo Contrato Social y Ambiental para la Bogotá del Siglo XXI","27.","Cambio cultural para la gestión de la crisis climática","Propósito 2 : Cambiar Nuestros Hábitos de Vida para Reverdecer a Bogotá y Adaptarnos y Mitigar la Crisis Climática"]
[null,"Un Nuevo Contrato Social y Ambiental para la Bogotá del Siglo XXI","28.","Bogotá protectora de sus recursos naturales","Propósito 2 : Cambiar Nuestros Hábitos de Vida para Reverdecer a Bogotá y Adaptarnos y Mitigar la Crisis Climática"]
[null,"Un Nuevo Contrato Social y Ambiental para la Bogotá del Siglo XXI","29.","Asentamientos y entornos protectores","Propósito 2 : Cambiar Nuestros Hábitos de Vida para Reverdecer a Bogotá y Adaptarnos y Mitigar la Crisis Climática"]
[null,"Un Nuevo Contrato Social y Ambiental para la Bogotá del Siglo XXI","30.","Eficiencia en la atención de emergencias","Propósito 2 : Cambiar Nuestros Hábitos de Vida para Reverdecer a Bogotá y Adaptarnos y Mitigar la Crisis Climática"]
[null,"Un Nuevo Contrato Social y Ambiental para la Bogotá del Siglo XXI","31."," Protección y valoración del patrimonio tangible e intangible en Bogotá y la región","Propósito 2 : Cambiar Nuestros Hábitos de Vida para Reverdecer a Bogotá y Adaptarnos y Mitigar la Crisis Climática"]
[null,"Un Nuevo Contrato Social y Ambiental para la Bogotá del Siglo XXI","32.","Revitalización urbana para la competitividad","Propósito 2 : Cambiar Nuestros Hábitos de Vida para Reverdecer a Bogotá y Adaptarnos y Mitigar la Crisis Climática"]
[null,"Un Nuevo Contrato Social y Ambiental para la Bogotá del Siglo XXI","33.","Más árboles y más y mejor espacio público","Propósito 2 : Cambiar Nuestros Hábitos de Vida para Reverdecer a Bogotá y Adaptarnos y Mitigar la Crisis Climática"]
[null,"Un Nuevo Contrato Social y Ambiental para la Bogotá del Siglo XXI","34.","Bogotá protectora de los animales","Propósito 2 : Cambiar Nuestros Hábitos de Vida para Reverdecer a Bogotá y Adaptarnos y Mitigar la Crisis Climática"]
[null,"Un Nuevo Contrato Social y Ambiental para la Bogotá del Siglo XXI","35.","Manejo y prevención de contaminación","Propósito 2 : Cambiar Nuestros Hábitos de Vida para Reverdecer a Bogotá y Adaptarnos y Mitigar la Crisis Climática"]
[null,"Un Nuevo Contrato Social y Ambiental para la Bogotá del Siglo XXI","36.","Manejo y saneamiento de los cuerpos de agua","Propósito 2 : Cambiar Nuestros Hábitos de Vida para Reverdecer a Bogotá y Adaptarnos y Mitigar la Crisis Climática"]
[null,"Un Nuevo Contrato Social y Ambiental para la Bogotá del Siglo XXI","37.","Provisión y mejoramiento de servicios públicos","Propósito 2 : Cambiar Nuestros Hábitos de Vida para Reverdecer a Bogotá y Adaptarnos y Mitigar la Crisis Climática"]
[null,"Un Nuevo Contrato Social y Ambiental para la Bogotá del Siglo XXI","38.","Ecoeficiencia, reciclaje, manejo de residuos e inclusión de la población recicladora","Propósito 2 : Cambiar Nuestros Hábitos de Vida para Reverdecer a Bogotá y Adaptarnos y Mitigar la Crisis Climática"]
[null,"Un Nuevo Contrato Social y Ambiental para la Bogotá del Siglo XXI","39.","Bogotá territorio de paz y atención integral a las víctimas del conflicto armado","Propósito 3: Inspirar confianza y legitimidad para vivir sin miedo y ser epicentro de cultura ciudadana, paz y reconciliación"]
[null,"Un Nuevo Contrato Social y Ambiental para la Bogotá del Siglo XXI","40.","Más mujeres viven una vida libre de violencias, se sienten seguras y acceden con confianza al sistema de justicia","Propósito 3: Inspirar confianza y legitimidad para vivir sin miedo y ser epicentro de cultura ciudadana, paz y reconciliación"]
[null,"Un Nuevo Contrato Social y Ambiental para la Bogotá del Siglo XXI","41.","Sin machismo ni violencias contra las mujeres, las niñas y los niños","Propósito 3: Inspirar confianza y legitimidad para vivir sin miedo y ser epicentro de cultura ciudadana, paz y reconciliación"]
[null,"Un Nuevo Contrato Social y Ambiental para la Bogotá del Siglo XXI","42.","Conciencia y cultura ciudadana para la seguridad, la convivencia y la construcción de confianza","Propósito 3: Inspirar confianza y legitimidad para vivir sin miedo y ser epicentro de cultura ciudadana, paz y reconciliación"]
[null,"Un Nuevo Contrato Social y Ambiental para la Bogotá del Siglo XXI","43.","Cultura ciudadana para la confianza, la convivencia y la participación desde la vida cotidiana","Propósito 3: Inspirar confianza y legitimidad para vivir sin miedo y ser epicentro de cultura ciudadana, paz y reconciliación"]
[null,"Un Nuevo Contrato Social y Ambiental para la Bogotá del Siglo XXI","44.","Autoconciencia, respeto y cuidado en el espacio público","Propósito 3: Inspirar confianza y legitimidad para vivir sin miedo y ser epicentro de cultura ciudadana, paz y reconciliación"]
[null,"Un Nuevo Contrato Social y Ambiental para la Bogotá del Siglo XXI","45.","Espacio público más seguro y construido colectivamente","Propósito 3: Inspirar confianza y legitimidad para vivir sin miedo y ser epicentro de cultura ciudadana, paz y reconciliación"]
[null,"Un Nuevo Contrato Social y Ambiental para la Bogotá del Siglo XXI","46.","Atención a jóvenes y adultos infractores con impacto en su proyecto de vida","Propósito 3: Inspirar confianza y legitimidad para vivir sin miedo y ser epicentro de cultura ciudadana, paz y reconciliación"]
[null,"Un Nuevo Contrato Social y Ambiental para la Bogotá del Siglo XXI","47.","Calidad de Vida y Derechos de la Población privada de la libertad","Propósito 3: Inspirar confianza y legitimidad para vivir sin miedo y ser epicentro de cultura ciudadana, paz y reconciliación"]
[null,"Un Nuevo Contrato Social y Ambiental para la Bogotá del Siglo XXI","48.","Plataforma institucional para la seguridad y justicia","Propósito 3: Inspirar confianza y legitimidad para vivir sin miedo y ser epicentro de cultura ciudadana, paz y reconciliación"]
[null,"Un Nuevo Contrato Social y Ambiental para la Bogotá del Siglo XXI","49.","Movilidad segura, sostenible y accesible","Propósito 4: Hacer de Bogotá Región un modelo de movilidad multimodal, incluyente y sostenible"]
[null,"Un Nuevo Contrato Social y Ambiental para la Bogotá del Siglo XXI","50.","Red de metros","Propósito 4: Hacer de Bogotá Región un modelo de movilidad multimodal, incluyente y sostenible"]
[null,"Un Nuevo Contrato Social y Ambiental para la Bogotá del Siglo XXI","51.","Gobierno Abierto","Propósito 5: Construir Bogotá - Región con gobierno abierto, transparente y ciudadanía consciente"]
[null,"Un Nuevo Contrato Social y Ambiental para la Bogotá del Siglo XXI","52.","Integración regional, distrital y local","Propósito 5: Construir Bogotá - Región con gobierno abierto, transparente y ciudadanía consciente"]
[null,"Un Nuevo Contrato Social y Ambiental para la Bogotá del Siglo XXI","53.","Información para la toma de decisiones","Propósito 5: Construir Bogotá - Región con gobierno abierto, transparente y ciudadanía consciente"]
[null,"Un Nuevo Contrato Social y Ambiental para la Bogotá del Siglo XXI","54.","Transformación digital y gestión de TIC para un territorio inteligente","Propósito 5: Construir Bogotá - Región con gobierno abierto, transparente y ciudadanía consciente"]
[null,"Un Nuevo Contrato Social y Ambiental para la Bogotá del Siglo XXI","55.","Fortalecimiento de cultura ciudadana y su institucionalidad","Propósito 5: Construir Bogotá - Región con gobierno abierto, transparente y ciudadanía consciente"]
[null,"Un Nuevo Contrato Social y Ambiental para la Bogotá del Siglo XXI","56.","Gestión pública efectiva","Propósito 5: Construir Bogotá - Región con gobierno abierto, transparente y ciudadanía consciente"]
[null,"Un Nuevo Contrato Social y Ambiental para la Bogotá del Siglo XXI","57.","Gestión pública local","Propósito 5: Construir Bogotá - Región con gobierno abierto, transparente y ciudadanía consciente"]