{"text_format":"1","workbook":"xlsx","n_sheets":5,"sheets":["T_Verificacion","RESUMEN","1. INFORMACION ACUMULADA","Proposito_programa","Tipo"],"not_rendered":{"charts":0,"images":1,"macros":1,"external_links":0,"defined_names":14,"comments":0,"pivot_tables":2},"unopened":[],"bounds":{"document_bytes":16777216,"sheet_cells":100000,"rows_first":2000,"rows_last":500,"rows_between":2000,"halvings":0,"cell_chars":16384,"cell_head_chars":4096},"cells_cut":0,"cells_raw":0,"read":"whole","date_system":"1900"}

{"sheet":"T_Verificacion","index":0,"n_rows":36,"n_cols":3,"rows_kept":36,"cut":false,"hidden":true,"merged":[]}
["Afectación","Inversión"]
[]
[null,"Valores"]
["Número Proyecto","Suma de Valor Final ","Suma de Giros (Valor en pesos)"]
["O23011601010000002213",2631144035,2441120257]
["O23011601060000001653",4402000000,405796556]
["O23011601060000001656",944082964,0]
["O23011601060000001657",616102431,0]
["O23011601060000001658",2495678791,0]
["O23011601170000001642",3110586000,3110586000]
["O23011601200000001646",1338000000,0]
["O23011601210000001647",2677251936,1319470414]
["O23011601240000001649",690924245,0]
["O23011601240000001650",445954860,0]
["O23011602280000001661",300000000,0]
["O23011602300000001665",1688846893,364972700]
["O23011602330000001670",4022826678,665910454]
["O23011602340000001673",1000000000,0]
["O23011602380000001675",1228000000,0]
["O23011603390000001678",351411539,0]
{"$rows_left_out":17}
{"sheet":"RESUMEN","index":1,"n_rows":7,"n_cols":5,"rows_kept":7,"cut":false,"hidden":false,"merged":[]}
[]
[]
["Etiquetas de fila","Suma de Valor Inicial del contrato","Suma de Valor total de adiciones ","Suma de Valor Final ","Suma de Giros (Valor en pesos)"]
["Funcionamiento",2452256731,283334162,2735590893,2060102671]
["Inversión",70197346440.220001,5649431837,75846778277.220001,29851710204]
["Operación",81101344,null,81101344,0]
["Total general",72730704515.220001,5932765999,78663470514.220001,31911812875]

{"sheet":"1. INFORMACION ACUMULADA","index":2,"n_rows":501,"n_cols":40,"rows_kept":501,"cut":false,"hidden":false,"merged":[[11,2,11,3],[11,8,11,12],[11,15,11,20],[10,0,10,20],[8,34,8,35],[9,34,9,35],[10,28,10,33],[10,34,10,37],[10,21,10,27],[6,36,6,39],[7,36,7,39],[8,36,8,39],[9,36,9,39],[1,0,1,38],[2,0,2,38],[4,0,4,3],[4,8,4,10],[5,0,5,3],[5,8,5,10],[5,34,5,35],[5,36,5,39],[6,0,6,3],[6,8,6,10],[6,34,6,35],[7,34,7,35]]}
[]
["VEEDURIA DISTRITAL - INFORMACIÓN GESTION CONTRACTUAL"]
["DEL 1 DE ENERO AL 31 DE DICIEMBRE DE 2022"]
[]
["1. Entidad",null,null,null,"FONDO DE DESARROLLO LOCAL RAFAEL URIBE UIRBE ",null,null,"2. Sector","Gobierno"]
["3. Presupuesto Disponible Inversión Directa PREDIS (BOGDATA)",null,null,null,78696629188,null,null,"5. Presupuesto Disponible Funcionamiento PREDIS (BOGDATA)",2848614000,null,null,null,null,null,null,null,null,null,null,null,null,null,null,null,null,null,null,null,null,null,null,null,null,null,"7 Nombre de quien diligencia el formato",null,"Mónica Yamile Quevedo Correa"]
["4. Presupuesto Comprometido de Inversión Directa según PREDIS (BOGDATA)",null,null,null,75846778277,null,null,"6. Presupuesto Comprometido Funcionamiento según PREDIS (BOGDATA)",2735816993,null,null,null,null,null,null,null,null,null,null,null,null,null,null,null,null,null,null,null,null,null,null,null,null,null,"Cargo",null,"Profesional Contratación"]
[null,null,null,null,null,null,null,null,null,null,null,null,null,null,null,null,null,null,null,null,null,null,null,null,null,null,null,null,null,null,null,null,null,null,"Dependencia",null,"Contratación"]
[null,null,null,null,null,null,null,null,null,null,null,null,null,null,null,null,null,null,null,null,null,null,null,null,null,null,null,null,null,null,null,null,null,null,"Teléfono",null,3212327585]
[null,null,null,null,null,null,null,null,null,null,null,null,null,null,null,null,null,null,null,null,null,null,null,null,null,null,null,null,null,null,null,null,null,null,"Correo Electrónico",null,"monica.quevedo@gobiernobogota.gov.co"]
["1- INFORMACION GENERAL",null,null,null,null,null,null,null,null,null,null,null,null,null,null,null,null,null,null,null,null,"2- INFORMACION FINANCIERA",null,null,null,null,null,null,"3 - PLAZOS ",null,null,null,null,null,"4 CESION",null,null,null,"5. ESTADO","6. %  Avance y/o cumplimiento"]
[1,2,3,null,4,5,6,7,8,null,null,null,null,9,10,11,null,null,null,null,null,12,13,14,15,16,17,18,19,20,21,22,23,24,25,26,27,28,29,30]
["Número Contrato","Año","Número de proceso contractual \nSECOP","Link proceso SECOP","Tipo de contrato ","Modalidad de Selección","Procedimiento o causal","Objeto","Afectación","Plan de Desarrollo Distrital","Número Programa","Equivalencia número de programa","Propósito","Número Proyecto","Número de proponentes","Número  de Identificación del contratista\n(Cédula o NIT sin puntos, comas ni caracteres especiales y sin digito de verificación)","Nombre del contratista\n  (según el caso: nombres y apellidos o Razón social y Tipo societario)","Naturaleza Jurídica","Número  de Identificación del integrante del Consorcio o U.T.\n(Cédula o NIT sin puntos, comas ni caracteres especiales y sin digito de verificación)","Nombre del Integrante del Consorcio o U.T. y Tipo societario\n (Según el caso: nombres y apellidos o razón social y tipo societario)","% Participación (indicar solo el numero del porcentaje, sin caracteres especiales)","Vigencias futuras","Valor Inicial del contrato","Valor total reducciones \n(En valor negativo)","Número de adiciones","Valor total de adiciones ","Valor Final ","Giros (Valor en pesos)","Fecha de suscripción (DD/MM/AAAA)","Fecha de inicio (DD/MM/AAAA)","Fecha de terminación (DD/MM/AAAA)","Plazo en días","Número de prórrogas","Prorroga en días","Número  de Identificación del cesionario\n(NIT sin digito de verificación)","Nombre cesionario","Fecha cesión\n(DD/MM/AAAA)","Valor cesión","Estado","% Avance y/o Cumplimiento"]
[1,2022,"FDLRUU-CD-001-2022","https://Community.seCop.gov.Co/PubliC/Tendering/OpportunityDetail/Index?notiCeUID=CO1.NTC.2557430&isFromPubliCArea=True&isModal=False","Contratos de prestación de servicios profesionales y de apoyo a la gestión","Contratación directa","Prestación de servicios profesionales y de apoyo a la gestión, o para la ejecución de trabajos artísticos que sólo puedan encomendarse a determinadas personas naturales","EL CONTRATISTA SE OBLIGA A PRESTAR SUS SERVICIOS PROFESIONALES ESPECIALIZADOS PARA APOYAR LAS ACTIVIDADES JURÍDICAS Y EL ACOMPAÑAMIENTO, CONTROL, SEGUIMIENTO DE LA GESTIÓN CONTRACTUAL DE LA ALCALDÍA LOCAL DE RAFAEL URIBE URIBE","Inversión","Un nuevo contrato social y ambiental para la Bogotá del Siglo XXI",57,{"$f":"IF(ISERROR(VLOOKUP(K14,Proposito_programa!$C$2:$E$59,2,FALSE)),\" \",VLOOKUP(K14,Proposito_programa!$C$2:$E$59,2,FALSE))","v":"Gestión pública local"},{"$f":"IF(ISERROR(VLOOKUP(K14,Proposito_programa!$C$2:$E$59,3,FALSE)),\" \",VLOOKUP(K14,Proposito_programa!$C$2:$E$59,3,FALSE))","v":"Propósito 5: Construir Bogotá - Región con gobierno abierto, transparente y ciudadanía consciente"},"O23011605570000001697",1,1023888264,"MONICA DEL PILAR PARRA RANGEL","Persona Natural",null,null,null,null,80300000,null,1,10706667,{"$f":"+W14+X14+Z14","v":91006667},76406667,"2022-01-14","2022-01-17","2023-01-15",330,1,44,null,null,null,null,"Terminacion Anticipada",{"$f":"IF(ISERROR(AB14/AA14),\"-\",(AB14/AA14))","v":0.83957219310097353}]
[2,2022,"FDLRUU-CD-002-2022","https://Community.seCop.gov.Co/PubliC/Tendering/OpportunityDetail/Index?notiCeUID=CO1.NTC.2561126&isFromPubliCArea=True&isModal=False","Contratos de prestación de servicios profesionales y de apoyo a la gestión","Contratación directa","Prestación de servicios profesionales y de apoyo a la gestión, o para la ejecución de trabajos artísticos que sólo puedan encomendarse a determinadas personas naturales","PRESTAR LOS SERVICIOS PROFESIONALES PARA APOYAR AL DESPACHO DE LA ALCALDIA LOCAL DE RAFAEL URIBE URIBE EN TEMAS ECONÓMICOS Y ADMINISTRATIVOS PROPIOS DE LA GESTIÓN, ASI COMO, EN EL ANALISIS DE LOS DOCUMENTOS QUE SE LE ENCOMIENDEN, SEGUIMIENTO DE ESTRATEGIAS Y EMISIÓN DE LINEAMIENTOS QUE COADYUVEN AL FORTALECIMIENTO INSTITUCIONAL DE LA ALCALDIA LOCAL","Inversión","Un nuevo contrato social y ambiental para la Bogotá del Siglo XXI",57,{"$f":"IF(ISERROR(VLOOKUP(K15,Proposito_programa!$C$2:$E$59,2,FALSE)),\" \",VLOOKUP(K15,Proposito_programa!$C$2:$E$59,2,FALSE))","v":"Gestión pública local"},{"$f":"IF(ISERROR(VLOOKUP(K15,Proposito_programa!$C$2:$E$59,3,FALSE)),\" \",VLOOKUP(K15,Proposito_programa!$C$2:$E$59,3,FALSE))","v":"Propósito 5: Construir Bogotá - Región con gobierno abierto, transparente y ciudadanía consciente"},"O23011605570000001697",1,1015402942,"JAVIER ALEJANDRO ZUÑIGA ROJAS","Persona Natural",null,null,null,null,77440000,null,1,10325333,87765333,73685333,"2022-01-14","2022-01-17","2023-01-05",330,1,44,null,null,null,null,"Terminacion Anticipada",0.83957219190406307]
[3,2022,"FDLRUU-CD-003-2022","https://Community.seCop.gov.Co/PubliC/Tendering/OpportunityDetail/Index?notiCeUID=CO1.NTC.2579677&isFromPubliCArea=True&isModal=False\n","Contratos de prestación de servicios profesionales y de apoyo a la gestión","Contratación directa","Prestación de servicios profesionales y de apoyo a la gestión, o para la ejecución de trabajos artísticos que sólo puedan encomendarse a determinadas personas naturales","EL CONTRATISTA SE OBLIGA A PRESTAR SUS SERVICIOS PROFESIONALES PARA APOYAR LAS ACTIVIDADES JURÍDICAS DE LA GESTIÓN CONTRACTUAL EN TODAS LAS MODALIDADES Y ETAPAS PRECONTRACTUAL, CONTRACTUAL Y POSTCONTRACTUAL DEL ÁREA GESTIÓN DEL DESARROLLO LOCAL DE LA ALCALDÍA LOCAL DE RAFAEL URIBE URIBE.","Inversión","Un nuevo contrato social y ambiental para la Bogotá del Siglo XXI",57,{"$f":"IF(ISERROR(VLOOKUP(K16,Proposito_programa!$C$2:$E$59,2,FALSE)),\" \",VLOOKUP(K16,Proposito_programa!$C$2:$E$59,2,FALSE))","v":"Gestión pública local"},{"$f":"IF(ISERROR(VLOOKUP(K16,Proposito_programa!$C$2:$E$59,3,FALSE)),\" \",VLOOKUP(K16,Proposito_programa!$C$2:$E$59,3,FALSE))","v":"Propósito 5: Construir Bogotá - Región con gobierno abierto, transparente y ciudadanía consciente"},"O23011605570000001697",1,1033734844,"IVÁN DARÍO PACHÓN BARRETO","Persona Natural",null,null,null,null,75900000,null,1,10120000,86020000,72220000,"2022-01-17","2022-01-17","2023-01-30",330,1,44,null,null,null,null,"Terminado",0.83957219251336901]
[4,2022,"FDLRUU-CD-003-2022","https://Community.seCop.gov.Co/PubliC/Tendering/OpportunityDetail/Index?notiCeUID=CO1.NTC.2579677&isFromPubliCArea=True&isModal=False\n","Contratos de prestación de servicios profesionales y de apoyo a la gestión","Contratación directa","Prestación de servicios profesionales y de apoyo a la gestión, o para la ejecución de trabajos artísticos que sólo puedan encomendarse a determinadas personas naturales","\tPRESTAR SUS SERVICIOS PROFESIONALES PARA APOYAR LAS ACTIVIDADES JURÍDICAS DE LA GESTIÓN CONTRACTUAL EN TODAS LAS MODALIDADES Y ETAPAS PRECONTRACTUAL, CONTRACTUAL Y POSTCONTRACTUAL DEL ÁREA DE GESTIÓN DEL DESARROLLO LOCAL DE LA ALCALDÍA LOCAL DE RAFAEL URIBE URIBE","Inversión","Un nuevo contrato social y ambiental para la Bogotá del Siglo XXI",57,{"$f":"IF(ISERROR(VLOOKUP(K17,Proposito_programa!$C$2:$E$59,2,FALSE)),\" \",VLOOKUP(K17,Proposito_programa!$C$2:$E$59,2,FALSE))","v":"Gestión pública local"},{"$f":"IF(ISERROR(VLOOKUP(K17,Proposito_programa!$C$2:$E$59,3,FALSE)),\" \",VLOOKUP(K17,Proposito_programa!$C$2:$E$59,3,FALSE))","v":"Propósito 5: Construir Bogotá - Región con gobierno abierto, transparente y ciudadanía consciente"},"O23011605570000001697",1,1014222182,"JOAN DAVID FERRER JIMENEZ","Persona Natural",null,null,null,null,75900000,null,1,6900000,82800000,69000000,"2022-01-28","2022-02-01","2023-01-26",330,1,30,null,null,null,null,"Terminacion Anticipada",0.83333333333333337]
[5,2022,"FDLRUU-CD-003-2022","https://Community.seCop.gov.Co/PubliC/Tendering/OpportunityDetail/Index?notiCeUID=CO1.NTC.2579677&isFromPubliCArea=True&isModal=False\n","Contratos de prestación de servicios profesionales y de apoyo a la gestión","Contratación directa","Prestación de servicios profesionales y de apoyo a la gestión, o para la ejecución de trabajos artísticos que sólo puedan encomendarse a determinadas personas naturales","\tEL CONTRATISTA SE OBLIGA A PRESTAR SUS SERVICIOS PROFESIONALES PARA APOYAR LAS ACTIVIDADES JURÍDICAS DE LA GESTIÓN CONTRACTUAL EN TODAS LAS MODALIDADES Y ETAPAS PRECONTRACTUAL, CONTRACTUAL Y POSTCONTRACTUAL DEL ÁREA GESTIÓN DEL DESARROLLO LOCAL DE LA ALCALDÍA LOCAL DE RAFAEL URIBE URIBE","Inversión","Un nuevo contrato social y ambiental para la Bogotá del Siglo XXI",57,{"$f":"IF(ISERROR(VLOOKUP(K18,Proposito_programa!$C$2:$E$59,2,FALSE)),\" \",VLOOKUP(K18,Proposito_programa!$C$2:$E$59,2,FALSE))","v":"Gestión pública local"},{"$f":"IF(ISERROR(VLOOKUP(K18,Proposito_programa!$C$2:$E$59,3,FALSE)),\" \",VLOOKUP(K18,Proposito_programa!$C$2:$E$59,3,FALSE))","v":"Propósito 5: Construir Bogotá - Región con gobierno abierto, transparente y ciudadanía consciente"},"O23011605570000001697",1,1032375829,"KAREN DAYANA PATIÑO SAENZ","Persona Natural",null,null,null,null,75900000,null,1,6900000,82800000,69000000,"2022-01-27","2022-02-01","2023-01-22",330,1,30,null,null,null,null,"Terminacion Anticipada",0.83333333333333337]
[8,2022,"FDLRUU-CD-008-2022","https://Community.seCop.gov.Co/PubliC/Tendering/OpportunityDetail/Index?notiCeUID=CO1.NTC.2584662&isFromPubliCArea=True&isModal=False\n","Contratos de prestación de servicios profesionales y de apoyo a la gestión","Contratación directa","Prestación de servicios profesionales y de apoyo a la gestión, o para la ejecución de trabajos artísticos que sólo puedan encomendarse a determinadas personas naturales","EL CONTRATISTA SE OBLIGA A PRESTAR SUS SERVICIOS PROFESIONALES PARA APOYAR LA GESTIÓN CONTRATACTUAL EN SUS DIFERENTES ETAPAS AL ÁREA DE GESTIÓN DEL DESARROLLO DE LA ALCALDÍA LOCAL DE RAFAEL URIBE URIBE.","Inversión","Un nuevo contrato social y ambiental para la Bogotá del Siglo XXI",57,{"$f":"IF(ISERROR(VLOOKUP(K19,Proposito_programa!$C$2:$E$59,2,FALSE)),\" \",VLOOKUP(K19,Proposito_programa!$C$2:$E$59,2,FALSE))","v":"Gestión pública local"},{"$f":"IF(ISERROR(VLOOKUP(K19,Proposito_programa!$C$2:$E$59,3,FALSE)),\" \",VLOOKUP(K19,Proposito_programa!$C$2:$E$59,3,FALSE))","v":"Propósito 5: Construir Bogotá - Región con gobierno abierto, transparente y ciudadanía consciente"},"O23011605570000001697",1,80811353,"JOHN HENRY BOHORQUEZ","Persona Natural",null,null,null,null,59400000,null,1,7740000,67140000,56340000,"2022-01-17","2022-01-18","2023-01-30",330,1,43,null,null,null,null,"Terminado",0.83914209115281502]
[9,2022,"FDLRUU-CD-008-2022","https://Community.seCop.gov.Co/PubliC/Tendering/OpportunityDetail/Index?notiCeUID=CO1.NTC.2584662&isFromPubliCArea=True&isModal=False","Contratos de prestación de servicios profesionales y de apoyo a la gestión","Contratación directa","Prestación de servicios profesionales y de apoyo a la gestión, o para la ejecución de trabajos artísticos que sólo puedan encomendarse a determinadas personas naturales","EL CONTRATISTA SE OBLIGA A PRESTAR SUS SERVICIOS PROFESIONALES PARA APOYAR LA GESTIÓN CONTRATACTUAL EN SUS DIFERENTES ETAPAS AL ÁREA DE GESTIÓN DEL DESARROLLO DE LA ALCALDÍA LOCAL DE RAFAEL URIBE URIBE","Inversión","Un nuevo contrato social y ambiental para la Bogotá del Siglo XXI",57,{"$f":"IF(ISERROR(VLOOKUP(K20,Proposito_programa!$C$2:$E$59,2,FALSE)),\" \",VLOOKUP(K20,Proposito_programa!$C$2:$E$59,2,FALSE))","v":"Gestión pública local"},{"$f":"IF(ISERROR(VLOOKUP(K20,Proposito_programa!$C$2:$E$59,3,FALSE)),\" \",VLOOKUP(K20,Proposito_programa!$C$2:$E$59,3,FALSE))","v":"Propósito 5: Construir Bogotá - Región con gobierno abierto, transparente y ciudadanía consciente"},"O23011605570000001697",1,1121839556,"MILLER OSWALDO VILLAMIZAR ROJAS","Persona Natural",null,null,null,null,59400000,null,1,7560000,66960000,56160000,"2022-01-17","2022-01-19","2023-01-28",330,1,42,52726734,"ROSALBA VILLALOBOS VILLALOBOS","2022-08-31",40053334,"Terminacion anticipada",0.83870967741935487]
{"$rows_left_out":482}
{"sheet":"Proposito_programa","index":3,"n_rows":59,"n_cols":5,"rows_kept":59,"cut":false,"hidden":false,"merged":[]}
[]
[null,"PDD","No. Programa","Programa","Propósito"]
["Acuerdo 761 2020","Un Nuevo Contrato Social y Ambiental para la Bogotá del Siglo XXI",1,"Subsidios y transferencias para la equidad","Propósito 1: Hacer un nuevo contrato social para incrementar la inclusión social, productiva y política"]
["Pag. 51","Un Nuevo Contrato Social y Ambiental para la Bogotá del Siglo XXI",{"$f":"+C3+1","v":2},"Igualdad de oportunidades y desarrollo de capacidades para las mujeres","Propósito 1: Hacer un nuevo contrato social para incrementar la inclusión social, productiva y política"]
[null,"Un Nuevo Contrato Social y Ambiental para la Bogotá del Siglo XXI",{"$f":"+C4+1","v":3},"Movilidad social integral","Propósito 1: Hacer un nuevo contrato social para incrementar la inclusión social, productiva y política"]
[null,"Un Nuevo Contrato Social y Ambiental para la Bogotá del Siglo XXI",4,"Prevención de la exclusión por razones étnicas, religiosas, sociales, políticas y de orientación sexual","Propósito 1: Hacer un nuevo contrato social para incrementar la inclusión social, productiva y política"]
[null,"Un Nuevo Contrato Social y Ambiental para la Bogotá del Siglo XXI",5,"Promoción de la igualdad, el desarrollo de capacidades y el reconocimiento de las mujeres","Propósito 1: Hacer un nuevo contrato social para incrementar la inclusión social, productiva y política"]
[null,"Un Nuevo Contrato Social y Ambiental para la Bogotá del Siglo XXI",6,"Sistema Distrital de Cuidado","Propósito 1: Hacer un nuevo contrato social para incrementar la inclusión social, productiva y política"]
[null,"Un Nuevo Contrato Social y Ambiental para la Bogotá del Siglo XXI",7,"Mejora de la gestión de instituciones de salud","Propósito 1: Hacer un nuevo contrato social para incrementar la inclusión social, productiva y política"]
[null,"Un Nuevo Contrato Social y Ambiental para la Bogotá del Siglo XXI",8,"Prevención y atención de maternidad temprana","Propósito 1: Hacer un nuevo contrato social para incrementar la inclusión social, productiva y política"]
[null,"Un Nuevo Contrato Social y Ambiental para la Bogotá del Siglo XXI",9,"Prevención y cambios para mejorar la salud de la población","Propósito 1: Hacer un nuevo contrato social para incrementar la inclusión social, productiva y política"]
[null,"Un Nuevo Contrato Social y Ambiental para la Bogotá del Siglo XXI",10,"Salud para la vida y el bienestar","Propósito 1: Hacer un nuevo contrato social para incrementar la inclusión social, productiva y política"]
[null,"Un Nuevo Contrato Social y Ambiental para la Bogotá del Siglo XXI",11,"Salud y bienestar para niñas y niños","Propósito 1: Hacer un nuevo contrato social para incrementar la inclusión social, productiva y política"]
[null,"Un Nuevo Contrato Social y Ambiental para la Bogotá del Siglo XXI",12,"Educación inicial: Bases sólidas para la vida.","Propósito 1: Hacer un nuevo contrato social para incrementar la inclusión social, productiva y política"]
[null,"Un Nuevo Contrato Social y Ambiental para la Bogotá del Siglo XXI",13,"Educación para todos y todas: acceso y permanencia con equidad y énfasis en educación rural","Propósito 1: Hacer un nuevo contrato social para incrementar la inclusión social, productiva y política"]
[null,"Un Nuevo Contrato Social y Ambiental para la Bogotá del Siglo XXI",14,"Formación integral: más y mejor tiempo en los colegios","Propósito 1: Hacer un nuevo contrato social para incrementar la inclusión social, productiva y política"]
[null,"Un Nuevo Contrato Social y Ambiental para la Bogotá del Siglo XXI",15,"Plan Distrital de Lectura, Escritura y Oralidad: \"Leer para la vida\"","Propósito 1: Hacer un nuevo contrato social para incrementar la inclusión social, productiva y política"]
[null,"Un Nuevo Contrato Social y Ambiental para la Bogotá del Siglo XXI",16,"Transformación pedagógica y mejoramiento de la gestión educativa. Es con los maestros y maestras.","Propósito 1: Hacer un nuevo contrato social para incrementar la inclusión social, productiva y política"]
[null,"Un Nuevo Contrato Social y Ambiental para la Bogotá del Siglo XXI",17,"Jóvenes con capacidades: Proyecto de vida para la ciudadanía, la innovación y el trabajo del siglo XXI","Propósito 1: Hacer un nuevo contrato social para incrementar la inclusión social, productiva y política"]
[null,"Un Nuevo Contrato Social y Ambiental para la Bogotá del Siglo XXI",18,"Cierre de brechas para la inclusión productiva urbano rural","Propósito 1: Hacer un nuevo contrato social para incrementar la inclusión social, productiva y política"]
{"$rows_left_out":40}
{"sheet":"Tipo","index":4,"n_rows":67,"n_cols":5,"rows_kept":67,"cut":false,"hidden":true,"merged":[]}
[null,null,"Modalidad de Selección","afectacion","Naturaleza Jurídica"]
[1,null,"Concurso de méritos","Funcionamiento","Persona Natural"]
[2,null,"Contratación directa","Inversión","Persona Jurídica"]
[3,null,"Contratación mínima cuantia","Operación","Unión Temporal"]
[4,null,"Selección abreviada",null,"Consorcio"]
[5,null,"Licitación pública",null,"Sociedad con objeto único"]
[6,null,"Otros",null,"Persona jurídica extranjera"]
[7,null,"Régimen especial",null,"Sin ánimo de lucro"]
[8,null,null,null,"Cabildo indígena"]
[9,null,null,null,"Consejo comunitario de las comunidades negras"]
[10,null,"Selección abreviada",null,"Organizaciones de segundo nivel"]
[11,null,"Subasta inversa ",null,"Formas o expresiones organizativas, afrocolombianas, raizales y palenqueras"]
[12,null,"Bolsas de productos",null,"Organizaciones de base de comunidades negras "]
[13,null,"Acuerdo marco de precios ",null,"Asociaciones de autoridades tradicionales indígenas"]
[14,null,"Selección abreviada por menor cuantía "]
[15]
[16,null,"contratacion directa"]
[17,null,"Urgencia manifiesta"]
[18,null,"Contratación de empréstitos"]
[19,null,"Contratos interadministrativos"]
{"$rows_left_out":47}