{"text_format":"1","workbook":"xlsx","n_sheets":5,"sheets":["T_Verificacion","RESUMEN","1. INFORMACION ACUMULADA","Proposito_programa","Tipo"],"not_rendered":{"charts":0,"images":1,"macros":1,"external_links":0,"defined_names":14,"comments":0,"pivot_tables":2},"unopened":[],"bounds":{"document_bytes":16777216,"sheet_cells":100000,"rows_first":2000,"rows_last":500,"rows_between":2000,"halvings":0,"cell_chars":16384,"cell_head_chars":4096},"cells_cut":0,"cells_raw":0,"read":"whole","date_system":"1900"}

{"sheet":"T_Verificacion","index":0,"n_rows":36,"n_cols":3,"rows_kept":36,"cut":false,"hidden":true,"merged":[]}
["Afectación","Inversión"]
[]
[null,"Valores"]
["Número Proyecto","Suma de Valor Final ","Suma de Giros (Valor en pesos)"]
["O23011601010000002213",2631144035,2441120257]
["O23011601060000001653",4402000000,405796556]
["O23011601060000001656",944082964,0]
["O23011601060000001657",616102431,0]
["O23011601060000001658",2495678791,0]
["O23011601170000001642",3110586000,3110586000]
["O23011601200000001646",1338000000,0]
["O23011601210000001647",2677251936,1319470414]
["O23011601240000001649",690924245,0]
["O23011601240000001650",445954860,0]
["O23011602280000001661",300000000,0]
["O23011602300000001665",1688846893,364972700]
["O23011602330000001670",4022826678,665910454]
["O23011602340000001673",1000000000,0]
["O23011602380000001675",1228000000,0]
["O23011603390000001678",351411539,0]
["O23011603400000001679",1518249898,0]
["O23011603430000001680",1138036790,596553801]
["O23011603450000001681",817917876,474720000]
["O23011603480000001682",608000000,0]
["O23011603480000001684",1759983099,0]
["O23011605550000001689",1232253056,22960800]
["O23011605570000001697",7599444562,5965202368]
["O23011605570000001698",3436544767,2865575000]
["O23011601010000001636",11721749893,11447812164]
["O23011604490000001685",13026421215,170549401]
["O23011602330000001667",110000000,0]
["O23011601080000001659",499633086,0]
["O23011602270000001660",819995740,0]
["O23011601120000001639",2917737923.2200003,480289]
["O23011601140000001640",698000000,0]
["Total general",75846778277.220001,29851710204]

{"sheet":"RESUMEN","index":1,"n_rows":7,"n_cols":5,"rows_kept":7,"cut":false,"hidden":false,"merged":[]}
[]
[]
["Etiquetas de fila","Suma de Valor Inicial del contrato","Suma de Valor total de adiciones ","Suma de Valor Final ","Suma de Giros (Valor en pesos)"]
["Funcionamiento",2452256731,283334162,2735590893,2060102671]
["Inversión",70197346440.220001,5649431837,75846778277.220001,29851710204]
["Operación",81101344,null,81101344,0]
["Total general",72730704515.220001,5932765999,78663470514.220001,31911812875]

{"sheet":"1. INFORMACION ACUMULADA","index":2,"n_rows":501,"n_cols":40,"rows_kept":501,"cut":false,"hidden":false,"merged":[[11,2,11,3],[11,8,11,12],[11,15,11,20],[10,0,10,20],[8,34,8,35],[9,34,9,35],[10,28,10,33],[10,34,10,37],[10,21,10,27],[6,36,6,39],[7,36,7,39],[8,36,8,39],[9,36,9,39],[1,0,1,38],[2,0,2,38],[4,0,4,3],[4,8,4,10],[5,0,5,3],[5,8,5,10],[5,34,5,35],[5,36,5,39],[6,0,6,3],[6,8,6,10],[6,34,6,35],[7,34,7,35]]}
[]
["VEEDURIA DISTRITAL - INFORMACIÓN GESTION CONTRACTUAL"]
["DEL 1 DE ENERO AL 31 DE DICIEMBRE DE 2022"]
[]
["1. Entidad",null,null,null,"FONDO DE DESARROLLO LOCAL RAFAEL URIBE UIRBE ",null,null,"2. Sector","Gobierno"]
["3. Presupuesto Disponible Inversión Directa PREDIS (BOGDATA)",null,null,null,78696629188,null,null,"5. Presupuesto Disponible Funcionamiento PREDIS (BOGDATA)",2848614000,null,null,null,null,null,null,null,null,null,null,null,null,null,null,null,null,null,null,null,null,null,null,null,null,null,"7 Nombre de quien diligencia el formato",null,"Mónica Yamile Quevedo Correa"]
["4. Presupuesto Comprometido de Inversión Directa según PREDIS (BOGDATA)",null,null,null,75846778277,null,null,"6. Presupuesto Comprometido Funcionamiento según PREDIS (BOGDATA)",2735816993,null,null,null,null,null,null,null,null,null,null,null,null,null,null,null,null,null,null,null,null,null,null,null,null,null,"Cargo",null,"Profesional Contratación"]
[null,null,null,null,null,null,null,null,null,null,null,null,null,null,null,null,null,null,null,null,null,null,null,null,null,null,null,null,null,null,null,null,null,null,"Dependencia",null,"Contratación"]
[null,null,null,null,null,null,null,null,null,null,null,null,null,null,null,null,null,null,null,null,null,null,null,null,null,null,null,null,null,null,null,null,null,null,"Teléfono",null,3212327585]
[null,null,null,null,null,null,null,null,null,null,null,null,null,null,null,null,null,null,null,null,null,null,null,null,null,null,null,null,null,null,null,null,null,null,"Correo Electrónico",null,"monica.quevedo@gobiernobogota.gov.co"]
["1- INFORMACION GENERAL",null,null,null,null,null,null,null,null,null,null,null,null,null,null,null,null,null,null,null,null,"2- INFORMACION FINANCIERA",null,null,null,null,null,null,"3 - PLAZOS ",null,null,null,null,null,"4 CESION",null,null,null,"5. ESTADO","6. %  Avance y/o cumplimiento"]
[1,2,3,null,4,5,6,7,8,null,null,null,null,9,10,11,null,null,null,null,null,12,13,14,15,16,17,18,19,20,21,22,23,24,25,26,27,28,29,30]
["Número Contrato","Año","Número de proceso contractual \nSECOP","Link proceso SECOP","Tipo de contrato ","Modalidad de Selección","Procedimiento o causal","Objeto","Afectación","Plan de Desarrollo Distrital","Número Programa","Equivalencia número de programa","Propósito","Número Proyecto","Número de proponentes","Número  de Identificación del contratista\n(Cédula o NIT sin puntos, comas ni caracteres especiales y sin digito de verificación)","Nombre del contratista\n  (según el caso: nombres y apellidos o Razón social y Tipo societario)","Naturaleza Jurídica","Número  de Identificación del integrante del Consorcio o U.T.\n(Cédula o NIT sin puntos, comas ni caracteres especiales y sin digito de verificación)","Nombre del Integrante del Consorcio o U.T. y Tipo societario\n (Según el caso: nombres y apellidos o razón social y tipo societario)","% Participación (indicar solo el numero del porcentaje, sin caracteres especiales)","Vigencias futuras","Valor Inicial del contrato","Valor total reducciones \n(En valor negativo)","Número de adiciones","Valor total de adiciones ","Valor Final ","Giros (Valor en pesos)","Fecha de suscripción (DD/MM/AAAA)","Fecha de inicio (DD/MM/AAAA)","Fecha de terminación (DD/MM/AAAA)","Plazo en días","Número de prórrogas","Prorroga en días","Número  de Identificación del cesionario\n(NIT sin digito de verificación)","Nombre cesionario","Fecha cesión\n(DD/MM/AAAA)","Valor cesión","Estado","% Avance y/o Cumplimiento"]
[1,2022,"FDLRUU-CD-001-2022","https://Community.seCop.gov.Co/PubliC/Tendering/OpportunityDetail/Index?notiCeUID=CO1.NTC.2557430&isFromPubliCArea=True&isModal=False","Contratos de prestación de servicios profesionales y de apoyo a la gestión","Contratación directa","Prestación de servicios profesionales y de apoyo a la gestión, o para la ejecución de trabajos artísticos que sólo puedan encomendarse a determinadas personas naturales","EL CONTRATISTA SE OBLIGA A PRESTAR SUS SERVICIOS PROFESIONALES ESPECIALIZADOS PARA APOYAR LAS ACTIVIDADES JURÍDICAS Y EL ACOMPAÑAMIENTO, CONTROL, SEGUIMIENTO DE LA GESTIÓN CONTRACTUAL DE LA ALCALDÍA LOCAL DE RAFAEL URIBE URIBE","Inversión","Un nuevo contrato social y ambiental para la Bogotá del Siglo XXI",57,{"$f":"IF(ISERROR(VLOOKUP(K14,Proposito_programa!$C$2:$E$59,2,FALSE)),\" \",VLOOKUP(K14,Proposito_programa!$C$2:$E$59,2,FALSE))","v":"Gestión pública local"},{"$f":"IF(ISERROR(VLOOKUP(K14,Proposito_programa!$C$2:$E$59,3,FALSE)),\" \",VLOOKUP(K14,Proposito_programa!$C$2:$E$59,3,FALSE))","v":"Propósito 5: Construir Bogotá - Región con gobierno abierto, transparente y ciudadanía consciente"},"O23011605570000001697",1,1023888264,"MONICA DEL PILAR PARRA RANGEL","Persona Natural",null,null,null,null,80300000,null,1,10706667,{"$f":"+W14+X14+Z14","v":91006667},76406667,"2022-01-14","2022-01-17","2023-01-15",330,1,44,null,null,null,null,"Terminacion Anticipada",{"$f":"IF(ISERROR(AB14/AA14),\"-\",(AB14/AA14))","v":0.83957219310097353}]
[2,2022,"FDLRUU-CD-002-2022","https://Community.seCop.gov.Co/PubliC/Tendering/OpportunityDetail/Index?notiCeUID=CO1.NTC.2561126&isFromPubliCArea=True&isModal=False","Contratos de prestación de servicios profesionales y de apoyo a la gestión","Contratación directa","Prestación de servicios profesionales y de apoyo a la gestión, o para la ejecución de trabajos artísticos que sólo puedan encomendarse a determinadas personas naturales","PRESTAR LOS SERVICIOS PROFESIONALES PARA APOYAR AL DESPACHO DE LA ALCALDIA LOCAL DE RAFAEL URIBE URIBE EN TEMAS ECONÓMICOS Y ADMINISTRATIVOS PROPIOS DE LA GESTIÓN, ASI COMO, EN EL ANALISIS DE LOS DOCUMENTOS QUE SE LE ENCOMIENDEN, SEGUIMIENTO DE ESTRATEGIAS Y EMISIÓN DE LINEAMIENTOS QUE COADYUVEN AL FORTALECIMIENTO INSTITUCIONAL DE LA ALCALDIA LOCAL","Inversión","Un nuevo contrato social y ambiental para la Bogotá del Siglo XXI",57,{"$f":"IF(ISERROR(VLOOKUP(K15,Proposito_programa!$C$2:$E$59,2,FALSE)),\" \",VLOOKUP(K15,Proposito_programa!$C$2:$E$59,2,FALSE))","v":"Gestión pública local"},{"$f":"IF(ISERROR(VLOOKUP(K15,Proposito_programa!$C$2:$E$59,3,FALSE)),\" \",VLOOKUP(K15,Proposito_programa!$C$2:$E$59,3,FALSE))","v":"Propósito 5: Construir Bogotá - Región con gobierno abierto, transparente y ciudadanía consciente"},"O23011605570000001697",1,1015402942,"JAVIER ALEJANDRO ZUÑIGA ROJAS","Persona Natural",null,null,null,null,77440000,null,1,10325333,87765333,73685333,"2022-01-14","2022-01-17","2023-01-05",330,1,44,null,null,null,null,"Terminacion Anticipada",0.83957219190406307]
[3,2022,"FDLRUU-CD-003-2022","https://Community.seCop.gov.Co/PubliC/Tendering/OpportunityDetail/Index?notiCeUID=CO1.NTC.2579677&isFromPubliCArea=True&isModal=False\n","Contratos de prestación de servicios profesionales y de apoyo a la gestión","Contratación directa","Prestación de servicios profesionales y de apoyo a la gestión, o para la ejecución de trabajos artísticos que sólo puedan encomendarse a determinadas personas naturales","EL CONTRATISTA SE OBLIGA A PRESTAR SUS SERVICIOS PROFESIONALES PARA APOYAR LAS ACTIVIDADES JURÍDICAS DE LA GESTIÓN CONTRACTUAL EN TODAS LAS MODALIDADES Y ETAPAS PRECONTRACTUAL, CONTRACTUAL Y POSTCONTRACTUAL DEL ÁREA GESTIÓN DEL DESARROLLO LOCAL DE LA ALCALDÍA LOCAL DE RAFAEL URIBE URIBE.","Inversión","Un nuevo contrato social y ambiental para la Bogotá del Siglo XXI",57,{"$f":"IF(ISERROR(VLOOKUP(K16,Proposito_programa!$C$2:$E$59,2,FALSE)),\" \",VLOOKUP(K16,Proposito_programa!$C$2:$E$59,2,FALSE))","v":"Gestión pública local"},{"$f":"IF(ISERROR(VLOOKUP(K16,Proposito_programa!$C$2:$E$59,3,FALSE)),\" \",VLOOKUP(K16,Proposito_programa!$C$2:$E$59,3,FALSE))","v":"Propósito 5: Construir Bogotá - Región con gobierno abierto, transparente y ciudadanía consciente"},"O23011605570000001697",1,1033734844,"IVÁN DARÍO PACHÓN BARRETO","Persona Natural",null,null,null,null,75900000,null,1,10120000,86020000,72220000,"2022-01-17","2022-01-17","2023-01-30",330,1,44,null,null,null,null,"Terminado",0.83957219251336901]
[4,2022,"FDLRUU-CD-003-2022","https://Community.seCop.gov.Co/PubliC/Tendering/OpportunityDetail/Index?notiCeUID=CO1.NTC.2579677&isFromPubliCArea=True&isModal=False\n","Contratos de prestación de servicios profesionales y de apoyo a la gestión","Contratación directa","Prestación de servicios profesionales y de apoyo a la gestión, o para la ejecución de trabajos artísticos que sólo puedan encomendarse a determinadas personas naturales","\tPRESTAR SUS SERVICIOS PROFESIONALES PARA APOYAR LAS ACTIVIDADES JURÍDICAS DE LA GESTIÓN CONTRACTUAL EN TODAS LAS MODALIDADES Y ETAPAS PRECONTRACTUAL, CONTRACTUAL Y POSTCONTRACTUAL DEL ÁREA DE GESTIÓN DEL DESARROLLO LOCAL DE LA ALCALDÍA LOCAL DE RAFAEL URIBE URIBE","Inversión","Un nuevo contrato social y ambiental para la Bogotá del Siglo XXI",57,{"$f":"IF(ISERROR(VLOOKUP(K17,Proposito_programa!$C$2:$E$59,2,FALSE)),\" \",VLOOKUP(K17,Proposito_programa!$C$2:$E$59,2,FALSE))","v":"Gestión pública local"},{"$f":"IF(ISERROR(VLOOKUP(K17,Proposito_programa!$C$2:$E$59,3,FALSE)),\" \",VLOOKUP(K17,Proposito_programa!$C$2:$E$59,3,FALSE))","v":"Propósito 5: Construir Bogotá - Región con gobierno abierto, transparente y ciudadanía consciente"},"O23011605570000001697",1,1014222182,"JOAN DAVID FERRER JIMENEZ","Persona Natural",null,null,null,null,75900000,null,1,6900000,82800000,69000000,"2022-01-28","2022-02-01","2023-01-26",330,1,30,null,null,null,null,"Terminacion Anticipada",0.83333333333333337]
[5,2022,"FDLRUU-CD-003-2022","https://Community.seCop.gov.Co/PubliC/Tendering/OpportunityDetail/Index?notiCeUID=CO1.NTC.2579677&isFromPubliCArea=True&isModal=False\n","Contratos de prestación de servicios profesionales y de apoyo a la gestión","Contratación directa","Prestación de servicios profesionales y de apoyo a la gestión, o para la ejecución de trabajos artísticos que sólo puedan encomendarse a determinadas personas naturales","\tEL CONTRATISTA SE OBLIGA A PRESTAR SUS SERVICIOS PROFESIONALES PARA APOYAR LAS ACTIVIDADES JURÍDICAS DE LA GESTIÓN CONTRACTUAL EN TODAS LAS MODALIDADES Y ETAPAS PRECONTRACTUAL, CONTRACTUAL Y POSTCONTRACTUAL DEL ÁREA GESTIÓN DEL DESARROLLO LOCAL DE LA ALCALDÍA LOCAL DE RAFAEL URIBE URIBE","Inversión","Un nuevo contrato social y ambiental para la Bogotá del Siglo XXI",57,{"$f":"IF(ISERROR(VLOOKUP(K18,Proposito_programa!$C$2:$E$59,2,FALSE)),\" \",VLOOKUP(K18,Proposito_programa!$C$2:$E$59,2,FALSE))","v":"Gestión pública local"},{"$f":"IF(ISERROR(VLOOKUP(K18,Proposito_programa!$C$2:$E$59,3,FALSE)),\" \",VLOOKUP(K18,Proposito_programa!$C$2:$E$59,3,FALSE))","v":"Propósito 5: Construir Bogotá - Región con gobierno abierto, transparente y ciudadanía consciente"},"O23011605570000001697",1,1032375829,"KAREN DAYANA PATIÑO SAENZ","Persona Natural",null,null,null,null,75900000,null,1,6900000,82800000,69000000,"2022-01-27","2022-02-01","2023-01-22",330,1,30,null,null,null,null,"Terminacion Anticipada",0.83333333333333337]
[8,2022,"FDLRUU-CD-008-2022","https://Community.seCop.gov.Co/PubliC/Tendering/OpportunityDetail/Index?notiCeUID=CO1.NTC.2584662&isFromPubliCArea=True&isModal=False\n","Contratos de prestación de servicios profesionales y de apoyo a la gestión","Contratación directa","Prestación de servicios profesionales y de apoyo a la gestión, o para la ejecución de trabajos artísticos que sólo puedan encomendarse a determinadas personas naturales","EL CONTRATISTA SE OBLIGA A PRESTAR SUS SERVICIOS PROFESIONALES PARA APOYAR LA GESTIÓN CONTRATACTUAL EN SUS DIFERENTES ETAPAS AL ÁREA DE GESTIÓN DEL DESARROLLO DE LA ALCALDÍA LOCAL DE RAFAEL URIBE URIBE.","Inversión","Un nuevo contrato social y ambiental para la Bogotá del Siglo XXI",57,{"$f":"IF(ISERROR(VLOOKUP(K19,Proposito_programa!$C$2:$E$59,2,FALSE)),\" \",VLOOKUP(K19,Proposito_programa!$C$2:$E$59,2,FALSE))","v":"Gestión pública local"},{"$f":"IF(ISERROR(VLOOKUP(K19,Proposito_programa!$C$2:$E$59,3,FALSE)),\" \",VLOOKUP(K19,Proposito_programa!$C$2:$E$59,3,FALSE))","v":"Propósito 5: Construir Bogotá - Región con gobierno abierto, transparente y ciudadanía consciente"},"O23011605570000001697",1,80811353,"JOHN HENRY BOHORQUEZ","Persona Natural",null,null,null,null,59400000,null,1,7740000,67140000,56340000,"2022-01-17","2022-01-18","2023-01-30",330,1,43,null,null,null,null,"Terminado",0.83914209115281502]
[9,2022,"FDLRUU-CD-008-2022","https://Community.seCop.gov.Co/PubliC/Tendering/OpportunityDetail/Index?notiCeUID=CO1.NTC.2584662&isFromPubliCArea=True&isModal=False","Contratos de prestación de servicios profesionales y de apoyo a la gestión","Contratación directa","Prestación de servicios profesionales y de apoyo a la gestión, o para la ejecución de trabajos artísticos que sólo puedan encomendarse a determinadas personas naturales","EL CONTRATISTA SE OBLIGA A PRESTAR SUS SERVICIOS PROFESIONALES PARA APOYAR LA GESTIÓN CONTRATACTUAL EN SUS DIFERENTES ETAPAS AL ÁREA DE GESTIÓN DEL DESARROLLO DE LA ALCALDÍA LOCAL DE RAFAEL URIBE URIBE","Inversión","Un nuevo contrato social y ambiental para la Bogotá del Siglo XXI",57,{"$f":"IF(ISERROR(VLOOKUP(K20,Proposito_programa!$C$2:$E$59,2,FALSE)),\" \",VLOOKUP(K20,Proposito_programa!$C$2:$E$59,2,FALSE))","v":"Gestión pública local"},{"$f":"IF(ISERROR(VLOOKUP(K20,Proposito_programa!$C$2:$E$59,3,FALSE)),\" \",VLOOKUP(K20,Proposito_programa!$C$2:$E$59,3,FALSE))","v":"Propósito 5: Construir Bogotá - Región con gobierno abierto, transparente y ciudadanía consciente"},"O23011605570000001697",1,1121839556,"MILLER OSWALDO VILLAMIZAR ROJAS","Persona Natural",null,null,null,null,59400000,null,1,7560000,66960000,56160000,"2022-01-17","2022-01-19","2023-01-28",330,1,42,52726734,"ROSALBA VILLALOBOS VILLALOBOS","2022-08-31",40053334,"Terminacion anticipada",0.83870967741935487]
[10,2022,"FDLRUU-CD-008-2022","https://Community.seCop.gov.Co/PubliC/Tendering/OpportunityDetail/Index?notiCeUID=CO1.NTC.2584662&isFromPubliCArea=True&isModal=False","Contratos de prestación de servicios profesionales y de apoyo a la gestión","Contratación directa","Prestación de servicios profesionales y de apoyo a la gestión, o para la ejecución de trabajos artísticos que sólo puedan encomendarse a determinadas personas naturales","EL CONTRATISTA SE OBLIGA A PRESTAR SUS SERVICIOS PROFESIONALES PARA APOYAR LA GESTIÓN CONTRATACTUAL EN SUS DIFERENTES ETAPAS AL ÁREA DE GESTIÓN DEL DESARROLLO DE LA ALCALDÍA LOCAL DE RAFAEL URIBE URIBE","Inversión","Un nuevo contrato social y ambiental para la Bogotá del Siglo XXI",57,{"$f":"IF(ISERROR(VLOOKUP(K21,Proposito_programa!$C$2:$E$59,2,FALSE)),\" \",VLOOKUP(K21,Proposito_programa!$C$2:$E$59,2,FALSE))","v":"Gestión pública local"},{"$f":"IF(ISERROR(VLOOKUP(K21,Proposito_programa!$C$2:$E$59,3,FALSE)),\" \",VLOOKUP(K21,Proposito_programa!$C$2:$E$59,3,FALSE))","v":"Propósito 5: Construir Bogotá - Región con gobierno abierto, transparente y ciudadanía consciente"},"O23011605570000001697",1,80041654,"LUIS ALEJANDRO MORENO RUEDA","Persona Natural",null,null,null,null,59400000,null,1,7200000,66600000,55800000,"2022-01-17","2022-01-21","2023-01-24",330,1,40,null,null,null,null,"Terminacion anticipada",0.83783783783783783]
[11,2022,"FDLRUU-CD-008-2022","https://Community.seCop.gov.Co/PubliC/Tendering/OpportunityDetail/Index?notiCeUID=CO1.NTC.2584662&isFromPubliCArea=True&isModal=False","Contratos de prestación de servicios profesionales y de apoyo a la gestión","Contratación directa","Prestación de servicios profesionales y de apoyo a la gestión, o para la ejecución de trabajos artísticos que sólo puedan encomendarse a determinadas personas naturales","EL CONTRATISTA SE OBLIGA A PRESTAR SUS SERVICIOS PROFESIONALES PARA APOYAR LA GESTIÓN CONTRATACTUAL EN SUS DIFERENTES ETAPAS AL ÁREA DE GESTIÓN DEL DESARROLLO DE LA ALCALDÍA LOCAL DE RAFAEL URIBE URIBE.","Inversión","Un nuevo contrato social y ambiental para la Bogotá del Siglo XXI",57,{"$f":"IF(ISERROR(VLOOKUP(K22,Proposito_programa!$C$2:$E$59,2,FALSE)),\" \",VLOOKUP(K22,Proposito_programa!$C$2:$E$59,2,FALSE))","v":"Gestión pública local"},{"$f":"IF(ISERROR(VLOOKUP(K22,Proposito_programa!$C$2:$E$59,3,FALSE)),\" \",VLOOKUP(K22,Proposito_programa!$C$2:$E$59,3,FALSE))","v":"Propósito 5: Construir Bogotá - Región con gobierno abierto, transparente y ciudadanía consciente"},"O23011605570000001697",1,79917967,"JOHAN FARID PARRA ARRIETA","Persona Natural",null,null,null,null,59400000,null,1,6300000,65700000,54900000,"2022-01-24","2022-01-26","2023-01-30",330,1,35,null,null,null,null,"Terminado",0.83561643835616439]
[12,2022,"FDLRUU-CD-008-2022","https://Community.seCop.gov.Co/PubliC/Tendering/OpportunityDetail/Index?notiCeUID=CO1.NTC.2584662&isFromPubliCArea=True&isModal=False","Contratos de prestación de servicios profesionales y de apoyo a la gestión","Contratación directa","Prestación de servicios profesionales y de apoyo a la gestión, o para la ejecución de trabajos artísticos que sólo puedan encomendarse a determinadas personas naturales","EL CONTRATISTA SE OBLIGA A PRESTAR SUS SERVICIOS PROFESIONALES PARA APOYAR LA GESTIÓN CONTRATACTUAL EN SUS DIFERENTES ETAPAS AL ÁREA DE GESTIÓN DEL DESARROLLO DE LA ALCALDÍA LOCAL DE RAFAEL URIBE URIBE.","Inversión","Un nuevo contrato social y ambiental para la Bogotá del Siglo XXI",57,{"$f":"IF(ISERROR(VLOOKUP(K23,Proposito_programa!$C$2:$E$59,2,FALSE)),\" \",VLOOKUP(K23,Proposito_programa!$C$2:$E$59,2,FALSE))","v":"Gestión pública local"},{"$f":"IF(ISERROR(VLOOKUP(K23,Proposito_programa!$C$2:$E$59,3,FALSE)),\" \",VLOOKUP(K23,Proposito_programa!$C$2:$E$59,3,FALSE))","v":"Propósito 5: Construir Bogotá - Región con gobierno abierto, transparente y ciudadanía consciente"},"O23011605570000001697",1,1030610164,"BRAHAN EDUARDO GARCIA LOPEZ","Persona Natural",null,null,null,null,59400000,null,1,5400000,64800000,{"$f":"2340000+AL23","v":50940000},"2022-01-27","2022-02-01","2023-01-30",330,1,30,80001279,"SERGIO FERNEY ROMERO CARRILLO","2022-11-18",48600000,"Terminado",0.78611111111111109]
[13,2022,"FDLRUU-CD-013-2022","https://Community.seCop.gov.Co/PubliC/Tendering/OpportunityDetail/Index?notiCeUID=CO1.NTC.2588502&isFromPubliCArea=True&isModal=False\n","Contratos de prestación de servicios profesionales y de apoyo a la gestión","Contratación directa","Prestación de servicios profesionales y de apoyo a la gestión, o para la ejecución de trabajos artísticos que sólo puedan encomendarse a determinadas personas naturales","PRESTAR LOS SERVICIOS PROFESIONALES PARA APOYAR LA REVISIÓN Y/O ELABORACIÓN DE LOS DOCUMENTOS Y GESTIONES PROVENIENTES DE LAS DIFERENTES ÁREAS RELACIONADAS CON TEMAS ADMINISTRATIVOS CONTABLES Y FINANCIEROS DE LOS PROCESOS Y CONTRATOS DEL FONDO DE DESARROLLO LOCAL DE RAFAEL URIBE URIBE","Inversión","Un nuevo contrato social y ambiental para la Bogotá del Siglo XXI",57,{"$f":"IF(ISERROR(VLOOKUP(K24,Proposito_programa!$C$2:$E$59,2,FALSE)),\" \",VLOOKUP(K24,Proposito_programa!$C$2:$E$59,2,FALSE))","v":"Gestión pública local"},{"$f":"IF(ISERROR(VLOOKUP(K24,Proposito_programa!$C$2:$E$59,3,FALSE)),\" \",VLOOKUP(K24,Proposito_programa!$C$2:$E$59,3,FALSE))","v":"Propósito 5: Construir Bogotá - Región con gobierno abierto, transparente y ciudadanía consciente"},"O23011605570000001697",1,53077157,"MONICA YAMILE QUEVEDO CORREA","Persona Natural",null,null,null,null,75900000,null,1,2760000,78660000,71760000,"2022-01-17","2022-01-19","2022-12-31",330,1,12,null,null,null,null,"Terminado",0.91228070175438591]
[14,2022,"FDLRUU-CD-014-2022","https://Community.seCop.gov.Co/PubliC/Tendering/OpportunityDetail/Index?notiCeUID=CO1.NTC.2588474&isFromPubliCArea=True&isModal=False\n","Contratos de prestación de servicios profesionales y de apoyo a la gestión","Contratación directa","Prestación de servicios profesionales y de apoyo a la gestión, o para la ejecución de trabajos artísticos que sólo puedan encomendarse a determinadas personas naturales","EL CONTRATISTA SE OBLIGA A PRESTAR SUS SERVICIOS PROFESIONALES EN LA CONSOLIDACION DE LA INFORMACION DE LA GESTIÓN CONTRACTUAL A CARGO DEL ÁREA DE GESTION DE DESARROLLO LOCAL DE LA ALCALDÍA LOCAL DE RAFAEL URIBE URIBE","Inversión","Un nuevo contrato social y ambiental para la Bogotá del Siglo XXI",57,{"$f":"IF(ISERROR(VLOOKUP(K25,Proposito_programa!$C$2:$E$59,2,FALSE)),\" \",VLOOKUP(K25,Proposito_programa!$C$2:$E$59,2,FALSE))","v":"Gestión pública local"},{"$f":"IF(ISERROR(VLOOKUP(K25,Proposito_programa!$C$2:$E$59,3,FALSE)),\" \",VLOOKUP(K25,Proposito_programa!$C$2:$E$59,3,FALSE))","v":"Propósito 5: Construir Bogotá - Región con gobierno abierto, transparente y ciudadanía consciente"},"O23011605570000001697",1,1018463623,"FABIO ALEXANDER ALZATE FRANCO","Persona Natural",null,null,null,null,59400000,null,1,7560000,66960000,56160000,"2022-01-17","2022-01-19","2023-01-17",330,1,42,null,null,null,null,"Terminacion Anticipada",0.83870967741935487]
[15,2022,"FDLRUU-CD-015-2022","https://Community.seCop.gov.Co/PubliC/Tendering/OpportunityDetail/Index?notiCeUID=CO1.NTC.2588342&isFromPubliCArea=True&isModal=False\n","Contratos de prestación de servicios profesionales y de apoyo a la gestión","Contratación directa","Prestación de servicios profesionales y de apoyo a la gestión, o para la ejecución de trabajos artísticos que sólo puedan encomendarse a determinadas personas naturales","PRESTAR LOS SERVICIOS PROFESIONALES EN EL ÁREA DE GESTIÓN DE DESARROLLO LOCAL APOYANDO LA GESTION, ANALISIS Y SEGUIMIENTO DE LA INFORMACIÓN FINANCIERA Y CONTABLE EN CUMPLIMIENTO AL MARCO NORMATIVO CONTABLE.","Inversión","Un nuevo contrato social y ambiental para la Bogotá del Siglo XXI",57,{"$f":"IF(ISERROR(VLOOKUP(K26,Proposito_programa!$C$2:$E$59,2,FALSE)),\" \",VLOOKUP(K26,Proposito_programa!$C$2:$E$59,2,FALSE))","v":"Gestión pública local"},{"$f":"IF(ISERROR(VLOOKUP(K26,Proposito_programa!$C$2:$E$59,3,FALSE)),\" \",VLOOKUP(K26,Proposito_programa!$C$2:$E$59,3,FALSE))","v":"Propósito 5: Construir Bogotá - Región con gobierno abierto, transparente y ciudadanía consciente"},"O23011605570000001697",1,1033762488,"TANIA XIMENA MORALES CASTIBLANCO","Persona Natural",null,null,null,null,50600000,null,1,6440000,57040000,47840000,"2022-01-17","2022-01-19","2023-01-22",330,1,42,null,null,null,null,"Terminacion Anticipada",0.83870967741935487]
[16,2022,"FDLRUU-CD-016-2022","https://Community.seCop.gov.Co/PubliC/Tendering/OpportunityDetail/Index?notiCeUID=CO1.NTC.2586339&isFromPubliCArea=True&isModal=False\n","Contratos de prestación de servicios profesionales y de apoyo a la gestión","Contratación directa","Prestación de servicios profesionales y de apoyo a la gestión, o para la ejecución de trabajos artísticos que sólo puedan encomendarse a determinadas personas naturales","EL CONTRATISTA SE OBLIGA A PRESTAR SUS SERVICIOS DE APOYO EN LAS ACTIVIDADES ADMINISTRATIVAS Y OPERATIVAS REQUERIDAS DENTRO DE LOS PROCESOS DE CONTRATACIÓN Y SOPORTE EN LA PLATAFORMA SECOP II EN EL ÁREA DE GESTIÓN DEL DESARROLLO LOCAL EN LA ALCALDÍA LOCAL DE RAFAEL URIBE URIBE","Inversión","Un nuevo contrato social y ambiental para la Bogotá del Siglo XXI",57,{"$f":"IF(ISERROR(VLOOKUP(K27,Proposito_programa!$C$2:$E$59,2,FALSE)),\" \",VLOOKUP(K27,Proposito_programa!$C$2:$E$59,2,FALSE))","v":"Gestión pública local"},{"$f":"IF(ISERROR(VLOOKUP(K27,Proposito_programa!$C$2:$E$59,3,FALSE)),\" \",VLOOKUP(K27,Proposito_programa!$C$2:$E$59,3,FALSE))","v":"Propósito 5: Construir Bogotá - Región con gobierno abierto, transparente y ciudadanía consciente"},"O23011605570000001697",1,1020839818,"PAULA NATALIA FARFAN PAEZ","Persona Natural",null,null,null,null,44000000,null,1,5733333,49733333,41733333,"2022-01-17","2022-01-18","2023-01-30",330,1,43,null,null,null,null,"Terminado",0.83914209007467888]
[17,2022,"FDLRUU-CD-017-2022","https://Community.seCop.gov.Co/PubliC/Tendering/OpportunityDetail/Index?notiCeUID=CO1.NTC.2590524&isFromPubliCArea=True&isModal=False","Contratos de prestación de servicios profesionales y de apoyo a la gestión","Contratación directa","Prestación de servicios profesionales y de apoyo a la gestión, o para la ejecución de trabajos artísticos que sólo puedan encomendarse a determinadas personas naturales","APOYAR ADMINISTRATIVA Y ASISTENCIALMENTE AL ÁREA DE GESTION DE DESARROLLO LOCAL  CONTRATACIÓN DE LA ALCALDÍA LOCAL DE RAFAEL URIBE URIBE","Inversión","Un nuevo contrato social y ambiental para la Bogotá del Siglo XXI",57,{"$f":"IF(ISERROR(VLOOKUP(K28,Proposito_programa!$C$2:$E$59,2,FALSE)),\" \",VLOOKUP(K28,Proposito_programa!$C$2:$E$59,2,FALSE))","v":"Gestión pública local"},{"$f":"IF(ISERROR(VLOOKUP(K28,Proposito_programa!$C$2:$E$59,3,FALSE)),\" \",VLOOKUP(K28,Proposito_programa!$C$2:$E$59,3,FALSE))","v":"Propósito 5: Construir Bogotá - Región con gobierno abierto, transparente y ciudadanía consciente"},"O23011605570000001697",1,1031170465,"MARIA ANGELICA VINCHIRA SANCHEZ","Persona Natural",null,null,null,null,29700000,null,1,3600000,33300000,27900000,"2022-01-17","2022-01-21","2023-01-23",330,1,40,null,null,null,null,"Terminacion Anticipada",0.83783783783783783]
[18,2022,"FDLRUU-CD-017-2022","https://Community.seCop.gov.Co/PubliC/Tendering/OpportunityDetail/Index?notiCeUID=CO1.NTC.2590524&isFromPubliCArea=True&isModal=False","Contratos de prestación de servicios profesionales y de apoyo a la gestión","Contratación directa","Prestación de servicios profesionales y de apoyo a la gestión, o para la ejecución de trabajos artísticos que sólo puedan encomendarse a determinadas personas naturales","APOYAR ADMINISTRATIVA Y ASISTENCIALMENTE AL ÁREA DE GESTION DE DESARROLLO LOCAL  CONTRATACIÓN DE LA ALCALDÍA LOCAL DE RAFAEL URIBE URIBE","Inversión","Un nuevo contrato social y ambiental para la Bogotá del Siglo XXI",57,{"$f":"IF(ISERROR(VLOOKUP(K29,Proposito_programa!$C$2:$E$59,2,FALSE)),\" \",VLOOKUP(K29,Proposito_programa!$C$2:$E$59,2,FALSE))","v":"Gestión pública local"},{"$f":"IF(ISERROR(VLOOKUP(K29,Proposito_programa!$C$2:$E$59,3,FALSE)),\" \",VLOOKUP(K29,Proposito_programa!$C$2:$E$59,3,FALSE))","v":"Propósito 5: Construir Bogotá - Región con gobierno abierto, transparente y ciudadanía consciente"},"O23011605570000001697",1,1094896721,"KARINE ROMAN PARDO","Persona Natural",null,null,null,null,29700000,null,1,3780000,33480000,28080000,"2022-01-17","2022-01-19","2023-01-30",330,1,42,null,null,null,null,"Terminado",0.83870967741935487]
[19,2022,"FDLRUU-CD-019-2022","https://Community.seCop.gov.Co/PubliC/Tendering/OpportunityDetail/Index?notiCeUID=CO1.NTC.2618333&isFromPubliCArea=True&isModal=False\n","Contratos de prestación de servicios profesionales y de apoyo a la gestión","Contratación directa","Prestación de servicios profesionales y de apoyo a la gestión, o para la ejecución de trabajos artísticos que sólo puedan encomendarse a determinadas personas naturales","PRESTAR LOS SERVICIOS ESPECIALIZADOS PARA APOYAR AL DESPACHO DE LA ALCALDÍA LOCAL DE RAFAEL URIBE URIBE EN EL DISEÑO DE ESTRATEGIAS Y EMISIÓN DE LINEAMIENTOS QUE COADYUVEN AL FORTALECIMIENTO INSTITUCIONAL ENTORNO A LAS ACTIVIDADES QUE REALIZA LA ALCALDÍA LOCAL EN SUS DIFERENTES DEPENDENCIAS","Inversión","Un nuevo contrato social y ambiental para la Bogotá del Siglo XXI",57,{"$f":"IF(ISERROR(VLOOKUP(K30,Proposito_programa!$C$2:$E$59,2,FALSE)),\" \",VLOOKUP(K30,Proposito_programa!$C$2:$E$59,2,FALSE))","v":"Gestión pública local"},{"$f":"IF(ISERROR(VLOOKUP(K30,Proposito_programa!$C$2:$E$59,3,FALSE)),\" \",VLOOKUP(K30,Proposito_programa!$C$2:$E$59,3,FALSE))","v":"Propósito 5: Construir Bogotá - Región con gobierno abierto, transparente y ciudadanía consciente"},"O23011605570000001697",1,67001801,"MARLYN CAROLINA RIVERA","Persona Natural",null,null,null,null,85800000,null,1,10400000,96200000,80600000,"2022-01-20","2022-01-21","2023-01-15",330,1,40,null,null,null,null,"Terminacion Anticipada",0.83783783783783783]
[20,2022,"FDLRUU-CD020-2022","https://Community.seCop.gov.Co/PubliC/Tendering/OpportunityDetail/Index?notiCeUID=CO1.NTC.2595789&isFromPubliCArea=True&isModal=False","Contratos de prestación de servicios profesionales y de apoyo a la gestión","Contratación directa","Prestación de servicios profesionales y de apoyo a la gestión, o para la ejecución de trabajos artísticos que sólo puedan encomendarse a determinadas personas naturales","APOYAR JURÍDICAMENTE LAS ACCIONES REQUERIDAS PARA LA DEPURACIÓN DE LAS ACTUACIONES ADMINISTRATIVAS QUE CURSAN EN LA ALCALDÍA LOCAL DE RAFAEL URIBE URIBE.","Inversión","Un nuevo contrato social y ambiental para la Bogotá del Siglo XXI",57,{"$f":"IF(ISERROR(VLOOKUP(K31,Proposito_programa!$C$2:$E$59,2,FALSE)),\" \",VLOOKUP(K31,Proposito_programa!$C$2:$E$59,2,FALSE))","v":"Gestión pública local"},{"$f":"IF(ISERROR(VLOOKUP(K31,Proposito_programa!$C$2:$E$59,3,FALSE)),\" \",VLOOKUP(K31,Proposito_programa!$C$2:$E$59,3,FALSE))","v":"Propósito 5: Construir Bogotá - Región con gobierno abierto, transparente y ciudadanía consciente"},"O23011605570000001698",1,52857075,"MONICA GOMEZ GUZMAN","Persona Natural",null,null,null,null,59400000,null,1,7380000,66780000,55980000,"2022-01-18","2022-01-20","2023-01-22",330,1,41,null,null,null,null,"Terminacion Anticipada",0.83827493261455521]
[21,2022,"FDLRUU-CD020-2022","https://Community.seCop.gov.Co/PubliC/Tendering/OpportunityDetail/Index?notiCeUID=CO1.NTC.2595789&isFromPubliCArea=True&isModal=False","Contratos de prestación de servicios profesionales y de apoyo a la gestión","Contratación directa","Prestación de servicios profesionales y de apoyo a la gestión, o para la ejecución de trabajos artísticos que sólo puedan encomendarse a determinadas personas naturales","APOYAR JURÍDICAMENTE LAS ACCIONES REQUERIDAS PARA LA DEPURACIÓN DE LAS ACTUACIONES ADMINISTRATIVAS QUE CURSAN EN LA ALCALDÍA LOCAL DE RAFAEL URIBE URIBE.","Inversión","Un nuevo contrato social y ambiental para la Bogotá del Siglo XXI",57,{"$f":"IF(ISERROR(VLOOKUP(K32,Proposito_programa!$C$2:$E$59,2,FALSE)),\" \",VLOOKUP(K32,Proposito_programa!$C$2:$E$59,2,FALSE))","v":"Gestión pública local"},{"$f":"IF(ISERROR(VLOOKUP(K32,Proposito_programa!$C$2:$E$59,3,FALSE)),\" \",VLOOKUP(K32,Proposito_programa!$C$2:$E$59,3,FALSE))","v":"Propósito 5: Construir Bogotá - Región con gobierno abierto, transparente y ciudadanía consciente"},"O23011605570000001698",1,79816247,"JOSE YIMMY MIRANDA ROCHA","Persona Natural",null,null,null,null,59400000,null,1,7380000,66780000,{"$f":"7560000+AL32","v":55980000},"2022-01-18","2022-01-20","2023-01-30",330,1,41,1101175034,"JESICA DAYANA PEÑA QUINTERO","2022-10-19",48420000,"Terminado",0.83827493261455521]
[22,2022,"FDLRUU-CD020-2022","https://Community.seCop.gov.Co/PubliC/Tendering/OpportunityDetail/Index?notiCeUID=CO1.NTC.2595789&isFromPubliCArea=True&isModal=False","Contratos de prestación de servicios profesionales y de apoyo a la gestión","Contratación directa","Prestación de servicios profesionales y de apoyo a la gestión, o para la ejecución de trabajos artísticos que sólo puedan encomendarse a determinadas personas naturales","APOYAR JURÍDICAMENTE LAS ACCIONES REQUERIDAS PARA LA DEPURACIÓN DE LAS ACTUACIONES ADMINISTRATIVAS QUE CURSAN EN LA ALCALDÍA LOCAL DE RAFAEL URIBE URIBE.","Inversión","Un nuevo contrato social y ambiental para la Bogotá del Siglo XXI",57,{"$f":"IF(ISERROR(VLOOKUP(K33,Proposito_programa!$C$2:$E$59,2,FALSE)),\" \",VLOOKUP(K33,Proposito_programa!$C$2:$E$59,2,FALSE))","v":"Gestión pública local"},{"$f":"IF(ISERROR(VLOOKUP(K33,Proposito_programa!$C$2:$E$59,3,FALSE)),\" \",VLOOKUP(K33,Proposito_programa!$C$2:$E$59,3,FALSE))","v":"Propósito 5: Construir Bogotá - Región con gobierno abierto, transparente y ciudadanía consciente"},"O23011605570000001698",1,52484426,"NUBIA ESPERANZA SANTAFE CASTELLANOS","Persona Natural",null,null,null,null,59400000,null,1,7200000,66600000,55800000,"2022-01-19","2022-01-21","2023-01-30",330,1,40,null,null,null,null,"Terminado",0.83783783783783783]
[23,2022,"FDLRUU-CD020-2022","https://Community.seCop.gov.Co/PubliC/Tendering/OpportunityDetail/Index?notiCeUID=CO1.NTC.2595789&isFromPubliCArea=True&isModal=False","Contratos de prestación de servicios profesionales y de apoyo a la gestión","Contratación directa","Prestación de servicios profesionales y de apoyo a la gestión, o para la ejecución de trabajos artísticos que sólo puedan encomendarse a determinadas personas naturales","APOYAR JURÍDICAMENTE LAS ACCIONES REQUERIDAS PARA LA DEPURACIÓN DE LAS ACTUACIONES ADMINISTRATIVAS QUE CURSAN EN LA ALCALDÍA LOCAL DE RAFAEL URIBE URIBE.\n","Inversión","Un nuevo contrato social y ambiental para la Bogotá del Siglo XXI",57,{"$f":"IF(ISERROR(VLOOKUP(K34,Proposito_programa!$C$2:$E$59,2,FALSE)),\" \",VLOOKUP(K34,Proposito_programa!$C$2:$E$59,2,FALSE))","v":"Gestión pública local"},{"$f":"IF(ISERROR(VLOOKUP(K34,Proposito_programa!$C$2:$E$59,3,FALSE)),\" \",VLOOKUP(K34,Proposito_programa!$C$2:$E$59,3,FALSE))","v":"Propósito 5: Construir Bogotá - Región con gobierno abierto, transparente y ciudadanía consciente"},"O23011605570000001698",1,1022402850,"WILMER JAVIER HERNANDEZ LASSO","Persona Natural",null,null,null,null,59400000,null,1,4860000,64260000,53460000,"2022-01-21","2022-02-04","2023-01-23",330,1,27,null,null,null,null,"Terminacion Anticipada",0.83193277310924374]
[24,2022,"FDLRUU-CD020-2022","https://Community.seCop.gov.Co/PubliC/Tendering/OpportunityDetail/Index?notiCeUID=CO1.NTC.2595789&isFromPubliCArea=True&isModal=False","Contratos de prestación de servicios profesionales y de apoyo a la gestión","Contratación directa","Prestación de servicios profesionales y de apoyo a la gestión, o para la ejecución de trabajos artísticos que sólo puedan encomendarse a determinadas personas naturales","APOYAR JURÍDICAMENTE LAS ACCIONES REQUERIDAS PARA LA DEPURACIÓN DE LAS ACTUACIONES ADMINISTRATIVAS QUE CURSAN EN LA ALCALDÍA LOCAL DE RAFAEL URIBE URIBE.\n","Inversión","Un nuevo contrato social y ambiental para la Bogotá del Siglo XXI",57,{"$f":"IF(ISERROR(VLOOKUP(K35,Proposito_programa!$C$2:$E$59,2,FALSE)),\" \",VLOOKUP(K35,Proposito_programa!$C$2:$E$59,2,FALSE))","v":"Gestión pública local"},{"$f":"IF(ISERROR(VLOOKUP(K35,Proposito_programa!$C$2:$E$59,3,FALSE)),\" \",VLOOKUP(K35,Proposito_programa!$C$2:$E$59,3,FALSE))","v":"Propósito 5: Construir Bogotá - Región con gobierno abierto, transparente y ciudadanía consciente"},"O23011605570000001698",1,79627943,"YUSED MAURICIO ROJAS TORRES","Persona Natural",null,null,null,null,26460000,null,null,null,26460000,26460000,"2022-01-21","2022-01-28","2022-06-25",330,null,null,null,null,null,null,"Terminacion Anticipada",1]
[25,2022,"FDLRUU-CD020-2022","https://Community.seCop.gov.Co/PubliC/Tendering/OpportunityDetail/Index?notiCeUID=CO1.NTC.2595789&isFromPubliCArea=True&isModal=False","Contratos de prestación de servicios profesionales y de apoyo a la gestión","Contratación directa","Prestación de servicios profesionales y de apoyo a la gestión, o para la ejecución de trabajos artísticos que sólo puedan encomendarse a determinadas personas naturales","APOYAR JURÍDICAMENTE LAS ACCIONES REQUERIDAS PARA LA DEPURACIÓN DE LAS ACTUACIONES ADMINISTRATIVAS QUE CURSAN EN LA ALCALDÍA LOCAL DE RAFAEL URIBE URIBE.\n","Inversión","Un nuevo contrato social y ambiental para la Bogotá del Siglo XXI",57,{"$f":"IF(ISERROR(VLOOKUP(K36,Proposito_programa!$C$2:$E$59,2,FALSE)),\" \",VLOOKUP(K36,Proposito_programa!$C$2:$E$59,2,FALSE))","v":"Gestión pública local"},{"$f":"IF(ISERROR(VLOOKUP(K36,Proposito_programa!$C$2:$E$59,3,FALSE)),\" \",VLOOKUP(K36,Proposito_programa!$C$2:$E$59,3,FALSE))","v":"Propósito 5: Construir Bogotá - Región con gobierno abierto, transparente y ciudadanía consciente"},"O23011605570000001698",1,1026250913," MARIA ALEJANDRA ARIAS MATEUS","Persona Natural",null,null,null,null,59400000,null,1,6300000,65700000,54900000,"2022-01-25","2022-01-26","2023-01-30",330,1,35,null,null,null,null,"Terminado",0.83561643835616439]
[26,2022,"FDLRUU-CD020-2022","https://Community.seCop.gov.Co/PubliC/Tendering/OpportunityDetail/Index?notiCeUID=CO1.NTC.2595789&isFromPubliCArea=True&isModal=False","Contratos de prestación de servicios profesionales y de apoyo a la gestión","Contratación directa","Prestación de servicios profesionales y de apoyo a la gestión, o para la ejecución de trabajos artísticos que sólo puedan encomendarse a determinadas personas naturales","APOYAR JURÍDICAMENTE LAS ACCIONES REQUERIDAS PARA LA DEPURACIÓN DE LAS ACTUACIONES ADMINISTRATIVAS QUE CURSAN EN LA ALCALDÍA LOCAL DE RAFAEL URIBE URIBE.\n","Inversión","Un nuevo contrato social y ambiental para la Bogotá del Siglo XXI",57,{"$f":"IF(ISERROR(VLOOKUP(K37,Proposito_programa!$C$2:$E$59,2,FALSE)),\" \",VLOOKUP(K37,Proposito_programa!$C$2:$E$59,2,FALSE))","v":"Gestión pública local"},{"$f":"IF(ISERROR(VLOOKUP(K37,Proposito_programa!$C$2:$E$59,3,FALSE)),\" \",VLOOKUP(K37,Proposito_programa!$C$2:$E$59,3,FALSE))","v":"Propósito 5: Construir Bogotá - Región con gobierno abierto, transparente y ciudadanía consciente"},"O23011605570000001698",1,51966940,"ALEYRA CAPERA RODRIGUEZ ","Persona Natural",null,null,null,null,59400000,null,1,5220000,64620000,53820000,"2022-01-28","2022-02-02","2023-01-23",330,1,29,null,null,null,null,"Terminacion Anticipada",0.83286908077994426]
[27,2022,"FDLRUU-CD020-2022","https://Community.seCop.gov.Co/PubliC/Tendering/OpportunityDetail/Index?notiCeUID=CO1.NTC.2595789&isFromPubliCArea=True&isModal=False","Contratos de prestación de servicios profesionales y de apoyo a la gestión","Contratación directa","Prestación de servicios profesionales y de apoyo a la gestión, o para la ejecución de trabajos artísticos que sólo puedan encomendarse a determinadas personas naturales","APOYAR JURÍDICAMENTE LAS ACCIONES REQUERIDAS PARA LA DEPURACIÓN DE LAS ACTUACIONES ADMINISTRATIVAS QUE CURSAN EN LA ALCALDÍA LOCAL DE RAFAEL URIBE URIBE.\n","Inversión","Un nuevo contrato social y ambiental para la Bogotá del Siglo XXI",57,{"$f":"IF(ISERROR(VLOOKUP(K38,Proposito_programa!$C$2:$E$59,2,FALSE)),\" \",VLOOKUP(K38,Proposito_programa!$C$2:$E$59,2,FALSE))","v":"Gestión pública local"},{"$f":"IF(ISERROR(VLOOKUP(K38,Proposito_programa!$C$2:$E$59,3,FALSE)),\" \",VLOOKUP(K38,Proposito_programa!$C$2:$E$59,3,FALSE))","v":"Propósito 5: Construir Bogotá - Región con gobierno abierto, transparente y ciudadanía consciente"},"O23011605570000001698",1,13958948,"JIMMY LEANDRO NAVARRETE QUINTERO","Persona Natural",null,null,null,null,59400000,null,1,5400000,64800000,48600000,"2022-01-27","2022-02-01","2023-01-30",330,1,30,null,null,null,null,"Terminado",0.75]
[28,2022,"FDLRUU-CD020-2022","https://Community.seCop.gov.Co/PubliC/Tendering/OpportunityDetail/Index?notiCeUID=CO1.NTC.2595789&isFromPubliCArea=True&isModal=False","Contratos de prestación de servicios profesionales y de apoyo a la gestión","Contratación directa","Prestación de servicios profesionales y de apoyo a la gestión, o para la ejecución de trabajos artísticos que sólo puedan encomendarse a determinadas personas naturales","APOYAR JURÍDICAMENTE LAS ACCIONES REQUERIDAS PARA LA DEPURACIÓN DE LAS ACTUACIONES ADMINISTRATIVAS QUE CURSAN EN LA ALCALDÍA LOCAL DE RAFAEL URIBE URIBE.\n","Inversión","Un nuevo contrato social y ambiental para la Bogotá del Siglo XXI",57,{"$f":"IF(ISERROR(VLOOKUP(K39,Proposito_programa!$C$2:$E$59,2,FALSE)),\" \",VLOOKUP(K39,Proposito_programa!$C$2:$E$59,2,FALSE))","v":"Gestión pública local"},{"$f":"IF(ISERROR(VLOOKUP(K39,Proposito_programa!$C$2:$E$59,3,FALSE)),\" \",VLOOKUP(K39,Proposito_programa!$C$2:$E$59,3,FALSE))","v":"Propósito 5: Construir Bogotá - Región con gobierno abierto, transparente y ciudadanía consciente"},"O23011605570000001698",1,1010173898,"DOMMY MARGARITA ESCORCIA OTERO","Persona Natural",null,null,null,null,59400000,null,null,null,59400000,27000000,"2022-01-28","2022-02-01","2022-07-19",330,null,null,null,null,null,null,"Terminacion Anticipada",0.45454545454545453]
[29,2022,"FDLRUU-CD020-2022","https://Community.seCop.gov.Co/PubliC/Tendering/OpportunityDetail/Index?notiCeUID=CO1.NTC.2595789&isFromPubliCArea=True&isModal=False","Contratos de prestación de servicios profesionales y de apoyo a la gestión","Contratación directa","Prestación de servicios profesionales y de apoyo a la gestión, o para la ejecución de trabajos artísticos que sólo puedan encomendarse a determinadas personas naturales","APOYAR JURÍDICAMENTE LAS ACCIONES REQUERIDAS PARA LA DEPURACIÓN DE LAS ACTUACIONES ADMINISTRATIVAS QUE CURSAN EN LA ALCALDÍA LOCAL DE RAFAEL URIBE URIBE.\n","Inversión","Un nuevo contrato social y ambiental para la Bogotá del Siglo XXI",57,{"$f":"IF(ISERROR(VLOOKUP(K40,Proposito_programa!$C$2:$E$59,2,FALSE)),\" \",VLOOKUP(K40,Proposito_programa!$C$2:$E$59,2,FALSE))","v":"Gestión pública local"},{"$f":"IF(ISERROR(VLOOKUP(K40,Proposito_programa!$C$2:$E$59,3,FALSE)),\" \",VLOOKUP(K40,Proposito_programa!$C$2:$E$59,3,FALSE))","v":"Propósito 5: Construir Bogotá - Región con gobierno abierto, transparente y ciudadanía consciente"},"O23011605570000001698",1,79569262,"JUAN ANTONIO ESPINOSA ACEVEDO","Persona Natural",null,null,null,null,59400000,null,1,5400000,64800000,54000000,"2022-01-28","2022-02-01","2023-01-22",330,1,30,null,null,null,null,"Terminacion Anticipada",0.83333333333333337]
[30,2022,"FDLRUU-CD-030-2022","https://Community.seCop.gov.Co/PubliC/Tendering/OpportunityDetail/Index?notiCeUID=CO1.NTC.2595538&isFromPubliCArea=True&isModal=False\n","Contratos de prestación de servicios profesionales y de apoyo a la gestión","Contratación directa","Prestación de servicios profesionales y de apoyo a la gestión, o para la ejecución de trabajos artísticos que sólo puedan encomendarse a determinadas personas naturales","PRESTACIÓN DE SERVICIOS PROFESIONALES EN EL AREA DE GESTION DE DESARROLLO LOCAL PARA APOYAR LAS ETAPAS PRECONTRACTUAL, CONTRACTUAL Y POSTCONTRACTUAL CONFORME A LO ESTABLECIDO EN LA LEY PARA LOS PROCESOS DE ADQUISICIÓN DE BIENES Y SERVICIOS POR PARTE DEL FONDO DE DESARROLLO LOCAL DE RAFAEL URIBE URIBE","Inversión","Un nuevo contrato social y ambiental para la Bogotá del Siglo XXI",57,{"$f":"IF(ISERROR(VLOOKUP(K41,Proposito_programa!$C$2:$E$59,2,FALSE)),\" \",VLOOKUP(K41,Proposito_programa!$C$2:$E$59,2,FALSE))","v":"Gestión pública local"},{"$f":"IF(ISERROR(VLOOKUP(K41,Proposito_programa!$C$2:$E$59,3,FALSE)),\" \",VLOOKUP(K41,Proposito_programa!$C$2:$E$59,3,FALSE))","v":"Propósito 5: Construir Bogotá - Región con gobierno abierto, transparente y ciudadanía consciente"},"O23011605570000001697",1,1022985336,"CRISTHIAN STEVENS VERA ESCOBAR","Persona Natural",null,null,null,null,68200000,null,1,8680000,76880000,64480000,"2022-01-18","2022-01-19","2023-01-17",330,1,42,null,null,null,null,"Terminacion Anticipada",0.83870967741935487]
[31,2022,"FDLRUU-CD-031-2022","https://Community.seCop.gov.Co/PubliC/Tendering/OpportunityDetail/Index?notiCeUID=CO1.NTC.2601664&isFromPubliCArea=True&isModal=False\n","Contratos de prestación de servicios profesionales y de apoyo a la gestión","Contratación directa","Prestación de servicios profesionales y de apoyo a la gestión, o para la ejecución de trabajos artísticos que sólo puedan encomendarse a determinadas personas naturales","APOYAR LA GESTIÓN DOCUMENTAL DE LA ALCALDÍA LOCAL DE RAFAEL URIBE URIBE EN LA IMPLEMENTACIÓN DE LOS PROCESOS DE CLASIFICACIÓN, ORDENACIÓN, SELECCIÓN NATURAL, FOLIACIÓN, IDENTIFICACIÓN, LEVANTAMIENTO DE INVENTARIOS, ALMACENAMIENTO Y APLICACIÓN DE PROTOCOLOS DE ELIMINACIÓN Y TRANSFERENCIAS DOCUMENTALES","Inversión","Un nuevo contrato social y ambiental para la Bogotá del Siglo XXI",57,{"$f":"IF(ISERROR(VLOOKUP(K42,Proposito_programa!$C$2:$E$59,2,FALSE)),\" \",VLOOKUP(K42,Proposito_programa!$C$2:$E$59,2,FALSE))","v":"Gestión pública local"},{"$f":"IF(ISERROR(VLOOKUP(K42,Proposito_programa!$C$2:$E$59,3,FALSE)),\" \",VLOOKUP(K42,Proposito_programa!$C$2:$E$59,3,FALSE))","v":"Propósito 5: Construir Bogotá - Región con gobierno abierto, transparente y ciudadanía consciente"},"O23011605570000001697",1,1193381360,"VALENTINA RODIRGUEZ CRUZ","Persona Natural",null,null,null,null,29700000,null,null,null,29700000,{"$f":"4500000+AL42","v":27540000},"2022-01-18","2022-01-25","2022-12-24",330,null,null,53049635,"JOHANA CONSTANZA CRUZ PRIETO","2022-10-10",23040000,"Terminado",0.92727272727272725]
[32,2022,"FDLRUU-CD-031-2022","https://Community.seCop.gov.Co/PubliC/Tendering/OpportunityDetail/Index?notiCeUID=CO1.NTC.2601664&isFromPubliCArea=True&isModal=False\n","Contratos de prestación de servicios profesionales y de apoyo a la gestión","Contratación directa","Prestación de servicios profesionales y de apoyo a la gestión, o para la ejecución de trabajos artísticos que sólo puedan encomendarse a determinadas personas naturales","APOYAR LA GESTIÓN DOCUMENTAL DE LA ALCALDÍA LOCAL DE RAFAEL URIBE URIBE EN LA IMPLEMENTACIÓN DE LOS PROCESOS DE CLASIFICACIÓN, ORDENACIÓN, SELECCIÓN NATURAL, FOLIACIÓN, IDENTIFICACIÓN, LEVANTAMIENTO DE INVENTARIOS, ALMACENAMIENTO Y APLICACIÓN DE PROTOCOLOS DE ELIMINACIÓN Y TRANSFERENCIA DOCUMENTALES.","Inversión","Un nuevo contrato social y ambiental para la Bogotá del Siglo XXI",57,{"$f":"IF(ISERROR(VLOOKUP(K43,Proposito_programa!$C$2:$E$59,2,FALSE)),\" \",VLOOKUP(K43,Proposito_programa!$C$2:$E$59,2,FALSE))","v":"Gestión pública local"},{"$f":"IF(ISERROR(VLOOKUP(K43,Proposito_programa!$C$2:$E$59,3,FALSE)),\" \",VLOOKUP(K43,Proposito_programa!$C$2:$E$59,3,FALSE))","v":"Propósito 5: Construir Bogotá - Región con gobierno abierto, transparente y ciudadanía consciente"},"O23011605570000001697",1,79806948,"OMAR ALEXANDER SALVADOR ROMERO","Persona Natural",null,null,null,null,29700000,null,1,3690000,33390000,27990000,"2022-01-19","2022-01-20","2023-01-30",330,1,41,null,null,null,null,"Terminado",0.83827493261455521]
[33,2022,"FDLRUU-CD-031-2022","https://Community.seCop.gov.Co/PubliC/Tendering/OpportunityDetail/Index?notiCeUID=CO1.NTC.2601664&isFromPubliCArea=True&isModal=False\n","Contratos de prestación de servicios profesionales y de apoyo a la gestión","Contratación directa","Prestación de servicios profesionales y de apoyo a la gestión, o para la ejecución de trabajos artísticos que sólo puedan encomendarse a determinadas personas naturales","APOYAR LA GESTIÓN DOCUMENTAL DE LA ALCALDÍA LOCAL DE RAFAEL URIBE URIBE EN LA IMPLEMENTACIÓN DE LOS PROCESOS DE CLASIFICACIÓN, ORDENACIÓN, SELECCIÓN NATURAL, FOLIACIÓN, IDENTIFICACIÓN, LEVANTAMIENTO DE INVENTARIOS, ALMACENAMIENTO Y APLICACIÓN DE PROTOCOLOS DE ELIMINACIÓN Y TRANSFERENCIA DOCUMENTALES","Inversión","Un nuevo contrato social y ambiental para la Bogotá del Siglo XXI",57,{"$f":"IF(ISERROR(VLOOKUP(K44,Proposito_programa!$C$2:$E$59,2,FALSE)),\" \",VLOOKUP(K44,Proposito_programa!$C$2:$E$59,2,FALSE))","v":"Gestión pública local"},{"$f":"IF(ISERROR(VLOOKUP(K44,Proposito_programa!$C$2:$E$59,3,FALSE)),\" \",VLOOKUP(K44,Proposito_programa!$C$2:$E$59,3,FALSE))","v":"Propósito 5: Construir Bogotá - Región con gobierno abierto, transparente y ciudadanía consciente"},"O23011605570000001697",1,19234849,"FABIO ALBERTO RINCON RUIZ","Persona Natural",null,null,null,null,29700000,null,1,3600000,33300000,27900000,"2022-01-19","2022-01-21","2023-01-22",330,1,40,null,null,null,null,"Terminacion Anticipada",0.83783783783783783]
[34,2022,"FDLRUU-CD-031-2022","https://Community.seCop.gov.Co/PubliC/Tendering/OpportunityDetail/Index?notiCeUID=CO1.NTC.2601664&isFromPubliCArea=True&isModal=False\n","Contratos de prestación de servicios profesionales y de apoyo a la gestión","Contratación directa","Prestación de servicios profesionales y de apoyo a la gestión, o para la ejecución de trabajos artísticos que sólo puedan encomendarse a determinadas personas naturales","APOYAR LA GESTIÓN DOCUMENTAL DE LA ALCALDÍA LOCAL DE RAFAEL URIBE URIBE EN LA IMPLEMENTACIÓN DE LOS PROCESOS DE CLASIFICACIÓN, ORDENACIÓN, SELECCIÓN NATURAL, FOLIACIÓN, IDENTIFICACIÓN, LEVANTAMIENTO DE INVENTARIOS, ALMACENAMIENTO Y APLICACIÓN DE PROTOCOLOS DE ELIMINACIÓN Y TRANSFERENCIA DOCUMENTALES","Inversión","Un nuevo contrato social y ambiental para la Bogotá del Siglo XXI",57,{"$f":"IF(ISERROR(VLOOKUP(K45,Proposito_programa!$C$2:$E$59,2,FALSE)),\" \",VLOOKUP(K45,Proposito_programa!$C$2:$E$59,2,FALSE))","v":"Gestión pública local"},{"$f":"IF(ISERROR(VLOOKUP(K45,Proposito_programa!$C$2:$E$59,3,FALSE)),\" \",VLOOKUP(K45,Proposito_programa!$C$2:$E$59,3,FALSE))","v":"Propósito 5: Construir Bogotá - Región con gobierno abierto, transparente y ciudadanía consciente"},"O23011605570000001697",1,51556234,"MARIA MERCEDES TAMAYO MEDINA","Persona Natural",null,null,null,null,29700000,null,null,null,29700000,26730000,"2022-01-21","2022-02-04","2023-01-03",330,null,null,null,null,null,null,"Terminado",0.9]
[35,2022,"FDLRUU-CD-031-2022","https://Community.seCop.gov.Co/PubliC/Tendering/OpportunityDetail/Index?notiCeUID=CO1.NTC.2601664&isFromPubliCArea=True&isModal=False\n","Contratos de prestación de servicios profesionales y de apoyo a la gestión","Contratación directa","Prestación de servicios profesionales y de apoyo a la gestión, o para la ejecución de trabajos artísticos que sólo puedan encomendarse a determinadas personas naturales","APOYAR LA GESTIÓN DOCUMENTAL DE LA ALCALDÍA LOCAL DE RAFAEL URIBE URIBE EN LA IMPLEMENTACIÓN DE LOS PROCESOS DE CLASIFICACIÓN, ORDENACIÓN, SELECCIÓN NATURAL, FOLIACIÓN, IDENTIFICACIÓN, LEVANTAMIENTO DE INVENTARIOS, ALMACENAMIENTO Y APLICACIÓN DE PROTOCOLOS DE ELIMINACIÓN Y TRANSFERENCIA DOCUMENTALES","Inversión","Un nuevo contrato social y ambiental para la Bogotá del Siglo XXI",57,{"$f":"IF(ISERROR(VLOOKUP(K46,Proposito_programa!$C$2:$E$59,2,FALSE)),\" \",VLOOKUP(K46,Proposito_programa!$C$2:$E$59,2,FALSE))","v":"Gestión pública local"},{"$f":"IF(ISERROR(VLOOKUP(K46,Proposito_programa!$C$2:$E$59,3,FALSE)),\" \",VLOOKUP(K46,Proposito_programa!$C$2:$E$59,3,FALSE))","v":"Propósito 5: Construir Bogotá - Región con gobierno abierto, transparente y ciudadanía consciente"},"O23011605570000001697",1,17654733,"JUAN CARLOS JIMENEZ MENESES","Persona Natural",null,null,null,null,29700000,null,1,3060000,32760000,27360000,"2022-01-26","2022-01-27","2023-01-26",330,1,34,null,null,null,null,"Terminacion Anticipada",0.8351648351648352]
[36,2022,"FDLRUU-CD-031-2022","https://Community.seCop.gov.Co/PubliC/Tendering/OpportunityDetail/Index?notiCeUID=CO1.NTC.2601664&isFromPubliCArea=True&isModal=False","Contratos de prestación de servicios profesionales y de apoyo a la gestión","Contratación directa","Prestación de servicios profesionales y de apoyo a la gestión, o para la ejecución de trabajos artísticos que sólo puedan encomendarse a determinadas personas naturales","APOYAR LA GESTIÓN DOCUMENTAL DE LA ALCALDÍA LOCAL DE RAFAEL URIBE URIBE EN LA IMPLEMENTACIÓN DE LOS PROCESOS DE CLASIFICACIÓN, ORDENACIÓN, SELECCIÓN NATURAL, FOLIACIÓN, IDENTIFICACIÓN, LEVANTAMIENTO DE INVENTARIOS, ALMACENAMIENTO Y APLICACIÓN DE PROTOCOLOS DE ELIMINACIÓN Y TRANSFERENCIAS DOCUMENTALES","Inversión","Un nuevo contrato social y ambiental para la Bogotá del Siglo XXI",57,{"$f":"IF(ISERROR(VLOOKUP(K47,Proposito_programa!$C$2:$E$59,2,FALSE)),\" \",VLOOKUP(K47,Proposito_programa!$C$2:$E$59,2,FALSE))","v":"Gestión pública local"},{"$f":"IF(ISERROR(VLOOKUP(K47,Proposito_programa!$C$2:$E$59,3,FALSE)),\" \",VLOOKUP(K47,Proposito_programa!$C$2:$E$59,3,FALSE))","v":"Propósito 5: Construir Bogotá - Región con gobierno abierto, transparente y ciudadanía consciente"},"O23011605570000001697",1,19487926,"JOSE GUILLERMO PINILLA RODRIGUEZ ","Persona Natural",null,null,null,null,29700000,null,1,2430000,32130000,26730000,"2022-01-28","2022-02-04","2023-01-19",330,1,27,null,null,null,null,"Terminacion Anticipada",0.83193277310924374]
[37,2022,"FDLRUU-CD-037-2022","https://Community.seCop.gov.Co/PubliC/Tendering/OpportunityDetail/Index?notiCeUID=CO1.NTC.2605523&isFromPubliCArea=True&isModal=False\n","Contratos de prestación de servicios profesionales y de apoyo a la gestión","Contratación directa","Prestación de servicios profesionales y de apoyo a la gestión, o para la ejecución de trabajos artísticos que sólo puedan encomendarse a determinadas personas naturales","PRESTAR LOS SERVICIOS PROFESIONALES AL DESPACHO DE LA ALCALDÍA LOCAL DE RAFAEL URIBE URIBE EN ACTIVIDADES DE ORDEN ADMINISTRATIVO Y DE GESTION QUE SE LE SOLICITEN","Inversión","Un nuevo contrato social y ambiental para la Bogotá del Siglo XXI",57,{"$f":"IF(ISERROR(VLOOKUP(K48,Proposito_programa!$C$2:$E$59,2,FALSE)),\" \",VLOOKUP(K48,Proposito_programa!$C$2:$E$59,2,FALSE))","v":"Gestión pública local"},{"$f":"IF(ISERROR(VLOOKUP(K48,Proposito_programa!$C$2:$E$59,3,FALSE)),\" \",VLOOKUP(K48,Proposito_programa!$C$2:$E$59,3,FALSE))","v":"Propósito 5: Construir Bogotá - Región con gobierno abierto, transparente y ciudadanía consciente"},"O23011605570000001697",1,52442869,"MATILDE DEL PILAR CAMARGO PINTO","Persona Natural",null,null,null,null,50600000,null,1,6133333,56733333,47533333,"2022-01-18","2022-01-21","2023-01-30",330,1,40,null,null,null,null,"Terminado",0.83783783688506364]
[38,2022,"FDLRUU-CD038-2021","https://Community.seCop.gov.Co/PubliC/Tendering/OpportunityDetail/Index?notiCeUID=CO1.NTC.2611856&isFromPubliCArea=True&isModal=False\n","Contratos de prestación de servicios profesionales y de apoyo a la gestión","Contratación directa","Prestación de servicios profesionales y de apoyo a la gestión, o para la ejecución de trabajos artísticos que sólo puedan encomendarse a determinadas personas naturales","APOYAR LAS LABORES DE ENTREGA Y RECIBO DE LAS COMUNICACIONES EMITIDAS O RECIBIDAS POR LAS INSPECCIONES DE POLICÍA DE LA LOCALIDAD","Inversión","Un nuevo contrato social y ambiental para la Bogotá del Siglo XXI",57,{"$f":"IF(ISERROR(VLOOKUP(K49,Proposito_programa!$C$2:$E$59,2,FALSE)),\" \",VLOOKUP(K49,Proposito_programa!$C$2:$E$59,2,FALSE))","v":"Gestión pública local"},{"$f":"IF(ISERROR(VLOOKUP(K49,Proposito_programa!$C$2:$E$59,3,FALSE)),\" \",VLOOKUP(K49,Proposito_programa!$C$2:$E$59,3,FALSE))","v":"Propósito 5: Construir Bogotá - Región con gobierno abierto, transparente y ciudadanía consciente"},"O23011605570000001698",1,79303323,"ALVARO CASTAÑEDA ALDANA","Persona Natural",null,null,null,null,27500000,null,1,2916667,30416667,25416667,"2022-01-19","2022-01-26","2023-01-30",330,1,35,null,null,null,null,"Terminado",0.83561644015762804]
[39,2022,"FDLRUU-CD-039-2022","https://Community.seCop.gov.Co/PubliC/Tendering/OpportunityDetail/Index?notiCeUID=CO1.NTC.2611434&isFromPubliCArea=True&isModal=False\n","Contratos de prestación de servicios profesionales y de apoyo a la gestión","Contratación directa","Prestación de servicios profesionales y de apoyo a la gestión, o para la ejecución de trabajos artísticos que sólo puedan encomendarse a determinadas personas naturales","PRESTAR SUS SERVICIOS ASISTENCIALES PARA LA GESTIÓN DEL RIESGO, EN EL MARCO DEL PROYECTO 1665 VIGÍAS DEL RIESGO DE LA LOCALIDAD DE RAFAEL URIBE URIBE , A LA LUZ DEL PLAN DE DESARROLLO 2021 2024 'UN NUEVO CONTRATO AMBIENTAL Y SOCIAL.","Inversión","Un nuevo contrato social y ambiental para la Bogotá del Siglo XXI",30,{"$f":"IF(ISERROR(VLOOKUP(K50,Proposito_programa!$C$2:$E$59,2,FALSE)),\" \",VLOOKUP(K50,Proposito_programa!$C$2:$E$59,2,FALSE))","v":"Eficiencia en la atención de emergencias"},{"$f":"IF(ISERROR(VLOOKUP(K50,Proposito_programa!$C$2:$E$59,3,FALSE)),\" \",VLOOKUP(K50,Proposito_programa!$C$2:$E$59,3,FALSE))","v":"Propósito 2 : Cambiar Nuestros Hábitos de Vida para Reverdecer a Bogotá y Adaptarnos y Mitigar la Crisis Climática"},"O23011602300000001665",1,80882081,"JEISSON CAMILO RAMIREZ MALAGÓN","Persona Natural",null,null,null,null,19800000,null,1,2400000,22200000,18600000,"2022-01-19","2022-01-21","2023-01-22",330,1,40,null,null,null,null,"Terminacion Anticipada",0.83783783783783783]
[40,2022,"FDLRUU-CD-039-2022","https://Community.seCop.gov.Co/PubliC/Tendering/OpportunityDetail/Index?notiCeUID=CO1.NTC.2611434&isFromPubliCArea=True&isModal=False\n","Contratos de prestación de servicios profesionales y de apoyo a la gestión","Contratación directa","Prestación de servicios profesionales y de apoyo a la gestión, o para la ejecución de trabajos artísticos que sólo puedan encomendarse a determinadas personas naturales","PRESTAR SUS SERVICIOS ASISTENCIALES PARA LA GESTIÓN DEL RIESGO, EN EL MARCO DEL PROYECTO 1665 VIGÍAS DEL RIESGO DE LA LOCALIDAD DE RAFAEL URIBE URIBE , A LA LUZ DEL PLAN DE DESARROLLO 2021 2024 'UN NUEVO CONTRATO AMBIENTAL Y SOCIAL.","Inversión","Un nuevo contrato social y ambiental para la Bogotá del Siglo XXI",30,{"$f":"IF(ISERROR(VLOOKUP(K51,Proposito_programa!$C$2:$E$59,2,FALSE)),\" \",VLOOKUP(K51,Proposito_programa!$C$2:$E$59,2,FALSE))","v":"Eficiencia en la atención de emergencias"},{"$f":"IF(ISERROR(VLOOKUP(K51,Proposito_programa!$C$2:$E$59,3,FALSE)),\" \",VLOOKUP(K51,Proposito_programa!$C$2:$E$59,3,FALSE))","v":"Propósito 2 : Cambiar Nuestros Hábitos de Vida para Reverdecer a Bogotá y Adaptarnos y Mitigar la Crisis Climática"},"O23011602300000001665",1,79742551,"WILSON HERNANDO ALFONSO MORENO ","Persona Natural",null,null,null,null,19800000,null,1,2220000,22020000,18420000,"2022-01-20","2022-01-24","2023-01-22",330,1,37,null,null,null,null,"Terminacion Anticipada",0.8365122615803815]
[41,2022,"FDLRUU-CD-039-2022","https://Community.seCop.gov.Co/PubliC/Tendering/OpportunityDetail/Index?notiCeUID=CO1.NTC.2611434&isFromPubliCArea=True&isModal=False\n","Contratos de prestación de servicios profesionales y de apoyo a la gestión","Contratación directa","Prestación de servicios profesionales y de apoyo a la gestión, o para la ejecución de trabajos artísticos que sólo puedan encomendarse a determinadas personas naturales","PRESTAR SUS SERVICIOS ASISTENCIALES PARA LA GESTIÓN DEL RIESGO, EN EL MARCO DEL PROYECTO 1665 VIGÍAS DEL RIESGO DE LA LOCALIDAD DE RAFAEL URIBE URIBE , A LA LUZ DEL PLAN DE DESARROLLO 2021 2024 'UN NUEVO CONTRATO AMBIENTAL Y SOCIAL.","Inversión","Un nuevo contrato social y ambiental para la Bogotá del Siglo XXI",30,{"$f":"IF(ISERROR(VLOOKUP(K52,Proposito_programa!$C$2:$E$59,2,FALSE)),\" \",VLOOKUP(K52,Proposito_programa!$C$2:$E$59,2,FALSE))","v":"Eficiencia en la atención de emergencias"},{"$f":"IF(ISERROR(VLOOKUP(K52,Proposito_programa!$C$2:$E$59,3,FALSE)),\" \",VLOOKUP(K52,Proposito_programa!$C$2:$E$59,3,FALSE))","v":"Propósito 2 : Cambiar Nuestros Hábitos de Vida para Reverdecer a Bogotá y Adaptarnos y Mitigar la Crisis Climática"},"O23011602300000001665",1,1024492481,"CAROLINA MENDOZA GUTIERREZ","Persona Natural",null,null,null,null,19800000,null,1,2040000,21840000,18240000,"2022-01-21","2022-01-27","2023-01-24",330,1,34,null,null,null,null,"Terminacion Anticipada",0.8351648351648352]
[42,2022,"FDLRUU-CD-039-2022","https://Community.seCop.gov.Co/PubliC/Tendering/OpportunityDetail/Index?notiCeUID=CO1.NTC.2611434&isFromPubliCArea=True&isModal=False","Contratos de prestación de servicios profesionales y de apoyo a la gestión","Contratación directa","Prestación de servicios profesionales y de apoyo a la gestión, o para la ejecución de trabajos artísticos que sólo puedan encomendarse a determinadas personas naturales","PRESTAR SUS SERVICIOS ASISTENCIALES PARA LA GESTIÓN DEL RIESGO, EN EL MARCO DEL PROYECTO 1665 VIGÍAS DEL RIESGO DE LA LOCALIDAD DE RAFAEL URIBE URIBE , A LA LUZ DEL PLAN DE DESARROLLO 2021 2024 'UN NUEVO CONTRATO AMBIENTAL Y SOCIAL.","Inversión","Un nuevo contrato social y ambiental para la Bogotá del Siglo XXI",30,{"$f":"IF(ISERROR(VLOOKUP(K53,Proposito_programa!$C$2:$E$59,2,FALSE)),\" \",VLOOKUP(K53,Proposito_programa!$C$2:$E$59,2,FALSE))","v":"Eficiencia en la atención de emergencias"},{"$f":"IF(ISERROR(VLOOKUP(K53,Proposito_programa!$C$2:$E$59,3,FALSE)),\" \",VLOOKUP(K53,Proposito_programa!$C$2:$E$59,3,FALSE))","v":"Propósito 2 : Cambiar Nuestros Hábitos de Vida para Reverdecer a Bogotá y Adaptarnos y Mitigar la Crisis Climática"},"O23011602300000001665",1,39647356,"CLELIA ESTRID PINEDA ORTIZ","Persona Natural",null,null,null,null,19800000,null,1,2400000,22200000,18600000,"2022-01-20","2022-01-21","2023-01-30",330,1,40,null,null,null,null,"Terminado",0.83783783783783783]
[43,2022,"FDLRUU-CD-039-2022","https://Community.seCop.gov.Co/PubliC/Tendering/OpportunityDetail/Index?notiCeUID=CO1.NTC.2611434&isFromPubliCArea=True&isModal=False","Contratos de prestación de servicios profesionales y de apoyo a la gestión","Contratación directa","Prestación de servicios profesionales y de apoyo a la gestión, o para la ejecución de trabajos artísticos que sólo puedan encomendarse a determinadas personas naturales","PRESTAR SUS SERVICIOS ASISTENCIALES PARA LA GESTIÓN DEL RIESGO, EN EL MARCO DEL PROYECTO 1665 VIGÍAS DEL RIESGO DE LA LOCALIDAD DE RAFAEL URIBE URIBE , A LA LUZ DEL PLAN DE DESARROLLO 2021 2024 'UN NUEVO CONTRATO AMBIENTAL Y SOCIAL.","Inversión","Un nuevo contrato social y ambiental para la Bogotá del Siglo XXI",30,{"$f":"IF(ISERROR(VLOOKUP(K54,Proposito_programa!$C$2:$E$59,2,FALSE)),\" \",VLOOKUP(K54,Proposito_programa!$C$2:$E$59,2,FALSE))","v":"Eficiencia en la atención de emergencias"},{"$f":"IF(ISERROR(VLOOKUP(K54,Proposito_programa!$C$2:$E$59,3,FALSE)),\" \",VLOOKUP(K54,Proposito_programa!$C$2:$E$59,3,FALSE))","v":"Propósito 2 : Cambiar Nuestros Hábitos de Vida para Reverdecer a Bogotá y Adaptarnos y Mitigar la Crisis Climática"},"O23011602300000001665",1,52025495,"SANDRA BIBIANA ROMERO CALDERON","Persona Natural",null,null,null,null,19800000,null,1,2100000,21900000,18300000,"2022-01-25","2022-01-26","2023-01-22",330,1,35,null,null,null,null,"Terminacion Anticipada",0.83561643835616439]
[44,2022,"FDLRUU-CD-039-2022","https://Community.seCop.gov.Co/PubliC/Tendering/OpportunityDetail/Index?notiCeUID=CO1.NTC.2611434&isFromPubliCArea=True&isModal=False","Contratos de prestación de servicios profesionales y de apoyo a la gestión","Contratación directa","Prestación de servicios profesionales y de apoyo a la gestión, o para la ejecución de trabajos artísticos que sólo puedan encomendarse a determinadas personas naturales","PRESTAR SUS SERVICIOS ASISTENCIALES PARA LA GESTIÓN DEL RIESGO,EN EL MARCO DEL PROYECTO 1665 VIGÍAS DEL RIESGO DE LA LOCALIDAD DE RAFAEL URIBE URIBE A LA LUZ DEL PLAN DE DESARROLLO 2021 2024 'UN NUEVO CONTRATO AMBIENTAL Y SOCIAL","Inversión","Un nuevo contrato social y ambiental para la Bogotá del Siglo XXI",30,{"$f":"IF(ISERROR(VLOOKUP(K55,Proposito_programa!$C$2:$E$59,2,FALSE)),\" \",VLOOKUP(K55,Proposito_programa!$C$2:$E$59,2,FALSE))","v":"Eficiencia en la atención de emergencias"},{"$f":"IF(ISERROR(VLOOKUP(K55,Proposito_programa!$C$2:$E$59,3,FALSE)),\" \",VLOOKUP(K55,Proposito_programa!$C$2:$E$59,3,FALSE))","v":"Propósito 2 : Cambiar Nuestros Hábitos de Vida para Reverdecer a Bogotá y Adaptarnos y Mitigar la Crisis Climática"},"O23011602300000001665",1,79515849,"JUAN CARLOS ALVAREZ SANABRIA","Persona Natural",null,null,null,null,19800000,null,null,null,19800000,17880000,"2022-01-22","2022-02-03","2023-01-02",330,null,null,null,null,null,null,"Terminado",0.90303030303030307]
[45,2022,"FDLRUU-CD-039-2022","https://Community.seCop.gov.Co/PubliC/Tendering/OpportunityDetail/Index?notiCeUID=CO1.NTC.2611434&isFromPubliCArea=True&isModal=False","Contratos de prestación de servicios profesionales y de apoyo a la gestión","Contratación directa","Prestación de servicios profesionales y de apoyo a la gestión, o para la ejecución de trabajos artísticos que sólo puedan encomendarse a determinadas personas naturales","PRESTAR SUS SERVICIOS ASISTENCIALES PARA LA GESTIÓN DEL RIESGO, EN EL MARCO DEL PROYECTO 1665 VIGÍAS DEL RIESGO DE LA LOCALIDAD DE RAFAEL URIBE URIBE, A LA LUZ DEL PLAN DE DESARROLLO 2021 2024 'UN NUEVO CONTRATO AMBIENTAL Y SOCIAL","Inversión","Un nuevo contrato social y ambiental para la Bogotá del Siglo XXI",30,{"$f":"IF(ISERROR(VLOOKUP(K56,Proposito_programa!$C$2:$E$59,2,FALSE)),\" \",VLOOKUP(K56,Proposito_programa!$C$2:$E$59,2,FALSE))","v":"Eficiencia en la atención de emergencias"},{"$f":"IF(ISERROR(VLOOKUP(K56,Proposito_programa!$C$2:$E$59,3,FALSE)),\" \",VLOOKUP(K56,Proposito_programa!$C$2:$E$59,3,FALSE))","v":"Propósito 2 : Cambiar Nuestros Hábitos de Vida para Reverdecer a Bogotá y Adaptarnos y Mitigar la Crisis Climática"},"O23011602300000001665",1,1013593717,"NANCY PAOLA BOLIVAR MACA","Persona Natural",null,null,null,null,19800000,null,1,1800000,21600000,18000000,"2022-01-28","2022-02-01","2023-01-30",330,1,30,null,null,null,null,"Terminado",0.83333333333333337]
[46,2022,"FDLRUU-CD-039-2022","https://Community.seCop.gov.Co/PubliC/Tendering/OpportunityDetail/Index?notiCeUID=CO1.NTC.2611434&isFromPubliCArea=True&isModal=False","Contratos de prestación de servicios profesionales y de apoyo a la gestión","Contratación directa","Prestación de servicios profesionales y de apoyo a la gestión, o para la ejecución de trabajos artísticos que sólo puedan encomendarse a determinadas personas naturales","PRESTAR SUS SERVICIOS ASISTENCIALES PARA LA GESTIÓN DEL RIESGO, EN EL MARCO DEL PROYECTO 1665 VIGÍAS DEL RIESGO DE LA LOCALIDAD DE RAFAEL URIBE URIBE , A LA LUZ DEL PLAN DE DESARROLLO 2021 2024 'UN NUEVO CONTRATO AMBIENTAL Y SOCIAL","Inversión","Un nuevo contrato social y ambiental para la Bogotá del Siglo XXI",30,{"$f":"IF(ISERROR(VLOOKUP(K57,Proposito_programa!$C$2:$E$59,2,FALSE)),\" \",VLOOKUP(K57,Proposito_programa!$C$2:$E$59,2,FALSE))","v":"Eficiencia en la atención de emergencias"},{"$f":"IF(ISERROR(VLOOKUP(K57,Proposito_programa!$C$2:$E$59,3,FALSE)),\" \",VLOOKUP(K57,Proposito_programa!$C$2:$E$59,3,FALSE))","v":"Propósito 2 : Cambiar Nuestros Hábitos de Vida para Reverdecer a Bogotá y Adaptarnos y Mitigar la Crisis Climática"},"O23011602300000001665",1,1000346902,"DAVID GUSTAVO ALVAREZ LOPEZ","Persona Natural",null,null,null,null,19800000,null,1,1800000,21600000,18000000,"2022-01-27","2022-02-01","2023-01-30",330,1,30,null,null,null,null,"Terminado",0.83333333333333337]
[47,2022,"FDLRUU-CD-039-2022","https://Community.seCop.gov.Co/PubliC/Tendering/OpportunityDetail/Index?notiCeUID=CO1.NTC.2611434&isFromPubliCArea=True&isModal=False","Contratos de prestación de servicios profesionales y de apoyo a la gestión","Contratación directa","Prestación de servicios profesionales y de apoyo a la gestión, o para la ejecución de trabajos artísticos que sólo puedan encomendarse a determinadas personas naturales","\"PRESTAR SUS SERVICIOS ASISTENCIALES PARA LA GESTIÓN DEL RIESGO, EN EL MARCO DEL PROYECTO 1665 VIGÍAS DEL RIESGO DE LA LOCALIDAD DE RAFAEL URIBE URIBE , A LA LUZ DEL PLAN DE DESARROLLO 2021 2024 'UN NUEVO CONTRATO AMBIENTAL Y SOCIAL","Inversión","Un nuevo contrato social y ambiental para la Bogotá del Siglo XXI",30,{"$f":"IF(ISERROR(VLOOKUP(K58,Proposito_programa!$C$2:$E$59,2,FALSE)),\" \",VLOOKUP(K58,Proposito_programa!$C$2:$E$59,2,FALSE))","v":"Eficiencia en la atención de emergencias"},{"$f":"IF(ISERROR(VLOOKUP(K58,Proposito_programa!$C$2:$E$59,3,FALSE)),\" \",VLOOKUP(K58,Proposito_programa!$C$2:$E$59,3,FALSE))","v":"Propósito 2 : Cambiar Nuestros Hábitos de Vida para Reverdecer a Bogotá y Adaptarnos y Mitigar la Crisis Climática"},"O23011602300000001665",1,1030639805,"JEFERSON PARRA TRIVIÑO","Persona Natural",null,null,null,null,19800000,null,null,null,19800000,16080000,"2022-01-27","2022-02-04","2023-01-03",330,null,null,null,null,null,null,"Terminado",0.81212121212121213]
[48,2022,"FDLRUU-CD-039-2022","https://Community.seCop.gov.Co/PubliC/Tendering/OpportunityDetail/Index?notiCeUID=CO1.NTC.2611434&isFromPubliCArea=True&isModal=False","Contratos de prestación de servicios profesionales y de apoyo a la gestión","Contratación directa","Prestación de servicios profesionales y de apoyo a la gestión, o para la ejecución de trabajos artísticos que sólo puedan encomendarse a determinadas personas naturales","PRESTAR LOS SERVICIOS TECNICOS PARA DESARROLLAR ACTIVIDADES TENDIENTES A GARANTIZAR LA SALUD Y LA ATENCIÓN DE LAS EMERGENCIAS Y DESASTRES QUE SE PRESENTEN EN LA LOCALIDAD RAFAEL URIBE URIBE EN MARCO DEL PROYECTO 1665","Inversión","Un nuevo contrato social y ambiental para la Bogotá del Siglo XXI",30,{"$f":"IF(ISERROR(VLOOKUP(K59,Proposito_programa!$C$2:$E$59,2,FALSE)),\" \",VLOOKUP(K59,Proposito_programa!$C$2:$E$59,2,FALSE))","v":"Eficiencia en la atención de emergencias"},{"$f":"IF(ISERROR(VLOOKUP(K59,Proposito_programa!$C$2:$E$59,3,FALSE)),\" \",VLOOKUP(K59,Proposito_programa!$C$2:$E$59,3,FALSE))","v":"Propósito 2 : Cambiar Nuestros Hábitos de Vida para Reverdecer a Bogotá y Adaptarnos y Mitigar la Crisis Climática"},"O23011602300000001665",1,71337316,"JOHN JAIRO OSPINA AGUDELO","Persona Natural",null,null,null,null,19800000,null,null,null,19800000,17940000,"2022-01-28","2022-02-02","2023-01-01",330,null,null,null,null,null,null,"Terminado",0.90606060606060601]
[49,2022,"FDLRUU-CD-049-2022","https://Community.seCop.gov.Co/PubliC/Tendering/OpportunityDetail/Index?notiCeUID=CO1.NTC.2620309&isFromPubliCArea=True&isModal=False","Contratos de prestación de servicios profesionales y de apoyo a la gestión","Contratación directa","Prestación de servicios profesionales y de apoyo a la gestión, o para la ejecución de trabajos artísticos que sólo puedan encomendarse a determinadas personas naturales","APOYAR JURÍDICAMENTE LA EJECUCIÓN DE LAS ACCIONES REQUERIDAS PARA EL TRÁMITE E IMPULSO PROCESAL DE LAS ACTUACIONES CONTRAVENCIONALES Y/O QUERELLAS QUE CURSEN EN LAS INSPECCIONES DE POLICÍA DE LA LOCALIDAD DE RAFAEL URIBE URIBE","Inversión","Un nuevo contrato social y ambiental para la Bogotá del Siglo XXI",57,{"$f":"IF(ISERROR(VLOOKUP(K60,Proposito_programa!$C$2:$E$59,2,FALSE)),\" \",VLOOKUP(K60,Proposito_programa!$C$2:$E$59,2,FALSE))","v":"Gestión pública local"},{"$f":"IF(ISERROR(VLOOKUP(K60,Proposito_programa!$C$2:$E$59,3,FALSE)),\" \",VLOOKUP(K60,Proposito_programa!$C$2:$E$59,3,FALSE))","v":"Propósito 5: Construir Bogotá - Región con gobierno abierto, transparente y ciudadanía consciente"},"O23011605570000001698",1,79536725,"JHON FREDY HERRERA TORRES","Persona Natural",null,null,null,null,59400000,null,1,6480000,65880000,55080000,"2022-01-19","2022-01-25","2023-01-19",330,1,36,null,null,null,null,"Terminacion Anticipada",0.83606557377049184]
[50,2022,"FDLRUU-CD-049-2022","https://Community.seCop.gov.Co/PubliC/Tendering/OpportunityDetail/Index?notiCeUID=CO1.NTC.2620309&isFromPubliCArea=True&isModal=False","Contratos de prestación de servicios profesionales y de apoyo a la gestión","Contratación directa","Prestación de servicios profesionales y de apoyo a la gestión, o para la ejecución de trabajos artísticos que sólo puedan encomendarse a determinadas personas naturales","APOYAR JURÍDICAMENTE LA EJECUCIÓN DE LAS ACCIONES REQUERIDAS PARA EL TRÁMITE E IMPULSO PROCESAL DE LAS ACTUACIONES CONTRAVENCIONALES Y/O QUERELLAS QUE CURSEN EN LAS INSPECCIONES DE POLICÍA DE LA LOCALIDAD DE RAFAEL URIBE URIBE","Inversión","Un nuevo contrato social y ambiental para la Bogotá del Siglo XXI",57,{"$f":"IF(ISERROR(VLOOKUP(K61,Proposito_programa!$C$2:$E$59,2,FALSE)),\" \",VLOOKUP(K61,Proposito_programa!$C$2:$E$59,2,FALSE))","v":"Gestión pública local"},{"$f":"IF(ISERROR(VLOOKUP(K61,Proposito_programa!$C$2:$E$59,3,FALSE)),\" \",VLOOKUP(K61,Proposito_programa!$C$2:$E$59,3,FALSE))","v":"Propósito 5: Construir Bogotá - Región con gobierno abierto, transparente y ciudadanía consciente"},"O23011605570000001698",1,79307654,"ALVARO GOMEZ GÓMEZ","Persona Natural",null,null,null,null,59400000,null,1,6120000,65520000,{"$f":"14220000+AL61","v":54720000},"2022-01-22","2022-01-27","2023-01-30",330,1,34,1022372371,"JUAN DAVID VARGAS VILLAREAL","2022-09-13",40500000,"Terminado",0.8351648351648352]
[51,2022,"FDLRUU-CD-049-2022","https://Community.seCop.gov.Co/PubliC/Tendering/OpportunityDetail/Index?notiCeUID=CO1.NTC.2620309&isFromPubliCArea=True&isModal=False\n","Contratos de prestación de servicios profesionales y de apoyo a la gestión","Contratación directa","Prestación de servicios profesionales y de apoyo a la gestión, o para la ejecución de trabajos artísticos que sólo puedan encomendarse a determinadas personas naturales","APOYAR JURÍDICAMENTE LA EJECUCIÓN DE LAS ACCIONES REQUERIDAS PARA EL TRÁMITE E IMPULSO PROCESAL DE LAS ACTUACIONES CONTRAVENCIONALES Y/O QUERELLAS QUE CURSEN EN LAS INSPECCIONES DE POLICÍA DE LA LOCALIDAD DE RAFAEL URIBE URIBE","Inversión","Un nuevo contrato social y ambiental para la Bogotá del Siglo XXI",57,{"$f":"IF(ISERROR(VLOOKUP(K62,Proposito_programa!$C$2:$E$59,2,FALSE)),\" \",VLOOKUP(K62,Proposito_programa!$C$2:$E$59,2,FALSE))","v":"Gestión pública local"},{"$f":"IF(ISERROR(VLOOKUP(K62,Proposito_programa!$C$2:$E$59,3,FALSE)),\" \",VLOOKUP(K62,Proposito_programa!$C$2:$E$59,3,FALSE))","v":"Propósito 5: Construir Bogotá - Región con gobierno abierto, transparente y ciudadanía consciente"},"O23011605570000001698",1,18933787,"JAIME ARIAS CASTRO","Persona Natural",null,null,null,null,59400000,null,null,null,59400000,47340000,"2022-01-24","2022-02-08","2023-01-07",330,null,null,null,null,null,null,"Terminado",0.79696969696969699]
[52,2022,"FDLRUU-CD-049-2022","https://Community.seCop.gov.Co/PubliC/Tendering/OpportunityDetail/Index?notiCeUID=CO1.NTC.2620309&isFromPubliCArea=True&isModal=False\n","Contratos de prestación de servicios profesionales y de apoyo a la gestión","Contratación directa","Prestación de servicios profesionales y de apoyo a la gestión, o para la ejecución de trabajos artísticos que sólo puedan encomendarse a determinadas personas naturales","APOYAR JURÍDICAMENTE LA EJECUCIÓN DE LAS ACCIONES REQUERIDAS PARA EL TRÁMITE E IMPULSO PROCESAL DE LAS ACTUACIONES CONTRAVENCIONALES Y/O QUERELLAS QUE CURSEN EN LAS INSPECCIONES DE POLICÍA DE LA LOCALIDAD.","Inversión","Un nuevo contrato social y ambiental para la Bogotá del Siglo XXI",57,{"$f":"IF(ISERROR(VLOOKUP(K63,Proposito_programa!$C$2:$E$59,2,FALSE)),\" \",VLOOKUP(K63,Proposito_programa!$C$2:$E$59,2,FALSE))","v":"Gestión pública local"},{"$f":"IF(ISERROR(VLOOKUP(K63,Proposito_programa!$C$2:$E$59,3,FALSE)),\" \",VLOOKUP(K63,Proposito_programa!$C$2:$E$59,3,FALSE))","v":"Propósito 5: Construir Bogotá - Región con gobierno abierto, transparente y ciudadanía consciente"},"O23011605570000001698",1,79450983,"JUAN ANTONIO CARDENAS ACEVEDO","Persona Natural",null,null,null,null,59400000,null,1,5940000,65340000,54540000,"2022-01-26","2022-01-28","2023-01-30",330,1,33,null,null,null,null,"Terminado",0.83471074380165289]
[53,2022,"FDLRUU-CD-049-2022","https://Community.seCop.gov.Co/PubliC/Common/GoogleReCaptCha/Index?previouSURl=https%3a%2f%2fCommunity.seCop.gov.Co%2fPubliC%2fTendering%2fOpportunityDetail%2fIndex%3fnotiCeUID%3dCO1.NTC.2620309%26isFromPubliCArea%3dTrue%26isModal%3dFalse","Contratos de prestación de servicios profesionales y de apoyo a la gestión","Contratación directa","Prestación de servicios profesionales y de apoyo a la gestión, o para la ejecución de trabajos artísticos que sólo puedan encomendarse a determinadas personas naturales","\"APOYAR JURÍDICAMENTE LA EJECUCIÓN DE LAS ACCIONES REQUERIDAS PARA EL TRÁMITE E IMPULSO PROCESAL DE LAS ACTUACIONES CONTRAVENCIONALES Y/O QUERELLAS QUE CURSEN EN LAS INSPECCIONES DE POLICÍA DE LA LOCALIDAD.\"","Inversión","Un nuevo contrato social y ambiental para la Bogotá del Siglo XXI",57,{"$f":"IF(ISERROR(VLOOKUP(K64,Proposito_programa!$C$2:$E$59,2,FALSE)),\" \",VLOOKUP(K64,Proposito_programa!$C$2:$E$59,2,FALSE))","v":"Gestión pública local"},{"$f":"IF(ISERROR(VLOOKUP(K64,Proposito_programa!$C$2:$E$59,3,FALSE)),\" \",VLOOKUP(K64,Proposito_programa!$C$2:$E$59,3,FALSE))","v":"Propósito 5: Construir Bogotá - Región con gobierno abierto, transparente y ciudadanía consciente"},"O23011605570000001698",1,79455376,"FELIPE ANDRES BARRAGAN MARTINEZ","Persona Natural",null,null,null,null,59400000,null,null,null,59400000,53460000,"2022-01-28","2022-02-04","2023-01-03",330,null,null,null,null,null,null,"Terminado",0.9]
[54,2022,"FDLRUU-CD-049-2022","https://Community.seCop.gov.Co/PubliC/Common/GoogleReCaptCha/Index?previouSURl=https%3a%2f%2fCommunity.seCop.gov.Co%2fPubliC%2fTendering%2fOpportunityDetail%2fIndex%3fnotiCeUID%3dCO1.NTC.2620309%26isFromPubliCArea%3dTrue%26isModal%3dFalse","Contratos de prestación de servicios profesionales y de apoyo a la gestión","Contratación directa","Prestación de servicios profesionales y de apoyo a la gestión, o para la ejecución de trabajos artísticos que sólo puedan encomendarse a determinadas personas naturales","\tAPOYAR JURÍDICAMENTE LA EJECUCIÓN DE LAS ACCIONES REQUERIDAS PARA EL TRÁMITE E IMPULSO PROCESAL DE LAS ACTUACIONES CONTRAVENCIONALES Y/O QUERELLAS QUE CURSEN EN LAS INSPECCIONES DE POLICÍA DE LA LOCALIDAD","Inversión","Un nuevo contrato social y ambiental para la Bogotá del Siglo XXI",57,{"$f":"IF(ISERROR(VLOOKUP(K65,Proposito_programa!$C$2:$E$59,2,FALSE)),\" \",VLOOKUP(K65,Proposito_programa!$C$2:$E$59,2,FALSE))","v":"Gestión pública local"},{"$f":"IF(ISERROR(VLOOKUP(K65,Proposito_programa!$C$2:$E$59,3,FALSE)),\" \",VLOOKUP(K65,Proposito_programa!$C$2:$E$59,3,FALSE))","v":"Propósito 5: Construir Bogotá - Región con gobierno abierto, transparente y ciudadanía consciente"},"O23011605570000001698",1,52072284,"DELIA MARLEN PINTO BERNAL","Persona Natural",null,null,null,null,59400000,null,1,5400000,64800000,54000000,"2022-01-27","2022-02-01","2023-01-30",330,1,30,null,null,null,null,"Terminado",0.83333333333333337]
[55,2022,"FDLRUU-CD-049-2022","https://Community.seCop.gov.Co/PubliC/Common/GoogleReCaptCha/Index?previouSURl=https%3a%2f%2fCommunity.seCop.gov.Co%2fPubliC%2fTendering%2fOpportunityDetail%2fIndex%3fnotiCeUID%3dCO1.NTC.2620309%26isFromPubliCArea%3dTrue%26isModal%3dFalse","Contratos de prestación de servicios profesionales y de apoyo a la gestión","Contratación directa","Prestación de servicios profesionales y de apoyo a la gestión, o para la ejecución de trabajos artísticos que sólo puedan encomendarse a determinadas personas naturales","\tAPOYAR JURÍDICAMENTE LA EJECUCIÓN DE LAS ACCIONES REQUERIDAS PARA EL TRÁMITE E IMPULSO PROCESAL DE LAS ACTUACIONES CONTRAVENCIONALES Y/O QUERELLAS QUE CURSEN EN LAS INSPECCIONES DE POLICÍA DE LA LOCALIDAD","Inversión","Un nuevo contrato social y ambiental para la Bogotá del Siglo XXI",57,{"$f":"IF(ISERROR(VLOOKUP(K66,Proposito_programa!$C$2:$E$59,2,FALSE)),\" \",VLOOKUP(K66,Proposito_programa!$C$2:$E$59,2,FALSE))","v":"Gestión pública local"},{"$f":"IF(ISERROR(VLOOKUP(K66,Proposito_programa!$C$2:$E$59,3,FALSE)),\" \",VLOOKUP(K66,Proposito_programa!$C$2:$E$59,3,FALSE))","v":"Propósito 5: Construir Bogotá - Región con gobierno abierto, transparente y ciudadanía consciente"},"O23011605570000001698",1,52525366,"ANYI PATRICIA BARON SALAMANCA","Persona Natural",null,null,null,null,59400000,null,null,null,59400000,48780000,"2022-01-28","2022-02-07","2023-01-23",330,null,null,null,null,null,null,"Terminacion Anticipada",0.82121212121212117]
[56,2022,"FDLRUU-CD-049-2022","https://Community.seCop.gov.Co/PubliC/Common/GoogleReCaptCha/Index?previouSURl=https%3a%2f%2fCommunity.seCop.gov.Co%2fPubliC%2fTendering%2fOpportunityDetail%2fIndex%3fnotiCeUID%3dCO1.NTC.2620309%26isFromPubliCArea%3dTrue%26isModal%3dFalse","Contratos de prestación de servicios profesionales y de apoyo a la gestión","Contratación directa","Prestación de servicios profesionales y de apoyo a la gestión, o para la ejecución de trabajos artísticos que sólo puedan encomendarse a determinadas personas naturales","\tAPOYAR JURÍDICAMENTE LA EJECUCIÓN DE LAS ACCIONES REQUERIDAS PARA EL TRÁMITE E IMPULSO PROCESAL DE LAS ACTUACIONES CONTRAVENCIONALES Y/O QUERELLAS QUE CURSEN EN LAS INSPECCIONES DE POLICÍA DE LA LOCALIDAD","Inversión","Un nuevo contrato social y ambiental para la Bogotá del Siglo XXI",57,{"$f":"IF(ISERROR(VLOOKUP(K67,Proposito_programa!$C$2:$E$59,2,FALSE)),\" \",VLOOKUP(K67,Proposito_programa!$C$2:$E$59,2,FALSE))","v":"Gestión pública local"},{"$f":"IF(ISERROR(VLOOKUP(K67,Proposito_programa!$C$2:$E$59,3,FALSE)),\" \",VLOOKUP(K67,Proposito_programa!$C$2:$E$59,3,FALSE))","v":"Propósito 5: Construir Bogotá - Región con gobierno abierto, transparente y ciudadanía consciente"},"O23011605570000001698",1,1098675891,"SILVIA PATRICIA GOMEZ JAIMES ","Persona Natural",null,null,null,null,59400000,null,1,5040000,64440000,53640000,"2022-01-28","2022-02-03","2023-01-25",330,1,28,null,null,null,null,"Terminacion Anticipada",0.83240223463687146]
[57,2022,"FDLRUU-CD-049-2022","https://Community.seCop.gov.Co/PubliC/Common/GoogleReCaptCha/Index?previouSURl=https%3a%2f%2fCommunity.seCop.gov.Co%2fPubliC%2fTendering%2fOpportunityDetail%2fIndex%3fnotiCeUID%3dCO1.NTC.2620309%26isFromPubliCArea%3dTrue%26isModal%3dFalse","Contratos de prestación de servicios profesionales y de apoyo a la gestión","Contratación directa","Prestación de servicios profesionales y de apoyo a la gestión, o para la ejecución de trabajos artísticos que sólo puedan encomendarse a determinadas personas naturales","\tAPOYAR JURÍDICAMENTE LA EJECUCIÓN DE LAS ACCIONES REQUERIDAS PARA EL TRÁMITE E IMPULSO PROCESAL DE LAS ACTUACIONES CONTRAVENCIONALES Y/O QUERELLAS QUE CURSEN EN LAS INSPECCIONES DE POLICÍA DE LA LOCALIDAD","Inversión","Un nuevo contrato social y ambiental para la Bogotá del Siglo XXI",57,{"$f":"IF(ISERROR(VLOOKUP(K68,Proposito_programa!$C$2:$E$59,2,FALSE)),\" \",VLOOKUP(K68,Proposito_programa!$C$2:$E$59,2,FALSE))","v":"Gestión pública local"},{"$f":"IF(ISERROR(VLOOKUP(K68,Proposito_programa!$C$2:$E$59,3,FALSE)),\" \",VLOOKUP(K68,Proposito_programa!$C$2:$E$59,3,FALSE))","v":"Propósito 5: Construir Bogotá - Región con gobierno abierto, transparente y ciudadanía consciente"},"O23011605570000001698",1,52874586,"DANCY LUDITH RODRIGUEZ RIVERA","Persona Natural",null,null,null,null,59400000,null,1,5400000,64800000,54000000,"2022-01-28","2022-02-01","2023-01-23",330,1,30,null,null,null,null,"Terminacion Anticipada",0.83333333333333337]
[58,2022,"FDLRUU-CD-058-2022","https://Community.seCop.gov.Co/PubliC/Tendering/OpportunityDetail/Index?notiCeUID=CO1.NTC.2657540&isFromPubliCArea=True&isModal=False\n","Contratos de prestación de servicios profesionales y de apoyo a la gestión","Contratación directa","Prestación de servicios profesionales y de apoyo a la gestión, o para la ejecución de trabajos artísticos que sólo puedan encomendarse a determinadas personas naturales","APOYAR TÉCNICAMENTE LAS DISTINTAS ETAPAS DE LOS PROCESOS DE COMPETENCIA DE LAS INSPECCIONES DE POLICÍA DE LA LOCALIDAD, SEGÚN REPARTO","Inversión","Un nuevo contrato social y ambiental para la Bogotá del Siglo XXI",57,{"$f":"IF(ISERROR(VLOOKUP(K69,Proposito_programa!$C$2:$E$59,2,FALSE)),\" \",VLOOKUP(K69,Proposito_programa!$C$2:$E$59,2,FALSE))","v":"Gestión pública local"},{"$f":"IF(ISERROR(VLOOKUP(K69,Proposito_programa!$C$2:$E$59,3,FALSE)),\" \",VLOOKUP(K69,Proposito_programa!$C$2:$E$59,3,FALSE))","v":"Propósito 5: Construir Bogotá - Región con gobierno abierto, transparente y ciudadanía consciente"},"O23011605570000001698",1,79347561,"JUAN CARLOS USSA LIZARAZO","Persona Natural",null,null,null,null,59400000,null,1,6120000,65520000,54720000,"2022-01-22","2022-01-27","2023-01-22",330,1,34,null,null,null,null,"Terminacion Anticipada",0.8351648351648352]
[59,2022,"FDLRUU-CD-059-2022","https://Community.seCop.gov.Co/PubliC/Tendering/OpportunityDetail/Index?notiCeUID=CO1.NTC.2641872&isFromPubliCArea=True&isModal=False","Contratos de prestación de servicios profesionales y de apoyo a la gestión","Contratación directa","Prestación de servicios profesionales y de apoyo a la gestión, o para la ejecución de trabajos artísticos que sólo puedan encomendarse a determinadas personas naturales","PRESTAR LOS SERVICIOS PROFESIONALES DE APOYO EN EL ÁREA DE GESTIÓN DE DESARROLLO LOCAL PARA ADELANTAR LAS ACTIVIDADES, TRAMITES Y PROCEDIMIENTOS RELACIONADOS CON EL MARCO NORMATIVO PRESUPUESTAL.","Inversión","Un nuevo contrato social y ambiental para la Bogotá del Siglo XXI",57,{"$f":"IF(ISERROR(VLOOKUP(K70,Proposito_programa!$C$2:$E$59,2,FALSE)),\" \",VLOOKUP(K70,Proposito_programa!$C$2:$E$59,2,FALSE))","v":"Gestión pública local"},{"$f":"IF(ISERROR(VLOOKUP(K70,Proposito_programa!$C$2:$E$59,3,FALSE)),\" \",VLOOKUP(K70,Proposito_programa!$C$2:$E$59,3,FALSE))","v":"Propósito 5: Construir Bogotá - Región con gobierno abierto, transparente y ciudadanía consciente"},"O23011605570000001697",1,79489811,"LUIS JONNY CARRILLO BOMBIELA","Persona Natural",null,null,null,null,59400000,null,1,6660000,66060000,55260000,"2022-01-21","2022-01-24","2023-01-30",330,1,37,null,null,null,null,"Terminado",0.8365122615803815]
[60,2022,"FDLRUU-CD-060-2022","https://Community.seCop.gov.Co/PubliC/Tendering/OpportunityDetail/Index?notiCeUID=CO1.NTC.2715173&isFromPubliCArea=True&isModal=False","Contratos de prestación de servicios profesionales y de apoyo a la gestión","Contratación directa","Prestación de servicios profesionales y de apoyo a la gestión, o para la ejecución de trabajos artísticos que sólo puedan encomendarse a determinadas personas naturales","APOYAR TÉCNICAMENTE LAS DISTINTAS ETAPAS DE LOS PROCESOS DE COMPETENCIA DE LAS INSPECCIONES DE POLICÍA DE LA LOCALIDAD, SEGÚN REPARTO","Inversión","Un nuevo contrato social y ambiental para la Bogotá del Siglo XXI",57,{"$f":"IF(ISERROR(VLOOKUP(K71,Proposito_programa!$C$2:$E$59,2,FALSE)),\" \",VLOOKUP(K71,Proposito_programa!$C$2:$E$59,2,FALSE))","v":"Gestión pública local"},{"$f":"IF(ISERROR(VLOOKUP(K71,Proposito_programa!$C$2:$E$59,3,FALSE)),\" \",VLOOKUP(K71,Proposito_programa!$C$2:$E$59,3,FALSE))","v":"Propósito 5: Construir Bogotá - Región con gobierno abierto, transparente y ciudadanía consciente"},"O23011605570000001698",1,19338480,"JORGE HERNANDO RODRIGUEZ SANTANA","Persona Natural",null,null,null,null,59400000,null,1,5400000,64800000,54000000,"2022-01-25","2022-02-01","2023-01-24",330,1,30,null,null,null,null,"Terminacion Anticipada",0.83333333333333337]
[61,2022,"FDLRUU-CD-061-2022","https://Community.seCop.gov.Co/PubliC/Tendering/OpportunityDetail/Index?notiCeUID=CO1.NTC.2676288&isFromPubliCArea=True&isModal=False","Contratos de prestación de servicios profesionales y de apoyo a la gestión","Contratación directa","Prestación de servicios profesionales y de apoyo a la gestión, o para la ejecución de trabajos artísticos que sólo puedan encomendarse a determinadas personas naturales","PRESTAR LOS SERVICIOS DE APOYO TECNICO EN EL AREA DE GESTION DE DESARROLLO LOCAL EN LOS TEMAS ASOCIADOS A LAS OBLIGACIONES POR PAGAR MEDIANTE EL SEGUIMIENTO A PAGOS, LA ACTUALIZACIÓN Y DEPURACIÓN DE LOS CONTRATOS QUE SE ENCUENTRAN ENEjecucion Y/O OBLIGACIONES POR PAGAR DE VIGENCIAS ANTERIORES VIGENTES EN EL FONDO DE DESARROLLO LOCAL DE RAFAEL URIBE URIBE.","Inversión","Un nuevo contrato social y ambiental para la Bogotá del Siglo XXI",57,{"$f":"IF(ISERROR(VLOOKUP(K72,Proposito_programa!$C$2:$E$59,2,FALSE)),\" \",VLOOKUP(K72,Proposito_programa!$C$2:$E$59,2,FALSE))","v":"Gestión pública local"},{"$f":"IF(ISERROR(VLOOKUP(K72,Proposito_programa!$C$2:$E$59,3,FALSE)),\" \",VLOOKUP(K72,Proposito_programa!$C$2:$E$59,3,FALSE))","v":"Propósito 5: Construir Bogotá - Región con gobierno abierto, transparente y ciudadanía consciente"},"O23011605570000001697",1,1097332656,"VIANEY LUCIA ARDILA AVILA","Persona Natural",null,null,null,null,44000000,null,1,4666667,48666667,40666667,"2022-01-23","2022-01-26","2023-01-30",330,1,35,null,null,null,null,"Terminado",0.8356164394820792]
[62,2022,"FDLRUU-CD-061-2022","https://Community.seCop.gov.Co/PubliC/Tendering/OpportunityDetail/Index?notiCeUID=CO1.NTC.2676288&isFromPubliCArea=True&isModal=False","Contratos de prestación de servicios profesionales y de apoyo a la gestión","Contratación directa","Prestación de servicios profesionales y de apoyo a la gestión, o para la ejecución de trabajos artísticos que sólo puedan encomendarse a determinadas personas naturales","PRESTAR LOS SERVICIOS DE APOYO TECNICO EN EL AREA DE GESTION DE DESARROLLO LOCAL EN LOS TEMAS ASOCIADOS A LAS OBLIGACIONES POR PAGAR MEDIANTE EL SEGUIMIENTO A PAGOS, LA ACTUALIZACIÓN Y DEPURACIÓN DE LOS CONTRATOS QUE SE ENCUENTRAN ENEjecucion Y/O OBLIGACIONES POR PAGAR DE VIGENCIAS ANTERIORES VIGENTES EN EL FONDO DE DESARROLLO LOCAL DE RAFAEL URIBE URIBE.","Inversión","Un nuevo contrato social y ambiental para la Bogotá del Siglo XXI",57,{"$f":"IF(ISERROR(VLOOKUP(K73,Proposito_programa!$C$2:$E$59,2,FALSE)),\" \",VLOOKUP(K73,Proposito_programa!$C$2:$E$59,2,FALSE))","v":"Gestión pública local"},{"$f":"IF(ISERROR(VLOOKUP(K73,Proposito_programa!$C$2:$E$59,3,FALSE)),\" \",VLOOKUP(K73,Proposito_programa!$C$2:$E$59,3,FALSE))","v":"Propósito 5: Construir Bogotá - Región con gobierno abierto, transparente y ciudadanía consciente"},"O23011605570000001697",1,1026568078,"Monica Tatiana Ariza Ardila","Persona Natural",null,null,null,null,44000000,null,1,4533333,48533333,{"$f":"8666667+AL73","v":40533333},"2022-01-23","2022-01-27","2023-01-30",330,1,34,80833968,"DAVID RICARDO ALARCON LOPEZ","2022-09-26",31866666,"Terminado",0.83516483403272546]
[63,2022,"FDLRUU-CD-063-2022","https://Community.seCop.gov.Co/PubliC/Tendering/OpportunityDetail/Index?notiCeUID=CO1.NTC.2676785&isFromPubliCArea=True&isModal=False","Contratos de prestación de servicios profesionales y de apoyo a la gestión","Contratación directa","Prestación de servicios profesionales y de apoyo a la gestión, o para la ejecución de trabajos artísticos que sólo puedan encomendarse a determinadas personas naturales","PRESTAR LOS SERVICIOS PROFESIONALES PARA APOYAR LA FORMULACION, EJECUCIÓN Y SEGUIMIENTO DE LOS PROYECTOS DE INVERSIÓN\nEN EL MARCO DEL CUMPLIMIENTO DEL PLAN DE DESARROLLO LOCAL DE LA ALCALDÍA LOCAL DE RAFAEL URIBE URIBE 2021 2024","Inversión","Un nuevo contrato social y ambiental para la Bogotá del Siglo XXI",57,{"$f":"IF(ISERROR(VLOOKUP(K74,Proposito_programa!$C$2:$E$59,2,FALSE)),\" \",VLOOKUP(K74,Proposito_programa!$C$2:$E$59,2,FALSE))","v":"Gestión pública local"},{"$f":"IF(ISERROR(VLOOKUP(K74,Proposito_programa!$C$2:$E$59,3,FALSE)),\" \",VLOOKUP(K74,Proposito_programa!$C$2:$E$59,3,FALSE))","v":"Propósito 5: Construir Bogotá - Región con gobierno abierto, transparente y ciudadanía consciente"},"O23011605570000001697",1,1075267896,"MARTHA LILIANA SILVA ESQUIVEL","Persona Natural",null,null,null,null,59400000,null,1,4320000,63720000,53280000,"2022-01-23","2022-02-07","2023-01-22",330,1,24,null,null,null,null,"Terminacion Anticipada",0.83615819209039544]
[64,2022,"FDLRUU-CD-064-2022","https://Community.seCop.gov.Co/PubliC/Tendering/OpportunityDetail/Index?notiCeUID=CO1.NTC.2677280&isFromPubliCArea=True&isModal=False","Contratos de prestación de servicios profesionales y de apoyo a la gestión","Contratación directa","Prestación de servicios profesionales y de apoyo a la gestión, o para la ejecución de trabajos artísticos que sólo puedan encomendarse a determinadas personas naturales","PRESTAR LOS SERVICIOS PROFESIONALES DE APOYO JURIDICO AL AREA DE GESTION POLICIVA JURIDICA DE LA ALCALDIA LOCAL DE RAFAEL URIBE URIBE EN EL DESEMPEÑO DE LAS FUNCIONES ASIGNADAS","Inversión","Un nuevo contrato social y ambiental para la Bogotá del Siglo XXI",57,{"$f":"IF(ISERROR(VLOOKUP(K75,Proposito_programa!$C$2:$E$59,2,FALSE)),\" \",VLOOKUP(K75,Proposito_programa!$C$2:$E$59,2,FALSE))","v":"Gestión pública local"},{"$f":"IF(ISERROR(VLOOKUP(K75,Proposito_programa!$C$2:$E$59,3,FALSE)),\" \",VLOOKUP(K75,Proposito_programa!$C$2:$E$59,3,FALSE))","v":"Propósito 5: Construir Bogotá - Región con gobierno abierto, transparente y ciudadanía consciente"},"O23011605570000001698",1,1105781137,"SANDRA PATRICIA PINTO GARAY","Persona Natural",null,null,null,null,70400000,null,1,7466667,77866667,65066667,"2022-01-24","2022-01-26","2023-01-25",330,1,35,null,null,null,null,"Terminacion anticipada",0.83561643905986116]
[65,2022,"FDLRUU-CD-065-2022","https://Community.seCop.gov.Co/PubliC/Tendering/OpportunityDetail/Index?notiCeUID=CO1.NTC.2699201&isFromPubliCArea=True&isModal=False","Contratos de prestación de servicios profesionales y de apoyo a la gestión","Contratación directa","Prestación de servicios profesionales y de apoyo a la gestión, o para la ejecución de trabajos artísticos que sólo puedan encomendarse a determinadas personas naturales","PRESTAR SERVICIOS DE APOYO ADMINISTRATIVO Y ASISTENCIAL A LA ALCALDÍA LOCAL DE RAFAEL URIBE URIBE EN EL CENTRO DE INFORMACIÓN Y DOCUMENTACIÓN (CDI), PARA LA ENTREGA Y NOTIFICACIÓN DE CORRESPONDENCIA GENERADA POR LA ENTIDAD","Inversión","Un nuevo contrato social y ambiental para la Bogotá del Siglo XXI",57,{"$f":"IF(ISERROR(VLOOKUP(K76,Proposito_programa!$C$2:$E$59,2,FALSE)),\" \",VLOOKUP(K76,Proposito_programa!$C$2:$E$59,2,FALSE))","v":"Gestión pública local"},{"$f":"IF(ISERROR(VLOOKUP(K76,Proposito_programa!$C$2:$E$59,3,FALSE)),\" \",VLOOKUP(K76,Proposito_programa!$C$2:$E$59,3,FALSE))","v":"Propósito 5: Construir Bogotá - Región con gobierno abierto, transparente y ciudadanía consciente"},"O23011605570000001697",1,79536458,"WILSON MIGUEL CARRANZA SIERRA","Persona Natural",null,null,null,null,20680000,null,1,2193333,22873333,19113333,"2022-01-25","2022-01-26","2023-01-19",330,1,35,null,null,null,null,"Terminacion anticipada",0.83561643596060098]
[66,2022,"FDLRUU-CD-066-2022","https://Community.seCop.gov.Co/PubliC/Tendering/OpportunityDetail/Index?notiCeUID=CO1.NTC.2681931&isFromPubliCArea=True&isModal=False","Contratos de prestación de servicios profesionales y de apoyo a la gestión","Contratación directa","Prestación de servicios profesionales y de apoyo a la gestión, o para la ejecución de trabajos artísticos que sólo puedan encomendarse a determinadas personas naturales","PRESTAR LOS SERVICIOS PERSONALES DE APOYO A LA GESTIÓN EN LA CONDUCCIÓN DE LOS VEHÍCULOS LIVIANOS A CARGO DEL FONDO DE DESARROLLO LOCAL DE RAFAEL URIBE URIBE","Inversión","Un nuevo contrato social y ambiental para la Bogotá del Siglo XXI",57,{"$f":"IF(ISERROR(VLOOKUP(K77,Proposito_programa!$C$2:$E$59,2,FALSE)),\" \",VLOOKUP(K77,Proposito_programa!$C$2:$E$59,2,FALSE))","v":"Gestión pública local"},{"$f":"IF(ISERROR(VLOOKUP(K77,Proposito_programa!$C$2:$E$59,3,FALSE)),\" \",VLOOKUP(K77,Proposito_programa!$C$2:$E$59,3,FALSE))","v":"Propósito 5: Construir Bogotá - Región con gobierno abierto, transparente y ciudadanía consciente"},"O23011605570000001697",1,334775,"JOSE ALFONSO GARZON CABEZAS","Persona Natural",null,null,null,null,29700000,null,1,2700000,32400000,27000000,"2022-01-24","2022-02-01","2023-01-19",330,1,30,null,null,null,null,"Terminacion anticipada",0.83333333333333337]
[67,2022,"FDLRUU-CD-066-2022","https://Community.seCop.gov.Co/PubliC/Tendering/OpportunityDetail/Index?notiCeUID=CO1.NTC.2681931&isFromPubliCArea=True&isModal=False","Contratos de prestación de servicios profesionales y de apoyo a la gestión","Contratación directa","Prestación de servicios profesionales y de apoyo a la gestión, o para la ejecución de trabajos artísticos que sólo puedan encomendarse a determinadas personas naturales","PRESTAR LOS SERVICIOS PERSONALES DE APOYO A LA GESTIÓN EN LA CONDUCCIÓN DE LOS VEHÍCULOS LIVIANOS A CARGO DEL FONDO DE DESARROLLO LOCAL DE RAFAEL URIBE URIBE","Inversión","Un nuevo contrato social y ambiental para la Bogotá del Siglo XXI",57,{"$f":"IF(ISERROR(VLOOKUP(K78,Proposito_programa!$C$2:$E$59,2,FALSE)),\" \",VLOOKUP(K78,Proposito_programa!$C$2:$E$59,2,FALSE))","v":"Gestión pública local"},{"$f":"IF(ISERROR(VLOOKUP(K78,Proposito_programa!$C$2:$E$59,3,FALSE)),\" \",VLOOKUP(K78,Proposito_programa!$C$2:$E$59,3,FALSE))","v":"Propósito 5: Construir Bogotá - Región con gobierno abierto, transparente y ciudadanía consciente"},"O23011605570000001697",1,79740493,"JAVIER BASTIDAS ROMERO","Persona Natural",null,null,null,null,29700000,null,1,3240000,{"$f":"+W78+X78+Z78","v":32940000},27540000,"2022-01-24","2022-01-25","2023-01-19",330,1,36,null,null,null,null,"Terminacion anticipada",{"$f":"IF(ISERROR(AB78/AA78),\"-\",(AB78/AA78))","v":0.83606557377049184}]
[68,2022,"FDLRUU-CD-066-2022","https://Community.seCop.gov.Co/PubliC/Tendering/OpportunityDetail/Index?notiCeUID=CO1.NTC.2681931&isFromPubliCArea=True&isModal=False","Contratos de prestación de servicios profesionales y de apoyo a la gestión","Contratación directa","Prestación de servicios profesionales y de apoyo a la gestión, o para la ejecución de trabajos artísticos que sólo puedan encomendarse a determinadas personas naturales","PRESTAR LOS SERVICIOS PERSONALES DE APOYO A LA GESTIÓN EN LA CONDUCCIÓN DE LOS VEHÍCULOS LIVIANOS A CARGO DEL FONDO DE DESARROLLO LOCAL DE RAFAEL URIBE URIBE","Inversión","Un nuevo contrato social y ambiental para la Bogotá del Siglo XXI",57,{"$f":"IF(ISERROR(VLOOKUP(K79,Proposito_programa!$C$2:$E$59,2,FALSE)),\" \",VLOOKUP(K79,Proposito_programa!$C$2:$E$59,2,FALSE))","v":"Gestión pública local"},{"$f":"IF(ISERROR(VLOOKUP(K79,Proposito_programa!$C$2:$E$59,3,FALSE)),\" \",VLOOKUP(K79,Proposito_programa!$C$2:$E$59,3,FALSE))","v":"Propósito 5: Construir Bogotá - Región con gobierno abierto, transparente y ciudadanía consciente"},"O23011605570000001697",1,79258775,"VICTOR JAIME SANCHEZ CARDOZO","Persona Natural",null,null,null,null,29700000,null,1,3240000,32940000,27540000,"2022-01-24","2022-01-25","2023-01-19",330,1,36,null,null,null,null,"Terminacion anticipada",0.83606557377049184]
[69,2022,"FDLRUU-CD-066-2022","https://Community.seCop.gov.Co/PubliC/Tendering/OpportunityDetail/Index?notiCeUID=CO1.NTC.2681931&isFromPubliCArea=True&isModal=False","Contratos de prestación de servicios profesionales y de apoyo a la gestión","Contratación directa","Prestación de servicios profesionales y de apoyo a la gestión, o para la ejecución de trabajos artísticos que sólo puedan encomendarse a determinadas personas naturales","PRESTAR LOS SERVICIOS PERSONALES DE APOYO A LA GESTIÓN EN LA CONDUCCIÓN DE LOS VEHÍCULOS LIVIANOS A CARGO DEL FONDO DE DESARROLLO LOCAL DE RAFAEL URIBE URIBE","Inversión","Un nuevo contrato social y ambiental para la Bogotá del Siglo XXI",57,{"$f":"IF(ISERROR(VLOOKUP(K80,Proposito_programa!$C$2:$E$59,2,FALSE)),\" \",VLOOKUP(K80,Proposito_programa!$C$2:$E$59,2,FALSE))","v":"Gestión pública local"},{"$f":"IF(ISERROR(VLOOKUP(K80,Proposito_programa!$C$2:$E$59,3,FALSE)),\" \",VLOOKUP(K80,Proposito_programa!$C$2:$E$59,3,FALSE))","v":"Propósito 5: Construir Bogotá - Región con gobierno abierto, transparente y ciudadanía consciente"},"O23011605570000001697",1,79533887,"HERNANDO RUIZ SEGURA","Persona Natural",null,null,null,null,29700000,null,1,3150000,32850000,27450000,"2022-01-25","2022-01-26","2023-01-22",330,1,35,null,null,null,null,"Terminacion Anticipada",0.83561643835616439]
[70,2022,"FDLRUU-CD-066-2022","https://Community.seCop.gov.Co/PubliC/Tendering/OpportunityDetail/Index?notiCeUID=CO1.NTC.2681931&isFromPubliCArea=True&isModal=False","Contratos de prestación de servicios profesionales y de apoyo a la gestión","Contratación directa","Prestación de servicios profesionales y de apoyo a la gestión, o para la ejecución de trabajos artísticos que sólo puedan encomendarse a determinadas personas naturales","PRESTAR LOS SERVICIOS PERSONALES DE APOYO A LA GESTIÓN EN LA CONDUCCIÓN DE LOS VEHÍCULOS LIVIANOS A CARGO DEL FONDO DE DESARROLLO LOCAL DE RAFAEL URIBE URIBE","Inversión","Un nuevo contrato social y ambiental para la Bogotá del Siglo XXI",57,{"$f":"IF(ISERROR(VLOOKUP(K81,Proposito_programa!$C$2:$E$59,2,FALSE)),\" \",VLOOKUP(K81,Proposito_programa!$C$2:$E$59,2,FALSE))","v":"Gestión pública local"},{"$f":"IF(ISERROR(VLOOKUP(K81,Proposito_programa!$C$2:$E$59,3,FALSE)),\" \",VLOOKUP(K81,Proposito_programa!$C$2:$E$59,3,FALSE))","v":"Propósito 5: Construir Bogotá - Región con gobierno abierto, transparente y ciudadanía consciente"},"O23011605570000001697",1,1000834541,"LUIS ANGEL QUINTERO PEREZ ","Persona Natural",null,null,null,null,29700000,null,1,2430000,32130000,24030000,"2022-01-28","2022-02-04","2023-01-27",330,1,27,1013603721,"EDUARD FABIAN RUCINQUE RODRIGUEZ ","2022-11-22",24030000,"Terminacion anticipada",0.74789915966386555]
[71,2022,"FDLRUU-CD-071-2022","https://Community.seCop.gov.Co/PubliC/Tendering/OpportunityDetail/Index?notiCeUID=CO1.NTC.2683479&isFromPubliCArea=True&isModal=False","Contratos de prestación de servicios profesionales y de apoyo a la gestión","Contratación directa","Prestación de servicios profesionales y de apoyo a la gestión, o para la ejecución de trabajos artísticos que sólo puedan encomendarse a determinadas personas naturales","PRESTAR SERVICIOS DE APOYO ADMINISTRATIVO ASISTENCIAL AL AREA DE GESTION POLICIVA EN TRÁMITES DE COMPARENDOS Y QUERELLAS DE CONFORMIDAD CON CON EL CODIGO NACIONAL DE POLICIA LEY 1801 DE 2016 DE LA ALCALDÍA LOCAL DE RAFAEL URIBE URIBE.","Inversión","Un nuevo contrato social y ambiental para la Bogotá del Siglo XXI",57,{"$f":"IF(ISERROR(VLOOKUP(K82,Proposito_programa!$C$2:$E$59,2,FALSE)),\" \",VLOOKUP(K82,Proposito_programa!$C$2:$E$59,2,FALSE))","v":"Gestión pública local"},{"$f":"IF(ISERROR(VLOOKUP(K82,Proposito_programa!$C$2:$E$59,3,FALSE)),\" \",VLOOKUP(K82,Proposito_programa!$C$2:$E$59,3,FALSE))","v":"Propósito 5: Construir Bogotá - Región con gobierno abierto, transparente y ciudadanía consciente"},"O23011605570000001698",1,80810407,"ANDRES CAMILO REDONDO RENGIFO","Persona Natural",null,null,null,null,29700000,null,1,3150000,32850000,27450000,"2022-01-24","2022-01-26","2023-01-23",330,1,35,null,null,null,null,"Terminacion anticipada",0.83561643835616439]
[72,2022,"FDLRUU-CD-071-2022","https://Community.seCop.gov.Co/PubliC/Tendering/OpportunityDetail/Index?notiCeUID=CO1.NTC.2683479&isFromPubliCArea=True&isModal=False","Contratos de prestación de servicios profesionales y de apoyo a la gestión","Contratación directa","Prestación de servicios profesionales y de apoyo a la gestión, o para la ejecución de trabajos artísticos que sólo puedan encomendarse a determinadas personas naturales","PRESTAR SERVICIOS DE APOYO ADMINISTRATIVO ASISTENCIAL AL AREA DE GESTION POLICIVA EN TRÁMITES DE COMPARENDOS Y QUERELLAS DE CONFORMIDAD CON CON EL CODIGO NACIONAL DE POLICIA LEY 1801 DE 2016 DE LA ALCALDÍA LOCAL DE RAFAEL URIBE URIBE.","Inversión","Un nuevo contrato social y ambiental para la Bogotá del Siglo XXI",57,{"$f":"IF(ISERROR(VLOOKUP(K83,Proposito_programa!$C$2:$E$59,2,FALSE)),\" \",VLOOKUP(K83,Proposito_programa!$C$2:$E$59,2,FALSE))","v":"Gestión pública local"},{"$f":"IF(ISERROR(VLOOKUP(K83,Proposito_programa!$C$2:$E$59,3,FALSE)),\" \",VLOOKUP(K83,Proposito_programa!$C$2:$E$59,3,FALSE))","v":"Propósito 5: Construir Bogotá - Región con gobierno abierto, transparente y ciudadanía consciente"},"O23011605570000001698",1,1033764978,"ANDREA DEL PILAR RODRIGUEZ RODRIGUEZ","Persona Natural",null,null,null,null,29700000,null,1,3060000,32760000,27360000,"2022-01-24","2022-01-27","2023-01-30",330,1,34,null,null,null,null,"Terminado",0.8351648351648352]
[73,2022,"FDLRUU-CD-073-2022","https://Community.seCop.gov.Co/PubliC/Tendering/OpportunityDetail/Index?notiCeUID=CO1.NTC.2690935&isFromPubliCArea=True&isModal=False","Contratos de prestación de servicios profesionales y de apoyo a la gestión","Contratación directa","Prestación de servicios profesionales y de apoyo a la gestión, o para la ejecución de trabajos artísticos que sólo puedan encomendarse a determinadas personas naturales","PRESTAR APOYO ASISTENCIAL A LOS PROCESOS ADMINISTRATIVOS PARA LA ATENCIÓN A LA CIUDADANÍA, TRANSCRIPCIÓN DE ACTAS, PROYECCIÓN DE COMUNICACIONES, ASISTENCIA A SESIONES Y APOYO A LA GESTIÓN DOCUMENTAL DE LOS DOCUMENTOS GENERADOS POR LA JUNTA ADMINISTRADORA LOCAL","Inversión","Un nuevo contrato social y ambiental para la Bogotá del Siglo XXI",57,{"$f":"IF(ISERROR(VLOOKUP(K84,Proposito_programa!$C$2:$E$59,2,FALSE)),\" \",VLOOKUP(K84,Proposito_programa!$C$2:$E$59,2,FALSE))","v":"Gestión pública local"},{"$f":"IF(ISERROR(VLOOKUP(K84,Proposito_programa!$C$2:$E$59,3,FALSE)),\" \",VLOOKUP(K84,Proposito_programa!$C$2:$E$59,3,FALSE))","v":"Propósito 5: Construir Bogotá - Región con gobierno abierto, transparente y ciudadanía consciente"},"O23011605570000001697",1,1033808967,"YAZMIN CLARIBETH INFANTE BUSTOS","Persona Natural",null,null,null,null,29700000,null,1,2610000,32310000,26910000,"2022-01-25","2022-02-02","2023-01-22",330,1,29,null,null,null,null,"Terminacion anticipada",0.83286908077994426]
[74,2022,"FDLRUU-CD-074-2022","https://Community.seCop.gov.Co/PubliC/Tendering/OpportunityDetail/Index?notiCeUID=CO1.NTC.2689251&isFromPubliCArea=True&isModal=False","Contratos de prestación de servicios profesionales y de apoyo a la gestión","Contratación directa","Prestación de servicios profesionales y de apoyo a la gestión, o para la ejecución de trabajos artísticos que sólo puedan encomendarse a determinadas personas naturales","PRESTAR LOS SERVICIOS TECNICOS Y ADMINISTRATIVOS PARA LA ATENCIÓN A LA CIUDADANÍA, TRANSCRIPCIÓN DE ACTAS, PROYECCIÓN DE COMUNICACIONES, ASISTENCIA A SESIONES Y APOYO A LA GESTIÓN DOCUMENTAL DE LOS DOCUMENTOS GENERADOS POR LA JUNTA ADMINISTRADORA LOCAL","Inversión","Un nuevo contrato social y ambiental para la Bogotá del Siglo XXI",57,{"$f":"IF(ISERROR(VLOOKUP(K85,Proposito_programa!$C$2:$E$59,2,FALSE)),\" \",VLOOKUP(K85,Proposito_programa!$C$2:$E$59,2,FALSE))","v":"Gestión pública local"},{"$f":"IF(ISERROR(VLOOKUP(K85,Proposito_programa!$C$2:$E$59,3,FALSE)),\" \",VLOOKUP(K85,Proposito_programa!$C$2:$E$59,3,FALSE))","v":"Propósito 5: Construir Bogotá - Región con gobierno abierto, transparente y ciudadanía consciente"},"O23011605570000001697",1,80071371,"JAIME ALEXANDER BARBOSA VILLALBA","Persona Natural",null,null,null,null,37400000,null,1,3966667,41366667,34566667,"2022-01-25","2022-01-26","2023-01-23",330,1,35,null,null,null,null,"Terminacion anticipada",0.83561643968077004]
[75,2022,"FDLRUU-CD-075-2022","https://Community.seCop.gov.Co/PubliC/Tendering/OpportunityDetail/Index?notiCeUID=CO1.NTC.2692626&isFromPubliCArea=True&isModal=False","Contratos de prestación de servicios profesionales y de apoyo a la gestión","Contratación directa","Prestación de servicios profesionales y de apoyo a la gestión, o para la ejecución de trabajos artísticos que sólo puedan encomendarse a determinadas personas naturales","PRESTAR LOS SERVICIOS PROFESIONALES PARA APOYAR LA FORMULACION, EJECUCIÓN Y SEGUIMIENTO DE LOS PROYECTOS DE INVERSIÓN EN EL MARCO DEL CUMPLIMIENTO DEL PLAN DE DESARROLLO LOCAL DE LA ALCALDÍA LOCAL DE RAFAEL URIBE URIBE 2021 2024","Inversión","Un nuevo contrato social y ambiental para la Bogotá del Siglo XXI",57,{"$f":"IF(ISERROR(VLOOKUP(K86,Proposito_programa!$C$2:$E$59,2,FALSE)),\" \",VLOOKUP(K86,Proposito_programa!$C$2:$E$59,2,FALSE))","v":"Gestión pública local"},{"$f":"IF(ISERROR(VLOOKUP(K86,Proposito_programa!$C$2:$E$59,3,FALSE)),\" \",VLOOKUP(K86,Proposito_programa!$C$2:$E$59,3,FALSE))","v":"Propósito 5: Construir Bogotá - Región con gobierno abierto, transparente y ciudadanía consciente"},"O23011605570000001697",1,1033679200,"JEIMMY ELIZABETH SANCHEZ SUAREZ","Persona Natural",null,null,null,null,59400000,null,1,6300000,65700000,54900000,"2022-01-25","2022-01-26","2023-01-19",330,1,35,null,null,null,null,"Terminacion anticipada",0.83561643835616439]
[76,2022,"FDLRUU-CD-076-2022","https://Community.seCop.gov.Co/PubliC/Tendering/OpportunityDetail/Index?notiCeUID=CO1.NTC.2708656&isFromPubliCArea=True&isModal=False","Contratos de prestación de servicios profesionales y de apoyo a la gestión","Contratación directa","Prestación de servicios profesionales y de apoyo a la gestión, o para la ejecución de trabajos artísticos que sólo puedan encomendarse a determinadas personas naturales","PRESTAR LOS SERVICIOS PROFESIONALES EN EL ÁREA DE GESTIÓN DE DESARROLLO LOCAL APOYANDO LA GESTION, ANALISIS Y SEGUIMIENTO DE LA INFORMACIÓN FINANCIERA Y PRESUPUESTAL EN CUMPLIMIENTO ALMARCO NORMATIVO\t","Inversión","Un nuevo contrato social y ambiental para la Bogotá del Siglo XXI",57,{"$f":"IF(ISERROR(VLOOKUP(K87,Proposito_programa!$C$2:$E$59,2,FALSE)),\" \",VLOOKUP(K87,Proposito_programa!$C$2:$E$59,2,FALSE))","v":"Gestión pública local"},{"$f":"IF(ISERROR(VLOOKUP(K87,Proposito_programa!$C$2:$E$59,3,FALSE)),\" \",VLOOKUP(K87,Proposito_programa!$C$2:$E$59,3,FALSE))","v":"Propósito 5: Construir Bogotá - Región con gobierno abierto, transparente y ciudadanía consciente"},"O23011605570000001697",1,1026276229,"ERIKA LIZETH ROJAS RONDON","Persona Natural",null,null,null,null,50600000,null,1,4600000,55200000,46000000,"2022-02-25","2022-02-01","2023-01-30",330,1,30,null,null,null,null,"Terminado",0.83333333333333337]
[77,2022,"FDLRUU-CD-077-2022","\nhttps://Community.seCop.gov.Co/PubliC/Tendering/OpportunityDetail/Index?notiCeUID=CO1.NTC.2697947&isFromPubliCArea=True&isModal=False","Contratos de prestación de servicios profesionales y de apoyo a la gestión","Contratación directa","Prestación de servicios profesionales y de apoyo a la gestión, o para la ejecución de trabajos artísticos que sólo puedan encomendarse a determinadas personas naturales","PRESTAR SUS SERVICIOS PROFESIONALES PARA APOYAR EL ALCALDE LOCAL EN LA GESTIÓN DE LOS ASUNTOS RELACIONADOS CON SEGURIDAD CIUDADANA, CONVIVENCIA Y PREVENCIÓN DE CONFLICTIVIDADES, VIOLENCIAS Y DELITOS EN LA LOCALIDAD, DE CONFORMIDAD CON EL MARCO NORMATIVO APLICABLE EN LA MATERIA EN LA ALCALDÍA LOCAL DE RAFAEL URIBE URIBE.","Inversión","Un nuevo contrato social y ambiental para la Bogotá del Siglo XXI",57,{"$f":"IF(ISERROR(VLOOKUP(K88,Proposito_programa!$C$2:$E$59,2,FALSE)),\" \",VLOOKUP(K88,Proposito_programa!$C$2:$E$59,2,FALSE))","v":"Gestión pública local"},{"$f":"IF(ISERROR(VLOOKUP(K88,Proposito_programa!$C$2:$E$59,3,FALSE)),\" \",VLOOKUP(K88,Proposito_programa!$C$2:$E$59,3,FALSE))","v":"Propósito 5: Construir Bogotá - Región con gobierno abierto, transparente y ciudadanía consciente"},"O23011605570000001698",1,52501843,"LIDIA JESUSA LOPEZ DULCEY","Persona Natural",null,null,null,null,75900000,null,1,7820000,83720000,69920000,"2022-01-25","2022-01-27","2023-01-22",330,1,34,null,null,null,null,"Terminacion anticipada",0.8351648351648352]
[78,2022,"FDLRUU-CD-078-2022","https://Community.seCop.gov.Co/PubliC/Tendering/OpportunityDetail/Index?notiCeUID=CO1.NTC.2688122&isFromPubliCArea=True&isModal=False","Contratos de prestación de servicios profesionales y de apoyo a la gestión","Contratación directa","Prestación de servicios profesionales y de apoyo a la gestión, o para la ejecución de trabajos artísticos que sólo puedan encomendarse a determinadas personas naturales","APOYA EL CUBRIMIENTO DE LAS ACTIVIDADES, CRONOGRAMAS Y AGENDA DE LA ALCALDÍA LOCAL A NIVEL INTERNO Y EXTERNO, ASÍ COMO LA GENERACIÓN DE CONTENIDOS PERIODÍSTICOS","Inversión","Un nuevo contrato social y ambiental para la Bogotá del Siglo XXI",57,{"$f":"IF(ISERROR(VLOOKUP(K89,Proposito_programa!$C$2:$E$59,2,FALSE)),\" \",VLOOKUP(K89,Proposito_programa!$C$2:$E$59,2,FALSE))","v":"Gestión pública local"},{"$f":"IF(ISERROR(VLOOKUP(K89,Proposito_programa!$C$2:$E$59,3,FALSE)),\" \",VLOOKUP(K89,Proposito_programa!$C$2:$E$59,3,FALSE))","v":"Propósito 5: Construir Bogotá - Región con gobierno abierto, transparente y ciudadanía consciente"},"O23011605570000001697",1,1032457982,"JUAN MANUEL CARDENAS GARZON","Persona Natural",null,null,null,null,59400000,null,1,5400000,64800000,54000000,"2022-01-25","2022-02-01","2023-01-30",330,1,30,null,null,null,null,"Terminado",0.83333333333333337]
[79,2022,"FDLRUU-CD-079-2022","https://Community.seCop.gov.Co/PubliC/Tendering/OpportunityDetail/Index?notiCeUID=CO1.NTC.2690994&isFromPubliCArea=True&isModal=False","Contratos de prestación de servicios profesionales y de apoyo a la gestión","Contratación directa","Prestación de servicios profesionales y de apoyo a la gestión, o para la ejecución de trabajos artísticos que sólo puedan encomendarse a determinadas personas naturales","APOYAR AL EQUIPO DE PRENSA Y COMUNICACIONES DE LA ALCALDÍA LOCAL EN LA CREACIÓN, REALIZACIÓN, PRODUCCIÓN Y EDICIÓN DE VÍDEOS, ASÍ COMO EL REGISTRO, EDICIÓN Y LA PRESENTACIÓN DE FOTOGRAFÍAS DE LOS ACONTECIMIENTOS, HECHOS Y EVENTOS EXTERNOS E INTERNOS DE LA ALCALDÍA PARA SER UTILIZADOS COMO INSUMOS DE COMUNICACIÓN EN LOS MEDIOS, ESPECIALMENTE ESCRITOS, DIGITALES Y AUDIOVISUALES.","Inversión","Un nuevo contrato social y ambiental para la Bogotá del Siglo XXI",57,{"$f":"IF(ISERROR(VLOOKUP(K90,Proposito_programa!$C$2:$E$59,2,FALSE)),\" \",VLOOKUP(K90,Proposito_programa!$C$2:$E$59,2,FALSE))","v":"Gestión pública local"},{"$f":"IF(ISERROR(VLOOKUP(K90,Proposito_programa!$C$2:$E$59,3,FALSE)),\" \",VLOOKUP(K90,Proposito_programa!$C$2:$E$59,3,FALSE))","v":"Propósito 5: Construir Bogotá - Región con gobierno abierto, transparente y ciudadanía consciente"},"O23011605570000001697",1,1013661860,"JOAN SEBASTIAN CALVO CONDE","Persona Natural",null,null,null,null,59400000,null,1,6120000,65520000,54720000,"2022-01-25","2022-01-27","2023-01-22",330,1,34,null,null,null,null,"Terminacion anticipada",0.8351648351648352]
[81,2022,"FDLRUU-CD-081-2022","https://Community.seCop.gov.Co/PubliC/Tendering/OpportunityDetail/Index?notiCeUID=CO1.NTC.2695527&isFromPubliCArea=True&isModal=False","Contratos de prestación de servicios profesionales y de apoyo a la gestión","Contratación directa","Prestación de servicios profesionales y de apoyo a la gestión, o para la ejecución de trabajos artísticos que sólo puedan encomendarse a determinadas personas naturales","PRESTAR LOS SERVICIOS PROFESIONALES PARA APOYAR LA FORMULACION, EJECUCIÓN Y SEGUIMIENTO DE LOS PROYECTOS DE INVERSIÓN EN EL MARCO DEL CUMPLIMIENTO DEL PLAN DE DESARROLLO LOCAL DE LA ALCALDÍA LOCAL DE RAFAEL URIBE URIBE 2021 2024","Inversión","Un nuevo contrato social y ambiental para la Bogotá del Siglo XXI",57,{"$f":"IF(ISERROR(VLOOKUP(K91,Proposito_programa!$C$2:$E$59,2,FALSE)),\" \",VLOOKUP(K91,Proposito_programa!$C$2:$E$59,2,FALSE))","v":"Gestión pública local"},{"$f":"IF(ISERROR(VLOOKUP(K91,Proposito_programa!$C$2:$E$59,3,FALSE)),\" \",VLOOKUP(K91,Proposito_programa!$C$2:$E$59,3,FALSE))","v":"Propósito 5: Construir Bogotá - Región con gobierno abierto, transparente y ciudadanía consciente"},"O23011605570000001697",1,1014213321,"MARIBEL NEUSA SOTELO","Persona Natural",null,null,null,null,59400000,null,1,5400000,64800000,54000000,"2022-01-25","2022-02-01","2023-01-25",330,1,30,null,null,null,null,"Terminacion anticipada",0.83333333333333337]
[82,2022,"FDLRUU-CD-082-2022","https://Community.seCop.gov.Co/PubliC/Tendering/OpportunityDetail/Index?notiCeUID=CO1.NTC.2687705&isFromPubliCArea=True&isModal=False\n","Contratos de prestación de servicios profesionales y de apoyo a la gestión","Contratación directa","Prestación de servicios profesionales y de apoyo a la gestión, o para la ejecución de trabajos artísticos que sólo puedan encomendarse a determinadas personas naturales","PRESTAR LOS SERVICIOS PROFESIONALES PARA APOYAR LA FORMULACION, EJECUCIÓN Y SEGUIMIENTO DE LOS PROYECTOS DE INVERSIÓN EN EL MARCO DEL CUMPLIMIENTO DEL PLAN DE DESARROLLO LOCAL DE LA ALCALDÍA LOCAL DE RAFAEL URIBE URIBE 2021 2024","Inversión","Un nuevo contrato social y ambiental para la Bogotá del Siglo XXI",57,{"$f":"IF(ISERROR(VLOOKUP(K92,Proposito_programa!$C$2:$E$59,2,FALSE)),\" \",VLOOKUP(K92,Proposito_programa!$C$2:$E$59,2,FALSE))","v":"Gestión pública local"},{"$f":"IF(ISERROR(VLOOKUP(K92,Proposito_programa!$C$2:$E$59,3,FALSE)),\" \",VLOOKUP(K92,Proposito_programa!$C$2:$E$59,3,FALSE))","v":"Propósito 5: Construir Bogotá - Región con gobierno abierto, transparente y ciudadanía consciente"},"O23011605570000001697",1,1013620667,"CRISTHIAN DAVID GUTIERREZ MEDINA","Persona Natural",null,null,null,null,59400000,null,1,6120000,65520000,54720000,"2022-01-24","2022-01-27","2023-01-23",330,1,34,null,null,null,null,"Terminacion anticipada",0.8351648351648352]
[83,2022,"FDLRUU-CD-083-2022","https://Community.seCop.gov.Co/PubliC/Tendering/OpportunityDetail/Index?notiCeUID=CO1.NTC.2688413&isFromPubliCArea=True&isModal=False\n","Contratos de prestación de servicios profesionales y de apoyo a la gestión","Contratación directa","Prestación de servicios profesionales y de apoyo a la gestión, o para la ejecución de trabajos artísticos que sólo puedan encomendarse a determinadas personas naturales","PRESTAR LOS SERVICIOS PROFESIONALES ESPECIALIZADOS PARA APOYAR EL AREA DE GESTION DE DESARROLLO LOCAL DEL FONDO DE DESARROLLO LOCAL DE RAFAEL URIBE URIBE A FIN DE ORGANIZAR Y ORIENTAR LA EJECUCIÓN Y SEGUIMIENTO DE LAS ACTIVIDADES DE LOS PROCESOS ASOCIADOS CON EL ÁREA, ASÍ COMO DE LOS PROYECTOS DE INVERSIÓN DEL PLAN DE DESARROLLO LOCAL VIGENCIA 2021  2024","Inversión","Un nuevo contrato social y ambiental para la Bogotá del Siglo XXI",57,{"$f":"IF(ISERROR(VLOOKUP(K93,Proposito_programa!$C$2:$E$59,2,FALSE)),\" \",VLOOKUP(K93,Proposito_programa!$C$2:$E$59,2,FALSE))","v":"Gestión pública local"},{"$f":"IF(ISERROR(VLOOKUP(K93,Proposito_programa!$C$2:$E$59,3,FALSE)),\" \",VLOOKUP(K93,Proposito_programa!$C$2:$E$59,3,FALSE))","v":"Propósito 5: Construir Bogotá - Región con gobierno abierto, transparente y ciudadanía consciente"},"O23011605570000001697",1,79380897,"JESUS BAYRO MUÑOZ FELIX","Persona Natural",null,null,null,null,78100000,null,1,8046667,86146667,71946667,"2022-01-25","2022-01-27","2023-01-25",330,1,34,7143459,"SAUL ANIBAL RODRIGUEZ GONZALEZ","2022-03-01",8046667,"Terminacion anticipada",0.83516483580264345]
[84,2022,"FDLRUU-CD-084-2022","https://Community.seCop.gov.Co/PubliC/Tendering/OpportunityDetail/Index?notiCeUID=CO1.NTC.2689559&isFromPubliCArea=True&isModal=False","Contratos de prestación de servicios profesionales y de apoyo a la gestión","Contratación directa","Prestación de servicios profesionales y de apoyo a la gestión, o para la ejecución de trabajos artísticos que sólo puedan encomendarse a determinadas personas naturales","PRESTAR LOS SERVICIOS PROFESIONALES PARA APOYAR LA FORMULACION, EJECUCIÓN Y SEGUIMIENTO DE LOS PROYECTOS DE INVERSIÓN EN EL MARCO DEL CUMPLIMIENTO DEL PLAN DE DESARROLLO LOCAL DE LA ALCALDÍA LOCAL DE RAFAEL URIBE URIBE 2021 2024","Inversión","Un nuevo contrato social y ambiental para la Bogotá del Siglo XXI",57,{"$f":"IF(ISERROR(VLOOKUP(K94,Proposito_programa!$C$2:$E$59,2,FALSE)),\" \",VLOOKUP(K94,Proposito_programa!$C$2:$E$59,2,FALSE))","v":"Gestión pública local"},{"$f":"IF(ISERROR(VLOOKUP(K94,Proposito_programa!$C$2:$E$59,3,FALSE)),\" \",VLOOKUP(K94,Proposito_programa!$C$2:$E$59,3,FALSE))","v":"Propósito 5: Construir Bogotá - Región con gobierno abierto, transparente y ciudadanía consciente"},"O23011605570000001697",1,1070962440,"YEFFERSON ANTOLYN ALTAMIRANDA BUITRAGO","Persona Natural",null,null,null,null,59400000,null,1,6300000,65700000,54900000,"2022-01-24","2022-01-26","2023-01-26",330,1,35,null,null,null,null,"Terminacion anticipada",0.83561643835616439]
[85,2022,"FDLRUU-CD-085-2022","https://Community.seCop.gov.Co/PubliC/Tendering/OpportunityDetail/Index?notiCeUID=CO1.NTC.2692157&isFromPubliCArea=True&isModal=False","Contratos de prestación de servicios profesionales y de apoyo a la gestión","Contratación directa","Prestación de servicios profesionales y de apoyo a la gestión, o para la ejecución de trabajos artísticos que sólo puedan encomendarse a determinadas personas naturales","PRESTAR LOS SERVICIOS PROFESIONALES PARA APOYAR LA FORMULACION, EJECUCIÓN Y SEGUIMIENTO DE LOS PROYECTOS DE INVERSIÓN EN EL MARCO DEL CUMPLIMIENTO DEL PLAN DE DESARROLLO LOCAL DE LA ALCALDÍA LOCAL DE RAFAEL URIBE URIBE 2021 2024\t","Inversión","Un nuevo contrato social y ambiental para la Bogotá del Siglo XXI",57,{"$f":"IF(ISERROR(VLOOKUP(K95,Proposito_programa!$C$2:$E$59,2,FALSE)),\" \",VLOOKUP(K95,Proposito_programa!$C$2:$E$59,2,FALSE))","v":"Gestión pública local"},{"$f":"IF(ISERROR(VLOOKUP(K95,Proposito_programa!$C$2:$E$59,3,FALSE)),\" \",VLOOKUP(K95,Proposito_programa!$C$2:$E$59,3,FALSE))","v":"Propósito 5: Construir Bogotá - Región con gobierno abierto, transparente y ciudadanía consciente"},"O23011605570000001697",1,1077859493,"YANDRY PATRICIA AMAYA CULMA","Persona Natural",null,null,null,null,59400000,null,1,5940000,65340000,54540000,"2022-01-25","2022-01-28","2023-01-30",330,1,33,null,null,null,null,"Terminado",0.83471074380165289]
[86,2022,"FDLRUU-CD-086-2022","https://Community.seCop.gov.Co/PubliC/Tendering/OpportunityDetail/Index?notiCeUID=CO1.NTC.2689790&isFromPubliCArea=True&isModal=False","Contratos de prestación de servicios profesionales y de apoyo a la gestión","Contratación directa","Prestación de servicios profesionales y de apoyo a la gestión, o para la ejecución de trabajos artísticos que sólo puedan encomendarse a determinadas personas naturales","PRESTAR SERVICIOS DE APOYO A LA GESTIÓN LOCAL Y TERRITORIAL DE LOS TEMAS DE SEGURIDAD Y CONVIVENCIA CIUDADANA PARA LA ALCALDÍA LOCAL DE RAFAEL URIBE URIBE EN EL MARCO DEL PROYECTO DE INVERSION 1680 CIUDADANOS MÁS SEGUROS Y CON CONFIANZA EN LA JUSTICIA EN RAFAEL","Inversión","Un nuevo contrato social y ambiental para la Bogotá del Siglo XXI",43,{"$f":"IF(ISERROR(VLOOKUP(K96,Proposito_programa!$C$2:$E$59,2,FALSE)),\" \",VLOOKUP(K96,Proposito_programa!$C$2:$E$59,2,FALSE))","v":"Cultura ciudadana para la confianza, la convivencia y la participación desde la vida cotidiana"},{"$f":"IF(ISERROR(VLOOKUP(K96,Proposito_programa!$C$2:$E$59,3,FALSE)),\" \",VLOOKUP(K96,Proposito_programa!$C$2:$E$59,3,FALSE))","v":"Propósito 3: Inspirar confianza y legitimidad para vivir sin miedo y ser epicentro de cultura ciudadana, paz y reconciliación"},"O23011603430000001680",1,79908252,"ALEXANDER ARAGON ORTEGA","Persona Natural",null,null,null,null,25300000,null,1,2300000,27600000,23000000,"2022-01-25","2022-02-01","2023-01-22",330,1,30,null,null,null,null,"Terminacion anticipada",0.83333333333333337]
[87,2022,"FDLRUU-CD-086-2022","https://Community.seCop.gov.Co/PubliC/Tendering/OpportunityDetail/Index?notiCeUID=CO1.NTC.2689790&isFromPubliCArea=True&isModal=False","Contratos de prestación de servicios profesionales y de apoyo a la gestión","Contratación directa","Prestación de servicios profesionales y de apoyo a la gestión, o para la ejecución de trabajos artísticos que sólo puedan encomendarse a determinadas personas naturales","PRESTAR SERVICIOS DE APOYO A LA GESTIÓN LOCAL Y TERRITORIAL DE LOS TEMAS DE SEGURIDAD Y CONVIVENCIA CIUDADANA PARA LA ALCALDÍA LOCAL DE RAFAEL URIBE URIBE EN EL MARCO DEL PROYECTO DE INVERSION 1680 CIUDADANOS MÁS SEGUROS Y CON CONFIANZA EN LA JUSTICIA EN RAFAEL","Inversión","Un nuevo contrato social y ambiental para la Bogotá del Siglo XXI",43,{"$f":"IF(ISERROR(VLOOKUP(K97,Proposito_programa!$C$2:$E$59,2,FALSE)),\" \",VLOOKUP(K97,Proposito_programa!$C$2:$E$59,2,FALSE))","v":"Cultura ciudadana para la confianza, la convivencia y la participación desde la vida cotidiana"},{"$f":"IF(ISERROR(VLOOKUP(K97,Proposito_programa!$C$2:$E$59,3,FALSE)),\" \",VLOOKUP(K97,Proposito_programa!$C$2:$E$59,3,FALSE))","v":"Propósito 3: Inspirar confianza y legitimidad para vivir sin miedo y ser epicentro de cultura ciudadana, paz y reconciliación"},"O23011603430000001680",1,3232660,"FERNANDO PEDRAZA","Persona Natural",null,null,null,null,25300000,null,1,2606667,27906667,23306667,"2022-01-25","2022-01-27","2023-01-22",330,1,34,null,null,null,null,"Terminacion anticipada",0.83516483713372147]
[88,2022,"FDLRUU-CD-086-2022","https://Community.seCop.gov.Co/PubliC/Tendering/OpportunityDetail/Index?notiCeUID=CO1.NTC.2689790&isFromPubliCArea=True&isModal=False","Contratos de prestación de servicios profesionales y de apoyo a la gestión","Contratación directa","Prestación de servicios profesionales y de apoyo a la gestión, o para la ejecución de trabajos artísticos que sólo puedan encomendarse a determinadas personas naturales","PRESTAR SERVICIOS DE APOYO A LA GESTIÓN LOCAL Y TERRITORIAL DE LOS TEMAS DE SEGURIDAD Y CONVIVENCIA CIUDADANA PARA LA ALCALDÍA LOCAL DE RAFAEL URIBE URIBE EN EL MARCO DEL PROYECTO DE INVERSION 1680 CIUDADANOS MÁS SEGUROS Y CON CONFIANZA EN LA JUSTICIA EN RAFAEL","Inversión","Un nuevo contrato social y ambiental para la Bogotá del Siglo XXI",43,{"$f":"IF(ISERROR(VLOOKUP(K98,Proposito_programa!$C$2:$E$59,2,FALSE)),\" \",VLOOKUP(K98,Proposito_programa!$C$2:$E$59,2,FALSE))","v":"Cultura ciudadana para la confianza, la convivencia y la participación desde la vida cotidiana"},{"$f":"IF(ISERROR(VLOOKUP(K98,Proposito_programa!$C$2:$E$59,3,FALSE)),\" \",VLOOKUP(K98,Proposito_programa!$C$2:$E$59,3,FALSE))","v":"Propósito 3: Inspirar confianza y legitimidad para vivir sin miedo y ser epicentro de cultura ciudadana, paz y reconciliación"},"O23011603430000001680",1,1023882603,"MANUEL DUVAN GONZALO VELASQUEZ GRACIA","Persona Natural",null,null,null,null,25300000,null,1,2606667,27906667,23306667,"2022-01-25","2022-01-27","2023-01-22",330,1,34,null,null,null,null,"Terminacion anticipada",0.83516483713372147]
[89,2022,"FDLRUU-CD-086-2022","https://Community.seCop.gov.Co/PubliC/Tendering/OpportunityDetail/Index?notiCeUID=CO1.NTC.2689790&isFromPubliCArea=True&isModal=False","Contratos de prestación de servicios profesionales y de apoyo a la gestión","Contratación directa","Prestación de servicios profesionales y de apoyo a la gestión, o para la ejecución de trabajos artísticos que sólo puedan encomendarse a determinadas personas naturales","PRESTAR SERVICIOS DE APOYO A LA GESTIÓN LOCAL Y TERRITORIAL DE LOS TEMAS DE SEGURIDAD Y CONVIVENCIA CIUDADANA PARA LA ALCALDÍA LOCAL DE RAFAEL URIBE URIBE EN EL MARCO DEL PROYECTO DE INVERSION 1680 CIUDADANOS MÁS SEGUROS Y CON CONFIANZA EN LA JUSTICIA EN RAFAEL","Inversión","Un nuevo contrato social y ambiental para la Bogotá del Siglo XXI",43,{"$f":"IF(ISERROR(VLOOKUP(K99,Proposito_programa!$C$2:$E$59,2,FALSE)),\" \",VLOOKUP(K99,Proposito_programa!$C$2:$E$59,2,FALSE))","v":"Cultura ciudadana para la confianza, la convivencia y la participación desde la vida cotidiana"},{"$f":"IF(ISERROR(VLOOKUP(K99,Proposito_programa!$C$2:$E$59,3,FALSE)),\" \",VLOOKUP(K99,Proposito_programa!$C$2:$E$59,3,FALSE))","v":"Propósito 3: Inspirar confianza y legitimidad para vivir sin miedo y ser epicentro de cultura ciudadana, paz y reconciliación"},"O23011603430000001680",1,53002331,"SANDRA LILIANA HERNANDEZ ARAGON","Persona Natural",null,null,null,null,25300000,null,1,2606667,27906667,23306667,"2022-01-25","2022-01-27","2023-01-22",330,1,34,null,null,null,null,"Terminacion anticipada",0.83516483713372147]
[90,2022,"FDLRUU-CD-086-2022","https://Community.seCop.gov.Co/PubliC/Tendering/OpportunityDetail/Index?notiCeUID=CO1.NTC.2689790&isFromPubliCArea=True&isModal=False","Contratos de prestación de servicios profesionales y de apoyo a la gestión","Contratación directa","Prestación de servicios profesionales y de apoyo a la gestión, o para la ejecución de trabajos artísticos que sólo puedan encomendarse a determinadas personas naturales","PRESTAR SERVICIOS DE APOYO A LA GESTIÓN LOCAL Y TERRITORIAL DE LOS TEMAS DE SEGURIDAD Y CONVIVENCIA CIUDADANA PARA LA ALCALDÍA LOCAL DE RAFAEL URIBE URIBE EN EL MARCO DEL PROYECTO DE INVERSION 1680 CIUDADANOS MÁS SEGUROS Y CON CONFIANZA EN LA JUSTICIA EN RAFAEL","Inversión","Un nuevo contrato social y ambiental para la Bogotá del Siglo XXI",43,{"$f":"IF(ISERROR(VLOOKUP(K100,Proposito_programa!$C$2:$E$59,2,FALSE)),\" \",VLOOKUP(K100,Proposito_programa!$C$2:$E$59,2,FALSE))","v":"Cultura ciudadana para la confianza, la convivencia y la participación desde la vida cotidiana"},{"$f":"IF(ISERROR(VLOOKUP(K100,Proposito_programa!$C$2:$E$59,3,FALSE)),\" \",VLOOKUP(K100,Proposito_programa!$C$2:$E$59,3,FALSE))","v":"Propósito 3: Inspirar confianza y legitimidad para vivir sin miedo y ser epicentro de cultura ciudadana, paz y reconciliación"},"O23011603430000001680",1,1032410626,"YESID ALEJANDRO MORENO MARTINEZ","Persona Natural",null,null,null,null,25300000,null,1,2606667,27906667,23306667,"2022-01-25","2022-01-27","2023-01-23",330,1,34,null,null,null,null,"Terminacion anticipada",0.83516483713372147]
[91,2022,"FDLRUU-CD-086-2022","https://Community.seCop.gov.Co/PubliC/Tendering/OpportunityDetail/Index?notiCeUID=CO1.NTC.2689790&isFromPubliCArea=True&isModal=False","Contratos de prestación de servicios profesionales y de apoyo a la gestión","Contratación directa","Prestación de servicios profesionales y de apoyo a la gestión, o para la ejecución de trabajos artísticos que sólo puedan encomendarse a determinadas personas naturales","PRESTAR SERVICIOS DE APOYO A LA GESTIÓN LOCAL Y TERRITORIAL DE LOS TEMAS DE SEGURIDAD Y CONVIVENCIA CIUDADANA PARA LA ALCALDÍA LOCAL DE RAFAEL URIBE URIBE EN EL MARCO DEL PROYECTO DE INVERSION 1680 CIUDADANOS MÁS SEGUROS Y CON CONFIANZA EN LA JUSTICIA EN RAFAEL","Inversión","Un nuevo contrato social y ambiental para la Bogotá del Siglo XXI",43,{"$f":"IF(ISERROR(VLOOKUP(K101,Proposito_programa!$C$2:$E$59,2,FALSE)),\" \",VLOOKUP(K101,Proposito_programa!$C$2:$E$59,2,FALSE))","v":"Cultura ciudadana para la confianza, la convivencia y la participación desde la vida cotidiana"},{"$f":"IF(ISERROR(VLOOKUP(K101,Proposito_programa!$C$2:$E$59,3,FALSE)),\" \",VLOOKUP(K101,Proposito_programa!$C$2:$E$59,3,FALSE))","v":"Propósito 3: Inspirar confianza y legitimidad para vivir sin miedo y ser epicentro de cultura ciudadana, paz y reconciliación"},"O23011603430000001680",1,52951502,"MONICA MARIA SAENZ DELGADILLO","Persona Natural",null,null,null,null,25300000,null,1,2530000,27830000,{"$f":"4600000+AL101","v":23230000},"2022-01-25","2022-01-28","2023-01-26",330,1,33,79496051,"RAFAEL GALVIS MONCADA","2022-09-29",18630000,"Terminacion anticipada",0.83471074380165289]
[92,2022,"FDLRUU-CD-086-2022","https://Community.seCop.gov.Co/PubliC/Tendering/OpportunityDetail/Index?notiCeUID=CO1.NTC.2689790&isFromPubliCArea=True&isModal=False","Contratos de prestación de servicios profesionales y de apoyo a la gestión","Contratación directa","Prestación de servicios profesionales y de apoyo a la gestión, o para la ejecución de trabajos artísticos que sólo puedan encomendarse a determinadas personas naturales","PRESTAR SERVICIOS DE APOYO A LA GESTIÓN LOCAL Y TERRITORIAL DE LOS TEMAS DE SEGURIDAD Y CONVIVENCIA CIUDADANA PARA LA ALCALDÍA LOCAL DE RAFAEL URIBE URIBE EN EL MARCO DEL PROYECTO DE INVERSION 1680 CIUDADANOS MÁS SEGUROS Y CON CONFIANZA EN LA JUSTICIA EN RAFAEL","Inversión","Un nuevo contrato social y ambiental para la Bogotá del Siglo XXI",43,{"$f":"IF(ISERROR(VLOOKUP(K102,Proposito_programa!$C$2:$E$59,2,FALSE)),\" \",VLOOKUP(K102,Proposito_programa!$C$2:$E$59,2,FALSE))","v":"Cultura ciudadana para la confianza, la convivencia y la participación desde la vida cotidiana"},{"$f":"IF(ISERROR(VLOOKUP(K102,Proposito_programa!$C$2:$E$59,3,FALSE)),\" \",VLOOKUP(K102,Proposito_programa!$C$2:$E$59,3,FALSE))","v":"Propósito 3: Inspirar confianza y legitimidad para vivir sin miedo y ser epicentro de cultura ciudadana, paz y reconciliación"},"O23011603430000001680",1,1022444715,"ARLY JOHANA LIMAS ROJAS","Persona Natural",null,null,null,null,25300000,null,1,2530000,27830000,23230000,"2022-01-26","2022-01-28","2023-01-19",330,1,33,null,null,null,null,"Terminacion anticipada",0.83471074380165289]
[93,2022,"FDLRUU-CD-086-2022","https://Community.seCop.gov.Co/PubliC/Tendering/OpportunityDetail/Index?notiCeUID=CO1.NTC.2689790&isFromPubliCArea=True&isModal=False","Contratos de prestación de servicios profesionales y de apoyo a la gestión","Contratación directa","Prestación de servicios profesionales y de apoyo a la gestión, o para la ejecución de trabajos artísticos que sólo puedan encomendarse a determinadas personas naturales","PRESTAR SERVICIOS DE APOYO A LA GESTIÓN LOCAL Y TERRITORIAL DE LOS TEMAS DE SEGURIDAD Y CONVIVENCIA CIUDADANA PARA LA ALCALDÍA LOCAL DE RAFAEL URIBE URIBE EN EL MARCO DEL PROYECTO DE INVERSION 1680 CIUDADANOS MÁS SEGUROS Y CON CONFIANZA EN LA JUSTICIA EN RAFAEL","Inversión","Un nuevo contrato social y ambiental para la Bogotá del Siglo XXI",43,{"$f":"IF(ISERROR(VLOOKUP(K103,Proposito_programa!$C$2:$E$59,2,FALSE)),\" \",VLOOKUP(K103,Proposito_programa!$C$2:$E$59,2,FALSE))","v":"Cultura ciudadana para la confianza, la convivencia y la participación desde la vida cotidiana"},{"$f":"IF(ISERROR(VLOOKUP(K103,Proposito_programa!$C$2:$E$59,3,FALSE)),\" \",VLOOKUP(K103,Proposito_programa!$C$2:$E$59,3,FALSE))","v":"Propósito 3: Inspirar confianza y legitimidad para vivir sin miedo y ser epicentro de cultura ciudadana, paz y reconciliación"},"O23011603430000001680",1,51912017,"ANA DOLORES SANABRIA QUIROGA","Persona Natural",null,null,null,null,25300000,null,1,2530000,27830000,23230000,"2022-01-26","2022-01-28","2023-01-19",330,1,33,null,null,null,null,"Terminacion anticipada",0.83471074380165289]
[94,2022,"FDLRUU-CD-086-2022","https://Community.seCop.gov.Co/PubliC/Tendering/OpportunityDetail/Index?notiCeUID=CO1.NTC.2689790&isFromPubliCArea=True&isModal=False","Contratos de prestación de servicios profesionales y de apoyo a la gestión","Contratación directa","Prestación de servicios profesionales y de apoyo a la gestión, o para la ejecución de trabajos artísticos que sólo puedan encomendarse a determinadas personas naturales","PRESTAR SERVICIOS DE APOYO A LA GESTIÓN LOCAL Y TERRITORIAL DE LOS TEMAS DE SEGURIDAD Y CONVIVENCIA CIUDADANA PARA LA ALCALDÍA LOCAL DE RAFAEL URIBE URIBE EN EL MARCO DEL PROYECTO DE INVERSION 1680 CIUDADANOS MÁS SEGUROS Y CON CONFIANZA EN LA JUSTICIA EN RAFAEL","Inversión","Un nuevo contrato social y ambiental para la Bogotá del Siglo XXI",43,{"$f":"IF(ISERROR(VLOOKUP(K104,Proposito_programa!$C$2:$E$59,2,FALSE)),\" \",VLOOKUP(K104,Proposito_programa!$C$2:$E$59,2,FALSE))","v":"Cultura ciudadana para la confianza, la convivencia y la participación desde la vida cotidiana"},{"$f":"IF(ISERROR(VLOOKUP(K104,Proposito_programa!$C$2:$E$59,3,FALSE)),\" \",VLOOKUP(K104,Proposito_programa!$C$2:$E$59,3,FALSE))","v":"Propósito 3: Inspirar confianza y legitimidad para vivir sin miedo y ser epicentro de cultura ciudadana, paz y reconciliación"},"O23011603430000001680",1,2970813,"GUILLERMO MORENO","Persona Natural",null,null,null,null,25300000,null,1,2530000,27830000,23230000,"2022-01-27","2022-01-28","2023-01-19",330,1,33,null,null,null,null,"Terminacion anticipada",0.83471074380165289]
[95,2022,"FDLRUU-CD-086-2022","https://Community.seCop.gov.Co/PubliC/Tendering/OpportunityDetail/Index?notiCeUID=CO1.NTC.2689790&isFromPubliCArea=True&isModal=False","Contratos de prestación de servicios profesionales y de apoyo a la gestión","Contratación directa","Prestación de servicios profesionales y de apoyo a la gestión, o para la ejecución de trabajos artísticos que sólo puedan encomendarse a determinadas personas naturales","PRESTAR SERVICIOS DE APOYO A LA GESTIÓN LOCAL Y TERRITORIAL DE LOS TEMAS DE SEGURIDAD Y CONVIVENCIA CIUDADANA PARA LA ALCALDÍA LOCAL DE RAFAEL URIBE URIBE EN EL MARCO DEL PROYECTO DE INVER SION 1680 CIUDADANOS MÁS SEGUROS Y CON CONFIANZA EN LA JUSTICIA EN RAFAEL URIBE URIBE\t","Inversión","Un nuevo contrato social y ambiental para la Bogotá del Siglo XXI",43,{"$f":"IF(ISERROR(VLOOKUP(K105,Proposito_programa!$C$2:$E$59,2,FALSE)),\" \",VLOOKUP(K105,Proposito_programa!$C$2:$E$59,2,FALSE))","v":"Cultura ciudadana para la confianza, la convivencia y la participación desde la vida cotidiana"},{"$f":"IF(ISERROR(VLOOKUP(K105,Proposito_programa!$C$2:$E$59,3,FALSE)),\" \",VLOOKUP(K105,Proposito_programa!$C$2:$E$59,3,FALSE))","v":"Propósito 3: Inspirar confianza y legitimidad para vivir sin miedo y ser epicentro de cultura ciudadana, paz y reconciliación"},"O23011603430000001680",1,1023892888,"KAREN MAYERLY MORENO MARIN","Persona Natural",null,null,null,null,25300000,null,1,2530000,27830000,23230000,"2022-01-26","2022-01-28","2023-01-19",330,1,33,null,null,null,null,"Terminacion anticipada",0.83471074380165289]
[96,2022,"FDLRUU-CD-086-2022","https://Community.seCop.gov.Co/PubliC/Tendering/OpportunityDetail/Index?notiCeUID=CO1.NTC.2689790&isFromPubliCArea=True&isModal=False","Contratos de prestación de servicios profesionales y de apoyo a la gestión","Contratación directa","Prestación de servicios profesionales y de apoyo a la gestión, o para la ejecución de trabajos artísticos que sólo puedan encomendarse a determinadas personas naturales","PRESTAR SERVICIOS DE APOYO A LA GESTIÓN LOCAL Y TERRITORIAL DE LOS TEMAS DE SEGURIDAD Y CONVIVENCIA CIUDADANA PARA LA ALCALDÍA LOCAL DE RAFAEL URIBE URIBE EN EL MARCO DEL PROYECTO DE INVERSION 1680 CIUDADANOS MÁS SEGUROS Y CON CONFIANZA EN LA JUSTICIA EN RAFAEL URIBE URIBE\t","Inversión","Un nuevo contrato social y ambiental para la Bogotá del Siglo XXI",43,{"$f":"IF(ISERROR(VLOOKUP(K106,Proposito_programa!$C$2:$E$59,2,FALSE)),\" \",VLOOKUP(K106,Proposito_programa!$C$2:$E$59,2,FALSE))","v":"Cultura ciudadana para la confianza, la convivencia y la participación desde la vida cotidiana"},{"$f":"IF(ISERROR(VLOOKUP(K106,Proposito_programa!$C$2:$E$59,3,FALSE)),\" \",VLOOKUP(K106,Proposito_programa!$C$2:$E$59,3,FALSE))","v":"Propósito 3: Inspirar confianza y legitimidad para vivir sin miedo y ser epicentro de cultura ciudadana, paz y reconciliación"},"O23011603430000001680",1,79640008,"WILLIAM BOLIVAR MACA","Persona Natural",null,null,null,null,25300000,null,1,2530000,27830000,23230000,"2022-01-26","2022-01-28","2023-01-25",330,1,33,null,null,null,null,"Terminacion anticipada",0.83471074380165289]
[97,2022,"FDLRUU-CD-086-2022","https://Community.seCop.gov.Co/PubliC/Tendering/OpportunityDetail/Index?notiCeUID=CO1.NTC.2689790&isFromPubliCArea=True&isModal=False","Contratos de prestación de servicios profesionales y de apoyo a la gestión","Contratación directa","Prestación de servicios profesionales y de apoyo a la gestión, o para la ejecución de trabajos artísticos que sólo puedan encomendarse a determinadas personas naturales","PRESTAR SERVICIOS DE APOYO A LA GESTIÓN LOCAL Y TERRITORIAL DE LOS TEMAS DE SEGURIDAD Y CONVIVENCIA CIUDADANA PARA LA ALCALDÍA LOCAL DE RAFAEL URIBE URIBE EN EL MARCO DEL PROYECTO DE INVER SION 1680 CIUDADANOS MÁS SEGUROS Y CON CONFIANZA EN LA JUSTICIA EN RAFAEL URIBE URIBE\t","Inversión","Un nuevo contrato social y ambiental para la Bogotá del Siglo XXI",43,{"$f":"IF(ISERROR(VLOOKUP(K107,Proposito_programa!$C$2:$E$59,2,FALSE)),\" \",VLOOKUP(K107,Proposito_programa!$C$2:$E$59,2,FALSE))","v":"Cultura ciudadana para la confianza, la convivencia y la participación desde la vida cotidiana"},{"$f":"IF(ISERROR(VLOOKUP(K107,Proposito_programa!$C$2:$E$59,3,FALSE)),\" \",VLOOKUP(K107,Proposito_programa!$C$2:$E$59,3,FALSE))","v":"Propósito 3: Inspirar confianza y legitimidad para vivir sin miedo y ser epicentro de cultura ciudadana, paz y reconciliación"},"O23011603430000001680",1,1013642971,"VANESSA MOLANO GALEANO","Persona Natural",null,null,null,null,25300000,null,null,null,25300000,22386667,"2022-01-28","2022-02-09","2023-01-08",330,null,null,null,null,null,null,"Terminado",0.88484849802371546]
[98,2022,"FDLRUU-CD-086-2022","https://Community.seCop.gov.Co/PubliC/Tendering/OpportunityDetail/Index?notiCeUID=CO1.NTC.2689790&isFromPubliCArea=True&isModal=False","Contratos de prestación de servicios profesionales y de apoyo a la gestión","Contratación directa","Prestación de servicios profesionales y de apoyo a la gestión, o para la ejecución de trabajos artísticos que sólo puedan encomendarse a determinadas personas naturales","PRESTAR SERVICIOS DE APOYO A LA GESTIÓN LOCAL Y TERRITORIAL DE LOS TEMAS DE SEGURIDAD Y CONVIVENCIA CIUDADANA PARA LA ALCALDÍA LOCAL DE RAFAEL URIBE URIBE EN EL MARCO DEL PROYECTO DE INVERSION 1680 CIUDADANOS MÁS SEGUROS Y CON CONFIANZA EN LA JUSTICIA EN RAFAEL","Inversión","Un nuevo contrato social y ambiental para la Bogotá del Siglo XXI",43,{"$f":"IF(ISERROR(VLOOKUP(K108,Proposito_programa!$C$2:$E$59,2,FALSE)),\" \",VLOOKUP(K108,Proposito_programa!$C$2:$E$59,2,FALSE))","v":"Cultura ciudadana para la confianza, la convivencia y la participación desde la vida cotidiana"},{"$f":"IF(ISERROR(VLOOKUP(K108,Proposito_programa!$C$2:$E$59,3,FALSE)),\" \",VLOOKUP(K108,Proposito_programa!$C$2:$E$59,3,FALSE))","v":"Propósito 3: Inspirar confianza y legitimidad para vivir sin miedo y ser epicentro de cultura ciudadana, paz y reconciliación"},"O23011603430000001680",1,1013643216,"EVELYN ESTEFANY MOSQUERA DAVILA","Persona Natural",null,null,null,null,25300000,null,1,2530000,27830000,23230000,"2022-01-26","2022-01-28","2023-01-19",330,1,33,null,null,null,null,"Terminacion anticipada",0.83471074380165289]
[99,2022,"FDLRUU-CD-086-2022","https://Community.seCop.gov.Co/PubliC/Tendering/OpportunityDetail/Index?notiCeUID=CO1.NTC.2689790&isFromPubliCArea=True&isModal=False","Contratos de prestación de servicios profesionales y de apoyo a la gestión","Contratación directa","Prestación de servicios profesionales y de apoyo a la gestión, o para la ejecución de trabajos artísticos que sólo puedan encomendarse a determinadas personas naturales","PRESTAR SERVICIOS DE APOYO A LA GESTIÓN LOCAL Y TERRITORIAL DE LOS TEMAS DE SEGURIDAD Y CONVIVENCIA CIUDADANA PARA LA ALCALDÍA LOCAL DE RAFAEL URIBE URIBE EN EL MARCO DEL PROYECTO DE INVERSION 1680 CIUDADANOS MÁS SEGUROS Y CON CONFIANZA EN LA JUSTICIA EN RAFAEL\t","Inversión","Un nuevo contrato social y ambiental para la Bogotá del Siglo XXI",43,{"$f":"IF(ISERROR(VLOOKUP(K109,Proposito_programa!$C$2:$E$59,2,FALSE)),\" \",VLOOKUP(K109,Proposito_programa!$C$2:$E$59,2,FALSE))","v":"Cultura ciudadana para la confianza, la convivencia y la participación desde la vida cotidiana"},{"$f":"IF(ISERROR(VLOOKUP(K109,Proposito_programa!$C$2:$E$59,3,FALSE)),\" \",VLOOKUP(K109,Proposito_programa!$C$2:$E$59,3,FALSE))","v":"Propósito 3: Inspirar confianza y legitimidad para vivir sin miedo y ser epicentro de cultura ciudadana, paz y reconciliación"},"O23011603430000001680",1,80911828,"ELISEO ROMERO","Persona Natural",null,null,null,null,25300000,null,1,2300000,27600000,23000000,"2022-01-26","2022-02-01","2023-01-25",330,1,30,null,null,null,null,"Terminacion anticipada",0.83333333333333337]
[100,2022,"FDLRUU-CD-086-2022","https://Community.seCop.gov.Co/PubliC/Tendering/OpportunityDetail/Index?notiCeUID=CO1.NTC.2689790&isFromPubliCArea=True&isModal=False","Contratos de prestación de servicios profesionales y de apoyo a la gestión","Contratación directa","Prestación de servicios profesionales y de apoyo a la gestión, o para la ejecución de trabajos artísticos que sólo puedan encomendarse a determinadas personas naturales","PRESTAR SERVICIOS DE APOYO A LA GESTIÓN LOCAL Y TERRITORIAL DE LOS TEMAS DE SEGURIDAD Y CONVIVENCIA CIUDADANA PARA LA ALCALDÍA LOCAL DE RAFAEL URIBE URIBE EN EL MARCO DEL PROYECTO DE INVERSION 1680 CIUDADANOS MÁS SEGUROS Y CON CONFIANZA EN LA JUSTICIA EN RAFAEL\t","Inversión","Un nuevo contrato social y ambiental para la Bogotá del Siglo XXI",43,{"$f":"IF(ISERROR(VLOOKUP(K110,Proposito_programa!$C$2:$E$59,2,FALSE)),\" \",VLOOKUP(K110,Proposito_programa!$C$2:$E$59,2,FALSE))","v":"Cultura ciudadana para la confianza, la convivencia y la participación desde la vida cotidiana"},{"$f":"IF(ISERROR(VLOOKUP(K110,Proposito_programa!$C$2:$E$59,3,FALSE)),\" \",VLOOKUP(K110,Proposito_programa!$C$2:$E$59,3,FALSE))","v":"Propósito 3: Inspirar confianza y legitimidad para vivir sin miedo y ser epicentro de cultura ciudadana, paz y reconciliación"},"O23011603430000001680",1,1031172956,"CAMILO ANDRES MARROQUIN RUIZ","Persona Natural",null,null,null,null,25300000,null,1,2300000,27600000,23000000,"2022-01-26","2022-02-01","2023-01-30",330,1,30,null,null,null,null,"Terminado",0.83333333333333337]
[101,2022,"FDLRUU-CD-086-2022","https://Community.seCop.gov.Co/PubliC/Tendering/OpportunityDetail/Index?notiCeUID=CO1.NTC.2689790&isFromPubliCArea=True&isModal=False","Contratos de prestación de servicios profesionales y de apoyo a la gestión","Contratación directa","Prestación de servicios profesionales y de apoyo a la gestión, o para la ejecución de trabajos artísticos que sólo puedan encomendarse a determinadas personas naturales","\"PRESTAR SERVICIOS DE APOYO A LA GESTIÓN LOCAL Y TERRITORIAL DE LOS TEMAS DE SEGURIDAD Y CONVIVENCIA CIUDADANA PARA LA ALCALDÍA LOCAL DE RAFAEL URIBE URIBE EN EL MARCO DEL PROYECTO DE INVERSION 1680 CIUDADANOS MÁS SEGUROS Y CON CONFIANZA EN LA JUSTICIA EN RAFAEL.\".\t","Inversión","Un nuevo contrato social y ambiental para la Bogotá del Siglo XXI",43,{"$f":"IF(ISERROR(VLOOKUP(K111,Proposito_programa!$C$2:$E$59,2,FALSE)),\" \",VLOOKUP(K111,Proposito_programa!$C$2:$E$59,2,FALSE))","v":"Cultura ciudadana para la confianza, la convivencia y la participación desde la vida cotidiana"},{"$f":"IF(ISERROR(VLOOKUP(K111,Proposito_programa!$C$2:$E$59,3,FALSE)),\" \",VLOOKUP(K111,Proposito_programa!$C$2:$E$59,3,FALSE))","v":"Propósito 3: Inspirar confianza y legitimidad para vivir sin miedo y ser epicentro de cultura ciudadana, paz y reconciliación"},"O23011603430000001680",1,80029346,"GUSTAVO ALEXANDER CAMARGO REYES","Persona Natural",null,null,null,null,25300000,null,1,2300000,27600000,23000000,"2022-01-26","2022-02-01","2023-01-23",330,1,30,null,null,null,null,"Terminacion Anticipada",0.83333333333333337]
[102,2022,"FDLRUU-CD-086-2022","https://Community.seCop.gov.Co/PubliC/Tendering/OpportunityDetail/Index?notiCeUID=CO1.NTC.2689790&isFromPubliCArea=True&isModal=False","Contratos de prestación de servicios profesionales y de apoyo a la gestión","Contratación directa","Prestación de servicios profesionales y de apoyo a la gestión, o para la ejecución de trabajos artísticos que sólo puedan encomendarse a determinadas personas naturales","\"PRESTAR SERVICIOS DE APOYO A LA GESTIÓN LOCAL Y TERRITORIAL DE LOS TEMAS DE SEGURIDAD Y CONVIVENCIA CIUDADANA PARA LA ALCALDÍA LOCAL DE RAFAEL URIBE URIBE EN EL MARCO DEL PROYECTO DE INVERSION 1680 CIUDADANOS MÁS SEGUROS Y CON CONFIANZA EN LA JUSTICIA EN RAFAEL.\".\t","Inversión","Un nuevo contrato social y ambiental para la Bogotá del Siglo XXI",43,{"$f":"IF(ISERROR(VLOOKUP(K112,Proposito_programa!$C$2:$E$59,2,FALSE)),\" \",VLOOKUP(K112,Proposito_programa!$C$2:$E$59,2,FALSE))","v":"Cultura ciudadana para la confianza, la convivencia y la participación desde la vida cotidiana"},{"$f":"IF(ISERROR(VLOOKUP(K112,Proposito_programa!$C$2:$E$59,3,FALSE)),\" \",VLOOKUP(K112,Proposito_programa!$C$2:$E$59,3,FALSE))","v":"Propósito 3: Inspirar confianza y legitimidad para vivir sin miedo y ser epicentro de cultura ciudadana, paz y reconciliación"},"O23011603430000001680",1,52538269,"GLORIA YISETH RINCON HENAO","Persona Natural",null,null,null,null,25300000,null,1,2300000,27600000,23000000,"2022-01-28","2022-02-01","2023-01-25",330,1,30,null,null,null,null,"Terminacion anticipada",0.83333333333333337]
[103,2022,"FDLRUU-CD-086-2022","https://Community.seCop.gov.Co/PubliC/Tendering/OpportunityDetail/Index?notiCeUID=CO1.NTC.2689790&isFromPubliCArea=True&isModal=False","Contratos de prestación de servicios profesionales y de apoyo a la gestión","Contratación directa","Prestación de servicios profesionales y de apoyo a la gestión, o para la ejecución de trabajos artísticos que sólo puedan encomendarse a determinadas personas naturales","\"PRESTAR SERVICIOS DE APOYO A LA GESTIÓN LOCAL Y TERRITORIAL DE LOS TEMAS DE SEGURIDAD Y CONVIVENCIA CIUDADANA PARA LA ALCALDÍA LOCAL DE RAFAEL URIBE URIBE EN EL MARCO DEL PROYECTO DE INVERSION 1680 CIUDADANOS MÁS SEGUROS Y CON CONFIANZA EN LA JUSTICIA EN RAFAEL.\".\t","Inversión","Un nuevo contrato social y ambiental para la Bogotá del Siglo XXI",43,{"$f":"IF(ISERROR(VLOOKUP(K113,Proposito_programa!$C$2:$E$59,2,FALSE)),\" \",VLOOKUP(K113,Proposito_programa!$C$2:$E$59,2,FALSE))","v":"Cultura ciudadana para la confianza, la convivencia y la participación desde la vida cotidiana"},{"$f":"IF(ISERROR(VLOOKUP(K113,Proposito_programa!$C$2:$E$59,3,FALSE)),\" \",VLOOKUP(K113,Proposito_programa!$C$2:$E$59,3,FALSE))","v":"Propósito 3: Inspirar confianza y legitimidad para vivir sin miedo y ser epicentro de cultura ciudadana, paz y reconciliación"},"O23011603430000001680",1,1031148872,"SANDRA MILENA MUÑOZ NAVARRO","Persona Natural",null,null,null,null,25300000,null,1,2300000,27600000,23000000,"2022-01-26","2022-02-01","2023-01-26",330,1,30,null,null,null,null,"Terminacion anticipada",0.83333333333333337]
[104,2022,"FDLRUU-CD-086-2022","https://Community.seCop.gov.Co/PubliC/Tendering/OpportunityDetail/Index?notiCeUID=CO1.NTC.2689790&isFromPubliCArea=True&isModal=False","Contratos de prestación de servicios profesionales y de apoyo a la gestión","Contratación directa","Prestación de servicios profesionales y de apoyo a la gestión, o para la ejecución de trabajos artísticos que sólo puedan encomendarse a determinadas personas naturales","\"PRESTAR SERVICIOS DE APOYO A LA GESTIÓN LOCAL Y TERRITORIAL DE LOS TEMAS DE SEGURIDAD Y CONVIVENCIA CIUDADANA PARA LA ALCALDÍA LOCAL DE RAFAEL URIBE URIBE EN EL MARCO DEL PROYECTO DE INVERSION 1680 CIUDADANOS MÁS SEGUROS Y CON CONFIANZA EN LA JUSTICIA EN RAFAEL.\".\t","Inversión","Un nuevo contrato social y ambiental para la Bogotá del Siglo XXI",43,{"$f":"IF(ISERROR(VLOOKUP(K114,Proposito_programa!$C$2:$E$59,2,FALSE)),\" \",VLOOKUP(K114,Proposito_programa!$C$2:$E$59,2,FALSE))","v":"Cultura ciudadana para la confianza, la convivencia y la participación desde la vida cotidiana"},{"$f":"IF(ISERROR(VLOOKUP(K114,Proposito_programa!$C$2:$E$59,3,FALSE)),\" \",VLOOKUP(K114,Proposito_programa!$C$2:$E$59,3,FALSE))","v":"Propósito 3: Inspirar confianza y legitimidad para vivir sin miedo y ser epicentro de cultura ciudadana, paz y reconciliación"},"O23011603430000001680",1,1031150866,"KEVIN PAEZ UBAQUE","Persona Natural",null,null,null,null,25300000,null,1,2300000,27600000,23000000,"2022-01-27","2022-02-01","2023-01-30",330,1,30,null,null,null,null,"Terminado",0.83333333333333337]
[105,2022,"FDLRUU-CD-086-2022","https://Community.seCop.gov.Co/PubliC/Tendering/OpportunityDetail/Index?notiCeUID=CO1.NTC.2689790&isFromPubliCArea=True&isModal=False","Contratos de prestación de servicios profesionales y de apoyo a la gestión","Contratación directa","Prestación de servicios profesionales y de apoyo a la gestión, o para la ejecución de trabajos artísticos que sólo puedan encomendarse a determinadas personas naturales","\"PRESTAR SERVICIOS DE APOYO A LA GESTIÓN LOCAL Y TERRITORIAL DE LOS TEMAS DE SEGURIDAD Y CONVIVENCIA CIUDADANA PARA LA ALCALDÍA LOCAL DE RAFAEL URIBE URIBE EN EL MARCO DEL PROYECTO DE INVERSION 1680 CIUDADANOS MÁS SEGUROS Y CON CONFIANZA EN LA JUSTICIA EN RAFAEL.\".\t","Inversión","Un nuevo contrato social y ambiental para la Bogotá del Siglo XXI",43,{"$f":"IF(ISERROR(VLOOKUP(K115,Proposito_programa!$C$2:$E$59,2,FALSE)),\" \",VLOOKUP(K115,Proposito_programa!$C$2:$E$59,2,FALSE))","v":"Cultura ciudadana para la confianza, la convivencia y la participación desde la vida cotidiana"},{"$f":"IF(ISERROR(VLOOKUP(K115,Proposito_programa!$C$2:$E$59,3,FALSE)),\" \",VLOOKUP(K115,Proposito_programa!$C$2:$E$59,3,FALSE))","v":"Propósito 3: Inspirar confianza y legitimidad para vivir sin miedo y ser epicentro de cultura ciudadana, paz y reconciliación"},"O23011603430000001680",1,28224210,"MATILDE RAMIREZ GUEVARA","Persona Natural",null,null,null,null,25300000,null,1,2300000,27600000,23000000,"2022-01-27","2022-02-01","2023-01-25",330,1,30,null,null,null,null,"Terminacion anticipada",0.83333333333333337]
[106,2022,"FDLRUU-CD-086-2022","https://Community.seCop.gov.Co/PubliC/Tendering/OpportunityDetail/Index?notiCeUID=CO1.NTC.2689790&isFromPubliCArea=True&isModal=False","Contratos de prestación de servicios profesionales y de apoyo a la gestión","Contratación directa","Prestación de servicios profesionales y de apoyo a la gestión, o para la ejecución de trabajos artísticos que sólo puedan encomendarse a determinadas personas naturales","\"PRESTAR SERVICIOS DE APOYO A LA GESTIÓN LOCAL Y TERRITORIAL DE LOS TEMAS DE SEGURIDAD Y CONVIVENCIA CIUDADANA PARA LA ALCALDÍA LOCAL DE RAFAEL URIBE URIBE EN EL MARCO DEL PROYECTO DE INVERSION 1680 CIUDADANOS MÁS SEGUROS Y CON CONFIANZA EN LA JUSTICIA EN RAFAEL.\".\t","Inversión","Un nuevo contrato social y ambiental para la Bogotá del Siglo XXI",43,{"$f":"IF(ISERROR(VLOOKUP(K116,Proposito_programa!$C$2:$E$59,2,FALSE)),\" \",VLOOKUP(K116,Proposito_programa!$C$2:$E$59,2,FALSE))","v":"Cultura ciudadana para la confianza, la convivencia y la participación desde la vida cotidiana"},{"$f":"IF(ISERROR(VLOOKUP(K116,Proposito_programa!$C$2:$E$59,3,FALSE)),\" \",VLOOKUP(K116,Proposito_programa!$C$2:$E$59,3,FALSE))","v":"Propósito 3: Inspirar confianza y legitimidad para vivir sin miedo y ser epicentro de cultura ciudadana, paz y reconciliación"},"O23011603430000001680",1,1031150465,"FREDY ALEJANDRO MONROY ARDILA","Persona Natural",null,null,null,null,25300000,null,1,2223333,27523333,22923333,"2022-01-28","2022-02-02","2023-01-23",330,1,29,null,null,null,null,"Terminacion Anticipada",0.83286907875583238]
[107,2022,"FDLRUU-CD-086-2022","https://Community.seCop.gov.Co/PubliC/Tendering/OpportunityDetail/Index?notiCeUID=CO1.NTC.2689790&isFromPubliCArea=True&isModal=False","Contratos de prestación de servicios profesionales y de apoyo a la gestión","Contratación directa","Prestación de servicios profesionales y de apoyo a la gestión, o para la ejecución de trabajos artísticos que sólo puedan encomendarse a determinadas personas naturales","\"PRESTAR SERVICIOS DE APOYO A LA GESTIÓN LOCAL Y TERRITORIAL DE LOS TEMAS DE SEGURIDAD Y CONVIVENCIA CIUDADANA PARA LA ALCALDÍA LOCAL DE RAFAEL URIBE URIBE EN EL MARCO DEL PROYECTO DE INVERSION 1680 CIUDADANOS MÁS SEGUROS Y CON CONFIANZA EN LA JUSTICIA EN RAFAEL.\".\t","Inversión","Un nuevo contrato social y ambiental para la Bogotá del Siglo XXI",43,{"$f":"IF(ISERROR(VLOOKUP(K117,Proposito_programa!$C$2:$E$59,2,FALSE)),\" \",VLOOKUP(K117,Proposito_programa!$C$2:$E$59,2,FALSE))","v":"Cultura ciudadana para la confianza, la convivencia y la participación desde la vida cotidiana"},{"$f":"IF(ISERROR(VLOOKUP(K117,Proposito_programa!$C$2:$E$59,3,FALSE)),\" \",VLOOKUP(K117,Proposito_programa!$C$2:$E$59,3,FALSE))","v":"Propósito 3: Inspirar confianza y legitimidad para vivir sin miedo y ser epicentro de cultura ciudadana, paz y reconciliación"},"O23011603430000001680",1,80808223,"HAYDUK RODRIGUEZ UBAQUE","Persona Natural",null,null,null,null,25300000,null,1,2300000,27600000,23000000,"2022-01-28","2022-02-01","2023-01-24",330,1,30,null,null,null,null,"Terminacion anticipada",0.83333333333333337]
[108,2022,"FDLRUU-CD-086-2022","https://Community.seCop.gov.Co/PubliC/Tendering/OpportunityDetail/Index?notiCeUID=CO1.NTC.2689790&isFromPubliCArea=True&isModal=False","Contratos de prestación de servicios profesionales y de apoyo a la gestión","Contratación directa","Prestación de servicios profesionales y de apoyo a la gestión, o para la ejecución de trabajos artísticos que sólo puedan encomendarse a determinadas personas naturales","\"PRESTAR SERVICIOS DE APOYO A LA GESTIÓN LOCAL Y TERRITORIAL DE LOS TEMAS DE SEGURIDAD Y CONVIVENCIA CIUDADANA PARA LA ALCALDÍA LOCAL DE RAFAEL URIBE URIBE EN EL MARCO DEL PROYECTO DE INVERSION 1680 CIUDADANOS MÁS SEGUROS Y CON CONFIANZA EN LA JUSTICIA EN RAFAEL.\".\t","Inversión","Un nuevo contrato social y ambiental para la Bogotá del Siglo XXI",43,{"$f":"IF(ISERROR(VLOOKUP(K118,Proposito_programa!$C$2:$E$59,2,FALSE)),\" \",VLOOKUP(K118,Proposito_programa!$C$2:$E$59,2,FALSE))","v":"Cultura ciudadana para la confianza, la convivencia y la participación desde la vida cotidiana"},{"$f":"IF(ISERROR(VLOOKUP(K118,Proposito_programa!$C$2:$E$59,3,FALSE)),\" \",VLOOKUP(K118,Proposito_programa!$C$2:$E$59,3,FALSE))","v":"Propósito 3: Inspirar confianza y legitimidad para vivir sin miedo y ser epicentro de cultura ciudadana, paz y reconciliación"},"O23011603430000001680",1,1031182726,"GABRIELA SILVA CAICEDO ","Persona Natural",null,null,null,null,25300000,null,1,2223333,27523333,22923333,"2022-01-28","2022-02-02","2023-01-26",330,1,29,null,null,null,null,"Terminacion anticipada",0.83286907875583238]
[109,2022,"FDLRUU-CD-086-2022","https://Community.seCop.gov.Co/PubliC/Tendering/OpportunityDetail/Index?notiCeUID=CO1.NTC.2689790&isFromPubliCArea=True&isModal=False","Contratos de prestación de servicios profesionales y de apoyo a la gestión","Contratación directa","Prestación de servicios profesionales y de apoyo a la gestión, o para la ejecución de trabajos artísticos que sólo puedan encomendarse a determinadas personas naturales","\"PRESTAR SERVICIOS DE APOYO A LA GESTIÓN LOCAL Y TERRITORIAL DE LOS TEMAS DE SEGURIDAD Y CONVIVENCIA CIUDADANA PARA LA ALCALDÍA LOCAL DE RAFAEL URIBE URIBE EN EL MARCO DEL PROYECTO DE INVERSION 1680 CIUDADANOS MÁS SEGUROS Y CON CONFIANZA EN LA JUSTICIA EN RAFAEL.\".\t","Inversión","Un nuevo contrato social y ambiental para la Bogotá del Siglo XXI",43,{"$f":"IF(ISERROR(VLOOKUP(K119,Proposito_programa!$C$2:$E$59,2,FALSE)),\" \",VLOOKUP(K119,Proposito_programa!$C$2:$E$59,2,FALSE))","v":"Cultura ciudadana para la confianza, la convivencia y la participación desde la vida cotidiana"},{"$f":"IF(ISERROR(VLOOKUP(K119,Proposito_programa!$C$2:$E$59,3,FALSE)),\" \",VLOOKUP(K119,Proposito_programa!$C$2:$E$59,3,FALSE))","v":"Propósito 3: Inspirar confianza y legitimidad para vivir sin miedo y ser epicentro de cultura ciudadana, paz y reconciliación"},"O23011603430000001680",1,79826479,"ALEXANDER GONZALEZ GAITAN","Persona Natural",null,null,null,null,25300000,null,1,2300000,27600000,23000000,"2022-01-28","2022-02-01","2023-01-25",330,1,30,null,null,null,null,"Terminacion anticipada",0.83333333333333337]
[110,2022,"FDLRUU-CD-086-2022","https://Community.seCop.gov.Co/PubliC/Tendering/OpportunityDetail/Index?notiCeUID=CO1.NTC.2689790&isFromPubliCArea=True&isModal=False","Contratos de prestación de servicios profesionales y de apoyo a la gestión","Contratación directa","Prestación de servicios profesionales y de apoyo a la gestión, o para la ejecución de trabajos artísticos que sólo puedan encomendarse a determinadas personas naturales","\"PRESTAR SERVICIOS DE APOYO A LA GESTIÓN LOCAL Y TERRITORIAL DE LOS TEMAS DE SEGURIDAD Y CONVIVENCIA CIUDADANA PARA LA ALCALDÍA LOCAL DE RAFAEL URIBE URIBE EN EL MARCO DEL PROYECTO DE INVERSION 1680 CIUDADANOS MÁS SEGUROS Y CON CONFIANZA EN LA JUSTICIA EN RAFAEL.\".\t","Inversión","Un nuevo contrato social y ambiental para la Bogotá del Siglo XXI",43,{"$f":"IF(ISERROR(VLOOKUP(K120,Proposito_programa!$C$2:$E$59,2,FALSE)),\" \",VLOOKUP(K120,Proposito_programa!$C$2:$E$59,2,FALSE))","v":"Cultura ciudadana para la confianza, la convivencia y la participación desde la vida cotidiana"},{"$f":"IF(ISERROR(VLOOKUP(K120,Proposito_programa!$C$2:$E$59,3,FALSE)),\" \",VLOOKUP(K120,Proposito_programa!$C$2:$E$59,3,FALSE))","v":"Propósito 3: Inspirar confianza y legitimidad para vivir sin miedo y ser epicentro de cultura ciudadana, paz y reconciliación"},"O23011603430000001680",1,79637330,"JUAN MANUEL MARTIN BERMUDEZ","Persona Natural",null,null,null,null,25300000,null,1,2070000,27370000,22770000,"2022-01-28","2022-02-04","2023-01-30",330,1,27,null,null,null,null,"Terminado",0.83193277310924374]
[111,2022,"FDLRUU-CD-111-2022","https://community.secop.gov.co/Public/Tendering/OpportunityDetail/Index?noticeUID=CO1.NTC.2744543&isFromPublicArea=True&isModal=False","Contratos de prestación de servicios profesionales y de apoyo a la gestión","Contratación directa","Prestación de servicios profesionales y de apoyo a la gestión, o para la ejecución de trabajos artísticos que sólo puedan encomendarse a determinadas personas naturales","APOYAR ADMINISTRATIVA Y ASISTENCIALMENTE A LAS INSPECCIONES DE POLICÍA DE LA LOCALIDAD DE RAFAEL URIBE URIBE","Inversión","Un nuevo contrato social y ambiental para la Bogotá del Siglo XXI",57,{"$f":"IF(ISERROR(VLOOKUP(K121,Proposito_programa!$C$2:$E$59,2,FALSE)),\" \",VLOOKUP(K121,Proposito_programa!$C$2:$E$59,2,FALSE))","v":"Gestión pública local"},{"$f":"IF(ISERROR(VLOOKUP(K121,Proposito_programa!$C$2:$E$59,3,FALSE)),\" \",VLOOKUP(K121,Proposito_programa!$C$2:$E$59,3,FALSE))","v":"Propósito 5: Construir Bogotá - Región con gobierno abierto, transparente y ciudadanía consciente"},"O23011605570000001698",1,1023955863,"ALLISON KATHERINE PEREZ MENDEZ","Persona Natural",null,null,null,null,20680000,null,1,1880000,22560000,18800000,"2022-01-27","2022-02-01","2023-01-30",330,1,30,null,null,null,null,"Terminado",0.83333333333333337]
[112,2022,"FDLRUU-CD-112-2022","https://Community.seCop.gov.Co/PubliC/Tendering/OpportunityDetail/Index?notiCeUID=CO1.NTC.2691537&isFromPubliCArea=True&isModal=False","Contratos de prestación de servicios profesionales y de apoyo a la gestión","Contratación directa","Prestación de servicios profesionales y de apoyo a la gestión, o para la ejecución de trabajos artísticos que sólo puedan encomendarse a determinadas personas naturales","PRESTAR LOS SERVICIOS PROFESIONALES PARA LA REVISIÓN Y/O ELABORACIÓN DE LOS DOCUMENTOS Y GESTIONES PROVENIENTES DE LAS DIFERENTES ÁREAS RELACIONADAS CON TEMAS ADMINISTRATIVOS CONTABLES Y FINANCIEROS DEL FONDO DE DESARROLLO LOCAL DE RAFAEL URIBE URIBE","Inversión","Un nuevo contrato social y ambiental para la Bogotá del Siglo XXI",57,{"$f":"IF(ISERROR(VLOOKUP(K122,Proposito_programa!$C$2:$E$59,2,FALSE)),\" \",VLOOKUP(K122,Proposito_programa!$C$2:$E$59,2,FALSE))","v":"Gestión pública local"},{"$f":"IF(ISERROR(VLOOKUP(K122,Proposito_programa!$C$2:$E$59,3,FALSE)),\" \",VLOOKUP(K122,Proposito_programa!$C$2:$E$59,3,FALSE))","v":"Propósito 5: Construir Bogotá - Región con gobierno abierto, transparente y ciudadanía consciente"},"O23011605570000001697",1,51913151,"CLARA INÉS ROMERO REYES","Persona Natural",null,null,null,null,50600000,null,1,5213333,55813333,46613333,"2022-01-26","2022-01-27","2023-01-30",330,1,34,null,null,null,null,"Terminado",0.835164834180392]
[113,2022,"FDLRUU-CD-113-2022","https://Community.seCop.gov.Co/PubliC/Tendering/OpportunityDetail/Index?notiCeUID=CO1.NTC.2754075&isFromPubliCArea=True&isModal=False","Contratos de prestación de servicios profesionales y de apoyo a la gestión","Contratación directa","Prestación de servicios profesionales y de apoyo a la gestión, o para la ejecución de trabajos artísticos que sólo puedan encomendarse a determinadas personas naturales","\"PRESTAR SERVICIOS PROFESIONALES PARA INCENTIVAR PROCESOS DE PARTICIPACIÓN, CONVIVENCIA CIUDADANA Y EL USO DEL ESPACIO PÚBLICO DESDE UNA PERSPECTIVA DE PAZ Y DIALOGO, LLEVANDO A CABO ACUERDOS CIUDADANOS EN EL MARCO DEL PROYECTO 1681.\".\t","Inversión","Un nuevo contrato social y ambiental para la Bogotá del Siglo XXI",45,{"$f":"IF(ISERROR(VLOOKUP(K123,Proposito_programa!$C$2:$E$59,2,FALSE)),\" \",VLOOKUP(K123,Proposito_programa!$C$2:$E$59,2,FALSE))","v":"Espacio público más seguro y construido colectivamente"},{"$f":"IF(ISERROR(VLOOKUP(K123,Proposito_programa!$C$2:$E$59,3,FALSE)),\" \",VLOOKUP(K123,Proposito_programa!$C$2:$E$59,3,FALSE))","v":"Propósito 3: Inspirar confianza y legitimidad para vivir sin miedo y ser epicentro de cultura ciudadana, paz y reconciliación"},"O23011603450000001681",1,80129534,"CARLOS ANDRES MENDEZ MOJICA","Persona Natural",null,null,null,null,31200000,null,1,15600000,46800000,46626667,"2022-01-27","2022-02-02","2022-11-01",180,1,90,null,null,null,null,"Terminado",0.99629630341880338]
[114,2022,"FDLRUU-CD-114-2022","https://Community.seCop.gov.Co/PubliC/Tendering/OpportunityDetail/Index?notiCeUID=CO1.NTC.2697875&isFromPubliCArea=True&isModal=False\n","Contratos de prestación de servicios profesionales y de apoyo a la gestión","Contratación directa","Prestación de servicios profesionales y de apoyo a la gestión, o para la ejecución de trabajos artísticos que sólo puedan encomendarse a determinadas personas naturales","APOYAR ADMINISTRATIVA Y ASISTENCIALMENTE A LAS INSPECCIONES DE POLICÍA DE LA LOCALIDAD DE RAFAEL URIBE URIBE","Inversión","Un nuevo contrato social y ambiental para la Bogotá del Siglo XXI",57,{"$f":"IF(ISERROR(VLOOKUP(K124,Proposito_programa!$C$2:$E$59,2,FALSE)),\" \",VLOOKUP(K124,Proposito_programa!$C$2:$E$59,2,FALSE))","v":"Gestión pública local"},{"$f":"IF(ISERROR(VLOOKUP(K124,Proposito_programa!$C$2:$E$59,3,FALSE)),\" \",VLOOKUP(K124,Proposito_programa!$C$2:$E$59,3,FALSE))","v":"Propósito 5: Construir Bogotá - Región con gobierno abierto, transparente y ciudadanía consciente"},"O23011605570000001698",1,80124179,"CARLOS ANDRES TORRES ROMERO","Persona Natural",null,null,null,null,20680000,null,1,1880000,22560000,18800000,"2022-01-25","2022-01-27","2023-01-30",330,1,30,null,null,null,null,"Terminado",0.83333333333333337]
[115,2022,"FDLRUU-CD-115-2022","https://Community.seCop.gov.Co/PubliC/Tendering/OpportunityDetail/Index?notiCeUID=CO1.NTC.2699300&isFromPubliCArea=True&isModal=False","Contratos de prestación de servicios profesionales y de apoyo a la gestión","Contratación directa","Prestación de servicios profesionales y de apoyo a la gestión, o para la ejecución de trabajos artísticos que sólo puedan encomendarse a determinadas personas naturales","PRESTAR LOS SERVICIOS TECNICOS PARA DESARROLLAR ACTIVIDADES TENDIENTES A GARANTIZAR LA SALUD Y LA ATENCIÓN DE LAS EMERGENCIAS Y DESASTRES QUE SE PRESENTEN EN LA LOCALIDAD RAFAEL URIBE URIBE EL MARCO DEL PROYECTO 1665","Inversión","Un nuevo contrato social y ambiental para la Bogotá del Siglo XXI",30,{"$f":"IF(ISERROR(VLOOKUP(K125,Proposito_programa!$C$2:$E$59,2,FALSE)),\" \",VLOOKUP(K125,Proposito_programa!$C$2:$E$59,2,FALSE))","v":"Eficiencia en la atención de emergencias"},{"$f":"IF(ISERROR(VLOOKUP(K125,Proposito_programa!$C$2:$E$59,3,FALSE)),\" \",VLOOKUP(K125,Proposito_programa!$C$2:$E$59,3,FALSE))","v":"Propósito 2 : Cambiar Nuestros Hábitos de Vida para Reverdecer a Bogotá y Adaptarnos y Mitigar la Crisis Climática"},"O23011602300000001665",1,1032417994,"EDWIN FABIAN UMAÑAN RUEDA","Persona Natural",null,null,null,null,30250000,null,1,2750000,33000000,27500000,"2022-01-25","2022-02-01","2023-01-30",330,1,30,null,null,null,null,"Terminado",0.83333333333333337]
[116,2022,"FDLRUU-CD-116-2022","https://Community.seCop.gov.Co/PubliC/Tendering/OpportunityDetail/Index?notiCeUID=CO1.NTC.2698782&isFromPubliCArea=True&isModal=False\n","Contratos de prestación de servicios profesionales y de apoyo a la gestión","Contratación directa","Prestación de servicios profesionales y de apoyo a la gestión, o para la ejecución de trabajos artísticos que sólo puedan encomendarse a determinadas personas naturales","APOYAR ADMINISTRATIVA Y ASISTENCIALMENTE A LAS INSPECCIONES DE POLICÍA DE LA LOCALIDAD DE RAFAEL URIBE URIBE","Inversión","Un nuevo contrato social y ambiental para la Bogotá del Siglo XXI",57,{"$f":"IF(ISERROR(VLOOKUP(K126,Proposito_programa!$C$2:$E$59,2,FALSE)),\" \",VLOOKUP(K126,Proposito_programa!$C$2:$E$59,2,FALSE))","v":"Gestión pública local"},{"$f":"IF(ISERROR(VLOOKUP(K126,Proposito_programa!$C$2:$E$59,3,FALSE)),\" \",VLOOKUP(K126,Proposito_programa!$C$2:$E$59,3,FALSE))","v":"Propósito 5: Construir Bogotá - Región con gobierno abierto, transparente y ciudadanía consciente"},"O23011605570000001698",1,1014239291,"NATHALIA MILENA MELO LANDAZABAL","Persona Natural",null,null,null,null,20680000,null,1,2130667,22810667,19050667,"2022-01-25","2022-01-27","2023-01-30",330,1,34,null,null,null,null,"Terminado",0.83516483757357907]
[117,2022,"FDLRUU-CD-117-2022","https://Community.seCop.gov.Co/PubliC/Tendering/OpportunityDetail/Index?notiCeUID=CO1.NTC.2703171&isFromPubliCArea=True&isModal=False\n","Contratos de prestación de servicios profesionales y de apoyo a la gestión","Contratación directa","Prestación de servicios profesionales y de apoyo a la gestión, o para la ejecución de trabajos artísticos que sólo puedan encomendarse a determinadas personas naturales","PRESTAR LOS SERVICIOS PROFESIONALES DE APOYO JURIDICO AL AREA DE GESTION POLICIVA JURIDICA DE LA ALCALDIA LOCAL DE RAFAEL URIBE URIBE EN EL DESEMPEÑO DE LAS FUNCIONES ASIGNADAS","Inversión","Un nuevo contrato social y ambiental para la Bogotá del Siglo XXI",57,{"$f":"IF(ISERROR(VLOOKUP(K127,Proposito_programa!$C$2:$E$59,2,FALSE)),\" \",VLOOKUP(K127,Proposito_programa!$C$2:$E$59,2,FALSE))","v":"Gestión pública local"},{"$f":"IF(ISERROR(VLOOKUP(K127,Proposito_programa!$C$2:$E$59,3,FALSE)),\" \",VLOOKUP(K127,Proposito_programa!$C$2:$E$59,3,FALSE))","v":"Propósito 5: Construir Bogotá - Región con gobierno abierto, transparente y ciudadanía consciente"},"O23011605570000001698",1,1121832284,"MARIA CATALINA ALVAREZ RAMIREZ","Persona Natural",null,null,null,null,70400000,null,1,7253333,77653333,58453333,"2022-01-25","2022-01-27","2023-01-30",330,1,34,null,null,null,null,"Terminado",0.75274725168589995]
[118,2022,"FDLRUU-CD-118-2022","https://Community.seCop.gov.Co/PubliC/Tendering/OpportunityDetail/Index?notiCeUID=CO1.NTC.2744780&isFromPubliCArea=True&isModal=False","Contratos de prestación de servicios profesionales y de apoyo a la gestión","Contratación directa","Prestación de servicios profesionales y de apoyo a la gestión, o para la ejecución de trabajos artísticos que sólo puedan encomendarse a determinadas personas naturales","PRESTAR LOS SERVICIOS PROFESIONALES PARA LA OPERACIÓN, SEGUIMIENTO Y CUMPLIMIENTO DE LOS PROCESOS Y PROCEDIMIENTOS DEL SERVICIO APOYO ECONÓMICO TIPO C, REQUERIDOS PARA EL OPORTUNO Y ADECUADO REGISTRO, CRUCE Y REPORTE DE LOS DATOS EN EL SISTEMA MISIONAL SIRBE, QUE CONTRIBUYAN A LA GARANTÍA DE LOS DERECHOS DE LA POBLACIÓN MAYOR EN EL MARCO DE LA POLÍTICA PÚBLICA SOCIAL PARA EL ENVEJECIMIENTO Y LA VEJEZ EN EL DISTRITO CAPITAL A CARGO DE LA ALCALDÍA LOCAL.","Inversión","Un nuevo contrato social y ambiental para la Bogotá del Siglo XXI",1,{"$f":"IF(ISERROR(VLOOKUP(K128,Proposito_programa!$C$2:$E$59,2,FALSE)),\" \",VLOOKUP(K128,Proposito_programa!$C$2:$E$59,2,FALSE))","v":"Subsidios y transferencias para la equidad"},{"$f":"IF(ISERROR(VLOOKUP(K128,Proposito_programa!$C$2:$E$59,3,FALSE)),\" \",VLOOKUP(K128,Proposito_programa!$C$2:$E$59,3,FALSE))","v":"Propósito 1: Hacer un nuevo contrato social para incrementar la inclusión social, productiva y política"},"O23011601010000001636",1,1026272955,"VIVIANA CAROLINA MALDONADO VIRGUEZ","Persona Natural",null,null,null,null,59400000,null,1,5400000,64800000,54000000,"2022-01-27","2022-02-01","2023-01-22",330,1,30,null,null,null,null,"Terminacion Anticipada",0.83333333333333337]
[119,2022,"FDLRUU-CD-119-2022","https://Community.seCop.gov.Co/PubliC/Tendering/OpportunityDetail/Index?notiCeUID=CO1.NTC.2746517&isFromPubliCArea=True&isModal=False","Contratos de prestación de servicios profesionales y de apoyo a la gestión","Contratación directa","Prestación de servicios profesionales y de apoyo a la gestión, o para la ejecución de trabajos artísticos que sólo puedan encomendarse a determinadas personas naturales","\tPRESTAR LOS SERVICIOS PROFESIONALES PARA LA OPERACIÓN, SEGUIMIENTO Y CUMPLIMIENTO DE LOS PROCESOS Y PROCEDIMIENTOS DEL SERVICIO APOYO ECONÓMICO TIPO C, REQUERIDOS PARA EL OPORTUNO Y ADECUADO REGISTRO, CRUCE Y REPORTE DE LOS DATOS EN EL SISTEMA MISIONAL SIRBE, QUE CONTRIBUYAN A LA GARANTÍA DE LOS DERECHOS DE LA POBLACIÓN MAYOR EN EL MARCO DE LA POLÍTICA PÚBLICA SOCIAL PARA EL ENVEJECIMIENTO Y LA VEJEZ EN EL DISTRITO CAPITAL A CARGO DE LA ALCALDÍA LOCAL.","Inversión","Un nuevo contrato social y ambiental para la Bogotá del Siglo XXI",1,{"$f":"IF(ISERROR(VLOOKUP(K129,Proposito_programa!$C$2:$E$59,2,FALSE)),\" \",VLOOKUP(K129,Proposito_programa!$C$2:$E$59,2,FALSE))","v":"Subsidios y transferencias para la equidad"},{"$f":"IF(ISERROR(VLOOKUP(K129,Proposito_programa!$C$2:$E$59,3,FALSE)),\" \",VLOOKUP(K129,Proposito_programa!$C$2:$E$59,3,FALSE))","v":"Propósito 1: Hacer un nuevo contrato social para incrementar la inclusión social, productiva y política"},"O23011601010000001636",1,80114984,"SERGIO ENRIQUE MORALES GIL","Persona Natural",null,null,null,null,59400000,null,1,5400000,64800000,54000000,"2022-01-27","2022-02-01","2023-01-23",330,1,30,null,null,null,null,"Terminacion Anticipada",0.83333333333333337]
[120,2022,"FDLRUU-CD-120-2022","https://Community.seCop.gov.Co/PubliC/Tendering/ContraCtNotiCePhases/View?PPI=CO1.PPI.17234241&isFromPubliCArea=True&isModal=False","Contratos de prestación de servicios profesionales y de apoyo a la gestión","Contratación directa","Prestación de servicios profesionales y de apoyo a la gestión, o para la ejecución de trabajos artísticos que sólo puedan encomendarse a determinadas personas naturales","\tPRESTAR LOS SERVICIOS PROFESIONALES PARA LA OPERACIÓN, SEGUIMIENTO Y CUMPLIMIENTO DE LOS PROCESOS Y PROCEDIMIENTOS DEL SERVICIO APOYO ECONÓMICO TIPO C, REQUERIDOS PARA EL OPORTUNO Y ADECUADO REGISTRO, CRUCE Y REPORTE DE LOS DATOS EN EL SISTEMA MISIONAL SIRBE, QUE CONTRIBUYAN A LA GARANTÍA DE LOS DERECHOS DE LA POBLACIÓN MAYOR EN EL MARCO DE LA POLÍTICA PÚBLICA SOCIAL PARA EL ENVEJECIMIENTO Y LA VEJEZ EN EL DISTRITO CAPITAL A CARGO DE LA ALCALDÍA LOCAL.","Inversión","Un nuevo contrato social y ambiental para la Bogotá del Siglo XXI",1,{"$f":"IF(ISERROR(VLOOKUP(K130,Proposito_programa!$C$2:$E$59,2,FALSE)),\" \",VLOOKUP(K130,Proposito_programa!$C$2:$E$59,2,FALSE))","v":"Subsidios y transferencias para la equidad"},{"$f":"IF(ISERROR(VLOOKUP(K130,Proposito_programa!$C$2:$E$59,3,FALSE)),\" \",VLOOKUP(K130,Proposito_programa!$C$2:$E$59,3,FALSE))","v":"Propósito 1: Hacer un nuevo contrato social para incrementar la inclusión social, productiva y política"},"O23011601010000001636",1,1012369383,"kimberly Mendoza Moreno","Persona Natural",null,null,null,null,59400000,null,1,5400000,64800000,{"$f":"27000000+AL130","v":54000000},"2022-01-27","2022-02-01","2023-01-23",330,1,30,80913594,"CARLOS ALEXANDER CASTILLO MUÑOZ","2022-07-01",27000000,"Terminacion Anticipada",0.83333333333333337]
[121,2022,"FDLRUU-CD-121-2022","https://Community.seCop.gov.Co/PubliC/Tendering/OpportunityDetail/Index?notiCeUID=CO1.NTC.2708526&isFromPubliCArea=True&isModal=False","Contratos de prestación de servicios profesionales y de apoyo a la gestión","Contratación directa","Prestación de servicios profesionales y de apoyo a la gestión, o para la ejecución de trabajos artísticos que sólo puedan encomendarse a determinadas personas naturales","PRESTAR LOS SERVICIOS PROFESIONALES PARA LA OPERACIÓN, SEGUIMIENTO Y CUMPLIMIENTO DE LOS PROCESOS Y PROCEDIMIENTOS DEL SERVICIO APOYO ECONÓMICO TIPO C, REQUERIDOS PARA EL OPORTUNO Y ADECUADO REGISTRO, CRUCE Y REPORTE DE LOS DATOS EN EL SISTEMA MISIONAL SIRBE, QUE CONTRIBUYAN A LA GARANTÍA DE LOS DERECHOS DE LA POBLACIÓN MAYOR EN EL MARCO DE LA POLÍTICA PÚBLICA SOCIAL PARA EL ENVEJECIMIENTO Y LA VEJEZ EN EL DISTRITO CAPITAL A CARGO DE LA ALCALDÍA LOCAL.","Inversión","Un nuevo contrato social y ambiental para la Bogotá del Siglo XXI",1,{"$f":"IF(ISERROR(VLOOKUP(K131,Proposito_programa!$C$2:$E$59,2,FALSE)),\" \",VLOOKUP(K131,Proposito_programa!$C$2:$E$59,2,FALSE))","v":"Subsidios y transferencias para la equidad"},{"$f":"IF(ISERROR(VLOOKUP(K131,Proposito_programa!$C$2:$E$59,3,FALSE)),\" \",VLOOKUP(K131,Proposito_programa!$C$2:$E$59,3,FALSE))","v":"Propósito 1: Hacer un nuevo contrato social para incrementar la inclusión social, productiva y política"},"O23011601010000001636",1,1033710335,"JENNIFER ARIAS TAVERA","Persona Natural",null,null,null,null,59400000,null,1,5400000,64800000,54000000,"2022-01-26","2022-01-27","2023-01-22",330,1,30,null,null,null,null,"Terminacion Anticipada",0.83333333333333337]
[122,2022,"FDLRUU-CD-121-2022","https://Community.seCop.gov.Co/PubliC/Tendering/OpportunityDetail/Index?notiCeUID=CO1.NTC.2708526&isFromPubliCArea=True&isModal=False","Contratos de prestación de servicios profesionales y de apoyo a la gestión","Contratación directa","Prestación de servicios profesionales y de apoyo a la gestión, o para la ejecución de trabajos artísticos que sólo puedan encomendarse a determinadas personas naturales","PRESTAR LOS SERVICIOS PROFESIONALES PARA LA OPERACIÓN, SEGUIMIENTO Y CUMPLIMIENTO DE LOS PROCESOS Y PROCEDIMIENTOS DEL SERVICIO APOYO ECONÓMICO TIPO C, REQUERIDOS PARA EL OPORTUNO Y ADECUADO REGISTRO, CRUCE Y REPORTE DE LOS DATOS EN EL SISTEMA MISIONAL SIRBE, QUE CONTRIBUYAN A LA GARANTÍA DE LOS DERECHOS DE LA POBLACIÓN MAYOR EN EL MARCO DE LA POLÍTICA PÚBLICA SOCIAL PARA EL ENVEJECIMIENTO Y LA VEJEZ EN EL DISTRITO CAPITAL A CARGO DE LA ALCALDÍA LOCAL.","Inversión","Un nuevo contrato social y ambiental para la Bogotá del Siglo XXI",1,{"$f":"IF(ISERROR(VLOOKUP(K132,Proposito_programa!$C$2:$E$59,2,FALSE)),\" \",VLOOKUP(K132,Proposito_programa!$C$2:$E$59,2,FALSE))","v":"Subsidios y transferencias para la equidad"},{"$f":"IF(ISERROR(VLOOKUP(K132,Proposito_programa!$C$2:$E$59,3,FALSE)),\" \",VLOOKUP(K132,Proposito_programa!$C$2:$E$59,3,FALSE))","v":"Propósito 1: Hacer un nuevo contrato social para incrementar la inclusión social, productiva y política"},"O23011601010000001636",1,1031156309,"DAILY JASBLEIDY ALBARRACIN BENITEZ","Persona Natural",null,null,null,null,59400000,null,1,5400000,64800000,54000000,"2022-01-25","2022-01-27","2023-01-22",330,1,30,null,null,null,null,"Terminacion Anticipada",0.83333333333333337]
[123,2022,"FDLRUU-CD-123-2022","https://Community.seCop.gov.Co/PubliC/Tendering/OpportunityDetail/Index?notiCeUID=CO1.NTC.2713559&isFromPubliCArea=True&isModal=False","Contratos de prestación de servicios profesionales y de apoyo a la gestión","Contratación directa","Prestación de servicios profesionales y de apoyo a la gestión, o para la ejecución de trabajos artísticos que sólo puedan encomendarse a determinadas personas naturales","PRESTAR LOS SERVICIOS PROFESIONALES PARA LA OPERACIÓN, SEGUIMIENTO Y CUMPLIMIENTO DE LOS PROCESOS Y PROCEDIMIENTOS DEL SERVICIO APOYO ECONÓMICO TIPO C, REQUERIDOS PARA EL OPORTUNO Y ADECUADO REGISTRO, CRUCE Y REPORTE DE LOS DATOS EN EL SISTEMA MISIONAL SIRBE, QUE CONTRIBUYAN A LA GARANTÍA DE LOS DERECHOS DE LA POBLACIÓN MAYOR EN EL MARCO DE LA POLÍTICA PÚBLICA SOCIAL PARA EL ENVEJECIMIENTO Y LA VEJEZ EN EL DISTRITO CAPITAL A CARGO DE LA ALCALDÍA LOCAL","Inversión","Un nuevo contrato social y ambiental para la Bogotá del Siglo XXI",1,{"$f":"IF(ISERROR(VLOOKUP(K133,Proposito_programa!$C$2:$E$59,2,FALSE)),\" \",VLOOKUP(K133,Proposito_programa!$C$2:$E$59,2,FALSE))","v":"Subsidios y transferencias para la equidad"},{"$f":"IF(ISERROR(VLOOKUP(K133,Proposito_programa!$C$2:$E$59,3,FALSE)),\" \",VLOOKUP(K133,Proposito_programa!$C$2:$E$59,3,FALSE))","v":"Propósito 1: Hacer un nuevo contrato social para incrementar la inclusión social, productiva y política"},"O23011601010000001636",1,29705959,"LUZ ANGELA ACEVEDO RUIZ ","Persona Natural",null,null,null,null,59400000,null,null,null,59400000,52560000,"2022-01-26","2022-02-09","2023-01-08",330,null,null,null,null,null,null,"Terminado",0.88484848484848488]
[124,2022,"FDLRUU-CD-124-2022","https://Community.seCop.gov.Co/PubliC/Tendering/ContraCtNotiCePhases/View?PPI=CO1.PPI.17181586&isFromPubliCArea=True&isModal=False","Contratos de prestación de servicios profesionales y de apoyo a la gestión","Contratación directa","Prestación de servicios profesionales y de apoyo a la gestión, o para la ejecución de trabajos artísticos que sólo puedan encomendarse a determinadas personas naturales","APOYAR LA FORMULACIÓN, EJECUCIÓN, SEGUIMIENTO Y MEJORA CONTINUA DE LAS HERRAMIENTAS QUE CONFORMAN LA GESTIÓN AMBIENTAL INSTITUCIONAL DE LA ALCALDÍA LOCAL","Inversión","Un nuevo contrato social y ambiental para la Bogotá del Siglo XXI",57,{"$f":"IF(ISERROR(VLOOKUP(K134,Proposito_programa!$C$2:$E$59,2,FALSE)),\" \",VLOOKUP(K134,Proposito_programa!$C$2:$E$59,2,FALSE))","v":"Gestión pública local"},{"$f":"IF(ISERROR(VLOOKUP(K134,Proposito_programa!$C$2:$E$59,3,FALSE)),\" \",VLOOKUP(K134,Proposito_programa!$C$2:$E$59,3,FALSE))","v":"Propósito 5: Construir Bogotá - Región con gobierno abierto, transparente y ciudadanía consciente"},"O23011605570000001697",1,1020797579,"LAURA NATHALIA VALENCIA ORTIZ","Persona Natural",null,null,null,null,27600000,null,1,13800000,41400000,41400000,"2022-01-26","2022-02-01","2022-10-31",180,1,90,null,null,null,null,"Terminado",1]
[125,2022,"FDLRUU-CD-125-2022","https://Community.seCop.gov.Co/PubliC/Tendering/OpportunityDetail/Index?notiCeUID=CO1.NTC.2731516&isFromPubliCArea=True&isModal=False\n","Contratos de prestación de servicios profesionales y de apoyo a la gestión","Contratación directa","Prestación de servicios profesionales y de apoyo a la gestión, o para la ejecución de trabajos artísticos que sólo puedan encomendarse a determinadas personas naturales","LIDERAR Y GARANTIZAR LA IMPLEMENTACIÓN Y SEGUIMIENTO DE LOS PROCESOS Y PROCEDIMIENTOS DEL SERVICIO SOCIAL PARA SUBSIDIO TIPO C DE LA ALCALDÍA LOCAL","Inversión","Un nuevo contrato social y ambiental para la Bogotá del Siglo XXI",1,{"$f":"IF(ISERROR(VLOOKUP(K135,Proposito_programa!$C$2:$E$59,2,FALSE)),\" \",VLOOKUP(K135,Proposito_programa!$C$2:$E$59,2,FALSE))","v":"Subsidios y transferencias para la equidad"},{"$f":"IF(ISERROR(VLOOKUP(K135,Proposito_programa!$C$2:$E$59,3,FALSE)),\" \",VLOOKUP(K135,Proposito_programa!$C$2:$E$59,3,FALSE))","v":"Propósito 1: Hacer un nuevo contrato social para incrementar la inclusión social, productiva y política"},"O23011601010000001636",1,52409679,"ANA MILENA CARDONA MORA","Persona Natural",null,null,null,null,66000000,null,1,6000000,72000000,60000000,"2022-01-26","2022-02-01","2023-01-30",330,1,30,null,null,null,null,"Terminado",0.83333333333333337]
[126,2022,"FDLRUU-CD-126-2022","https://Community.seCop.gov.Co/PubliC/Tendering/OpportunityDetail/Index?notiCeUID=CO1.NTC.2729320&isFromPubliCArea=True&isModal=False","Contratos de prestación de servicios profesionales y de apoyo a la gestión","Contratación directa","Prestación de servicios profesionales y de apoyo a la gestión, o para la ejecución de trabajos artísticos que sólo puedan encomendarse a determinadas personas naturales","PRESTAR LOS SERVICIOS PROFESIONALES PARA APOYAR LA FORMULACION, EJECUCIÓN Y SEGUIMIENTO DE LOS PROYECTOS DE INVERSIÓN EN EL MARCO DEL CUMPLIMIENTO DEL PLAN DE DESARROLLO LOCAL DE LA ALCALDÍA LOCAL DE RAFAEL URIBE URIBE 2021 2024\t","Inversión","Un nuevo contrato social y ambiental para la Bogotá del Siglo XXI",57,{"$f":"IF(ISERROR(VLOOKUP(K136,Proposito_programa!$C$2:$E$59,2,FALSE)),\" \",VLOOKUP(K136,Proposito_programa!$C$2:$E$59,2,FALSE))","v":"Gestión pública local"},{"$f":"IF(ISERROR(VLOOKUP(K136,Proposito_programa!$C$2:$E$59,3,FALSE)),\" \",VLOOKUP(K136,Proposito_programa!$C$2:$E$59,3,FALSE))","v":"Propósito 5: Construir Bogotá - Región con gobierno abierto, transparente y ciudadanía consciente"},"O23011605570000001697",1,1020713661,"CESAR MAURICIO RUIZ LONDOÑO","Persona Natural",null,null,null,null,59400000,null,1,5400000,64800000,54000000,"2022-01-26","2022-02-01","2023-01-24",330,1,30,null,null,null,null,"Terminacion anticipada",0.83333333333333337]
[127,2022,"FDLRUU-CD-127-2022","https://community.secop.gov.co/Public/Tendering/OpportunityDetail/Index?noticeUID=CO1.NTC.2738344&isFromPublicArea=True&isModal=False\n","Contratos de prestación de servicios profesionales y de apoyo a la gestión","Contratación directa","Prestación de servicios profesionales y de apoyo a la gestión, o para la ejecución de trabajos artísticos que sólo puedan encomendarse a determinadas personas naturales","PRESTAR LOS SERVICIOS TECNICOS PARA DESARROLLAR ACTIVIDADES TENDIENTES A GARANTIZAR LA SALUD Y LA ATENCIÓN DE LAS EMERGENCIAS Y DESASTRES QUE SE PRESENTEN EN LA LOCALIDAD RAFAEL URIBE URIBE EN MARCO DEL PROYECTO 1665\t","Inversión","Un nuevo contrato social y ambiental para la Bogotá del Siglo XXI",30,{"$f":"IF(ISERROR(VLOOKUP(K137,Proposito_programa!$C$2:$E$59,2,FALSE)),\" \",VLOOKUP(K137,Proposito_programa!$C$2:$E$59,2,FALSE))","v":"Eficiencia en la atención de emergencias"},{"$f":"IF(ISERROR(VLOOKUP(K137,Proposito_programa!$C$2:$E$59,3,FALSE)),\" \",VLOOKUP(K137,Proposito_programa!$C$2:$E$59,3,FALSE))","v":"Propósito 2 : Cambiar Nuestros Hábitos de Vida para Reverdecer a Bogotá y Adaptarnos y Mitigar la Crisis Climática"},"O23011602300000001665",1,1010201479,"ANGIE LORENA RIAÑO RAMOS","Persona Natural",null,null,null,null,30250000,null,1,3025000,33275000,27775000,"2022-01-26","2022-01-28","2023-01-30",330,1,33,null,null,null,null,"Terminado",0.83471074380165289]
[128,2022,"FDLRUU-CD-128-2022","https://Community.seCop.gov.Co/PubliC/Tendering/OpportunityDetail/Index?notiCeUID=CO1.NTC.2725475&isFromPubliCArea=True&isModal=False\n","Contratos de prestación de servicios profesionales y de apoyo a la gestión","Contratación directa","Prestación de servicios profesionales y de apoyo a la gestión, o para la ejecución de trabajos artísticos que sólo puedan encomendarse a determinadas personas naturales","PRESTAR LOS SERVICIOS PROFESIONALES PARA LA OPERACIÓN, SEGUIMIENTO Y CUMPLIMIENTO DE LOS PROCESOS Y PROCEDIMIENTOS DEL SERVICIO APOYO ECONÓMICO TIPO C, REQUERIDOS PARA EL OPORTUNO Y ADECUADO REGISTRO, CRUCE Y REPORTE DE LOS DATOS EN EL SISTEMA MISIONAL SIRBE, QUE CONTRIBUYAN A LA GARANTÍA DE LOS DERECHOS DE LA POBLACIÓN MAYOR EN EL MARCO DE LA POLÍTICA PÚBLICA SOCIAL PARA EL ENVEJECIMIENTO Y LA VEJEZ EN EL DISTRITO CAPITAL A CARGO DE LA ALCALDÍA LOCAL.","Inversión","Un nuevo contrato social y ambiental para la Bogotá del Siglo XXI",1,{"$f":"IF(ISERROR(VLOOKUP(K138,Proposito_programa!$C$2:$E$59,2,FALSE)),\" \",VLOOKUP(K138,Proposito_programa!$C$2:$E$59,2,FALSE))","v":"Subsidios y transferencias para la equidad"},{"$f":"IF(ISERROR(VLOOKUP(K138,Proposito_programa!$C$2:$E$59,3,FALSE)),\" \",VLOOKUP(K138,Proposito_programa!$C$2:$E$59,3,FALSE))","v":"Propósito 1: Hacer un nuevo contrato social para incrementar la inclusión social, productiva y política"},"O23011601010000001636",1,1024469143,"PABLO JULIO CARDENAS SANDOVAL","Persona Natural",null,null,null,null,59400000,null,1,4860000,64260000,53460000,"2022-01-26","2022-02-04","2023-01-23",330,1,27,null,null,null,null,"Terminacion Anticipada",0.83193277310924374]
[129,2022,"FDLRUU-CD-129-2022","https://Community.seCop.gov.Co/PubliC/Tendering/OpportunityDetail/Index?notiCeUID=CO1.NTC.2726148&isFromPubliCArea=True&isModal=False","Contratos de prestación de servicios profesionales y de apoyo a la gestión","Contratación directa","Prestación de servicios profesionales y de apoyo a la gestión, o para la ejecución de trabajos artísticos que sólo puedan encomendarse a determinadas personas naturales","PRESTAR LOS SERVICIOS PROFESIONALES PARA LA OPERACIÓN, SEGUIMIENTO Y CUMPLIMIENTO DE LOS PROCESOS Y PROCEDIMIENTOS DEL SERVICIO APOYO ECONÓMICO TIPO C, REQUERIDOS PARA EL OPORTUNO Y ADECUADO REGISTRO, CRUCE Y REPORTE DE LOS DATOS EN EL SISTEMA MISIONAL SIRBE, QUE CONTRIBUYAN A LA GARANTÍA DE LOS DERECHOS DE LA POBLACIÓN MAYOR EN EL MARCO DE LA POLÍTICA PÚBLICA SOCIAL PARA EL ENVEJECIMIENTO Y LA VEJEZ EN EL DISTRITO CAPITAL A CARGO DE LA ALCALDÍA LOCAL","Inversión","Un nuevo contrato social y ambiental para la Bogotá del Siglo XXI",1,{"$f":"IF(ISERROR(VLOOKUP(K139,Proposito_programa!$C$2:$E$59,2,FALSE)),\" \",VLOOKUP(K139,Proposito_programa!$C$2:$E$59,2,FALSE))","v":"Subsidios y transferencias para la equidad"},{"$f":"IF(ISERROR(VLOOKUP(K139,Proposito_programa!$C$2:$E$59,3,FALSE)),\" \",VLOOKUP(K139,Proposito_programa!$C$2:$E$59,3,FALSE))","v":"Propósito 1: Hacer un nuevo contrato social para incrementar la inclusión social, productiva y política"},"O23011601010000001636",1,60340764,"REINA ESPERANZA CORDERO VARGAS","Persona Natural",null,null,null,null,59400000,null,1,5400000,64800000,54000000,"2022-01-26","2022-02-01","2023-01-30",330,1,30,null,null,null,null,"Terminado",0.83333333333333337]
[130,2022,"FDLRUU-CD-130-2022","https://Community.seCop.gov.Co/PubliC/Tendering/OpportunityDetail/Index?notiCeUID=CO1.NTC.2714233&isFromPubliCArea=True&isModal=False\n","Contratos de prestación de servicios profesionales y de apoyo a la gestión","Contratación directa","Prestación de servicios profesionales y de apoyo a la gestión, o para la ejecución de trabajos artísticos que sólo puedan encomendarse a determinadas personas naturales","PRESTAR LOS SERVICIOS PROFESIONALES PARA LA OPERACIÓN, SEGUIMIENTO Y CUMPLIMIENTO DE LOS PROCESOS Y PROCEDIMIENTOS DEL SERVICIO APOYO ECONÓMICO TIPO C, REQUERIDOS PARA EL OPORTUNO Y ADECUADO REGISTRO, CRUCE Y REPORTE DE LOS DATOS EN EL SISTEMA MISIONAL SIRBE, QUE CONTRIBUYAN A LA GARANTÍA DE LOS DERECHOS DE LA POBLACIÓN MAYOR EN EL MARCO DE LA POLÍTICA PÚBLICA SOCIAL PARA EL ENVEJECIMIENTO Y LA VEJEZ EN EL DISTRITO CAPITAL A CARGO DE LA ALCALDÍA LOCAL","Inversión","Un nuevo contrato social y ambiental para la Bogotá del Siglo XXI",1,{"$f":"IF(ISERROR(VLOOKUP(K140,Proposito_programa!$C$2:$E$59,2,FALSE)),\" \",VLOOKUP(K140,Proposito_programa!$C$2:$E$59,2,FALSE))","v":"Subsidios y transferencias para la equidad"},{"$f":"IF(ISERROR(VLOOKUP(K140,Proposito_programa!$C$2:$E$59,3,FALSE)),\" \",VLOOKUP(K140,Proposito_programa!$C$2:$E$59,3,FALSE))","v":"Propósito 1: Hacer un nuevo contrato social para incrementar la inclusión social, productiva y política"},"O23011601010000001636",1,1026277883,"INGRID MAYERLY BOLIVAR PAEZ","Persona Natural",null,null,null,null,59400000,null,1,5940000,65340000,54540000,"2022-01-26","2022-01-28","2023-01-22",330,1,33,null,null,null,null,"Terminacion Anticipada",0.83471074380165289]
[131,2022,"FDLRUU-CD-131-2022","https://Community.seCop.gov.Co/PubliC/Tendering/OpportunityDetail/Index?notiCeUID=CO1.NTC.2716037&isFromPubliCArea=True&isModal=False\n","Contratos de prestación de servicios profesionales y de apoyo a la gestión","Contratación directa","Prestación de servicios profesionales y de apoyo a la gestión, o para la ejecución de trabajos artísticos que sólo puedan encomendarse a determinadas personas naturales","PRESTAR LOS SERVICIOS PROFESIONALES PARA LA OPERACIÓN, SEGUIMIENTO Y CUMPLIMIENTO DE LOS PROCESOS Y PROCEDIMIENTOS DEL SERVICIO APOYO ECONÓMICO TIPO C, REQUERIDOS PARA EL OPORTUNO Y ADECUADO REGISTRO, CRUCE Y REPORTE DE LOS DATOS EN EL SISTEMA MISIONAL SIRBE, QUE CONTRIBUYAN A LA GARANTÍA DE LOS DERECHOS DE LA POBLACIÓN MAYOR EN EL MARCO DE LA POLÍTICA PÚBLICA SOCIAL PARA EL ENVEJECIMIENTO Y LA VEJEZ EN EL DISTRITO CAPITAL A CARGO DE LA ALCALDÍA LOCAL","Inversión","Un nuevo contrato social y ambiental para la Bogotá del Siglo XXI",1,{"$f":"IF(ISERROR(VLOOKUP(K141,Proposito_programa!$C$2:$E$59,2,FALSE)),\" \",VLOOKUP(K141,Proposito_programa!$C$2:$E$59,2,FALSE))","v":"Subsidios y transferencias para la equidad"},{"$f":"IF(ISERROR(VLOOKUP(K141,Proposito_programa!$C$2:$E$59,3,FALSE)),\" \",VLOOKUP(K141,Proposito_programa!$C$2:$E$59,3,FALSE))","v":"Propósito 1: Hacer un nuevo contrato social para incrementar la inclusión social, productiva y política"},"O23011601010000001636",1,1013611272,"ANGELA PATRICIA ROZO RODRIGUEZ","Persona Natural",null,null,null,null,59400000,null,1,5940000,65340000,54540000,"2022-01-26","2022-01-28","2023-01-22",330,1,33,null,null,null,null,"Terminacion Anticipada",0.83471074380165289]
[132,2022,"FDLRUU-CD-132-2022","https://Community.seCop.gov.Co/PubliC/Tendering/OpportunityDetail/Index?notiCeUID=CO1.NTC.2718707&isFromPubliCArea=True&isModal=False\n","Contratos de prestación de servicios profesionales y de apoyo a la gestión","Contratación directa","Prestación de servicios profesionales y de apoyo a la gestión, o para la ejecución de trabajos artísticos que sólo puedan encomendarse a determinadas personas naturales","PRESTAR LOS SERVICIOS PROFESIONALES PARA LA OPERACIÓN, SEGUIMIENTO Y CUMPLIMIENTO DE LOS PROCESOS Y PROCEDIMIENTOS DEL SERVICIO APOYO ECONÓMICO TIPO C, REQUERIDOS PARA EL OPORTUNO Y ADECUADO REGISTRO, CRUCE Y REPORTE DE LOS DATOS EN EL SISTEMA MISIONAL SIRBE, QUE CONTRIBUYAN A LA GARANTÍA DE LOS DERECHOS DE LA POBLACIÓN MAYOR EN EL MARCO DE LA POLÍTICA PÚBLICA SOCIAL PARA EL ENVEJECIMIENTO Y LA VEJEZ EN EL DISTRITO CAPITAL A CARGO DE LA ALCALDÍA LOCAL","Inversión","Un nuevo contrato social y ambiental para la Bogotá del Siglo XXI",1,{"$f":"IF(ISERROR(VLOOKUP(K142,Proposito_programa!$C$2:$E$59,2,FALSE)),\" \",VLOOKUP(K142,Proposito_programa!$C$2:$E$59,2,FALSE))","v":"Subsidios y transferencias para la equidad"},{"$f":"IF(ISERROR(VLOOKUP(K142,Proposito_programa!$C$2:$E$59,3,FALSE)),\" \",VLOOKUP(K142,Proposito_programa!$C$2:$E$59,3,FALSE))","v":"Propósito 1: Hacer un nuevo contrato social para incrementar la inclusión social, productiva y política"},"O23011601010000001636",1,1018453055,"LUZ MAGNOLIA TIRADO CUELLAR","Persona Natural",null,null,null,null,59400000,null,1,5940000,{"$f":"+W142+X142+Z142","v":65340000},54540000,"2022-01-26","2022-01-28","2023-01-19",330,1,33,null,null,null,null,"Terminacion Anticipada",{"$f":"IF(ISERROR(AB142/AA142),\"-\",(AB142/AA142))","v":0.83471074380165289}]
[133,2022,"FDLRUU-CD-133-2022","https://Community.seCop.gov.Co/PubliC/Tendering/OpportunityDetail/Index?notiCeUID=CO1.NTC.2772409&isFromPubliCArea=True&isModal=False","Contratos de prestación de servicios profesionales y de apoyo a la gestión","Contratación directa","Prestación de servicios profesionales y de apoyo a la gestión, o para la ejecución de trabajos artísticos que sólo puedan encomendarse a determinadas personas naturales","PRESTAR LOS SERVICIOS PROFESIONALES PARA LA OPERACIÓN, SEGUIMIENTO Y CUMPLIMIENTO DE LOS PROCESOS Y PROCEDIMIENTOS DEL SERVICIO APOYO ECONÓMICO TIPO C, REQUERIDOS PARA EL OPORTUNO Y ADECUADO REGISTRO, CRUCE Y REPORTE DE LOS DATOS EN EL SISTEMA MISIONAL SIRBE, QUE CONTRIBUYAN A LA GARANTÍA DE LOS DERECHOS DE LA POBLACIÓN MAYOR EN EL MARCO DE LA POLÍTICA PÚBLICA SOCIAL PARA EL ENVEJECIMIENTO Y LA VEJEZ EN EL DISTRITO CAPITAL A CARGO DE LA ALCALDÍA LOCAL","Inversión","Un nuevo contrato social y ambiental para la Bogotá del Siglo XXI",1,{"$f":"IF(ISERROR(VLOOKUP(K143,Proposito_programa!$C$2:$E$59,2,FALSE)),\" \",VLOOKUP(K143,Proposito_programa!$C$2:$E$59,2,FALSE))","v":"Subsidios y transferencias para la equidad"},{"$f":"IF(ISERROR(VLOOKUP(K143,Proposito_programa!$C$2:$E$59,3,FALSE)),\" \",VLOOKUP(K143,Proposito_programa!$C$2:$E$59,3,FALSE))","v":"Propósito 1: Hacer un nuevo contrato social para incrementar la inclusión social, productiva y política"},"O23011601010000001636",1,1013663192,"LAURA NATALIA BETANCOURT PINILLA","Persona Natural",null,null,null,null,59400000,null,1,5940000,65340000,54540000,"2022-01-28","2022-01-28","2023-01-19",330,1,33,null,null,null,null,"Terminacion Anticipada",0.83471074380165289]
[134,2022,"FDLRUU-CD-134-2022","https://Community.seCop.gov.Co/PubliC/Tendering/ContraCtNotiCePhases/View?PPI=CO1.PPI.17145752&isFromPubliCArea=True&isModal=False","Contratos de prestación de servicios profesionales y de apoyo a la gestión","Contratación directa","Prestación de servicios profesionales y de apoyo a la gestión, o para la ejecución de trabajos artísticos que sólo puedan encomendarse a determinadas personas naturales","PRESTAR LOS SERVICIOS TÉCNICOS PARA LA OPERACIÓN, SEGUIMIENTO Y CUMPLIMIENTO DE LOS PROCESOS Y PROCEDIMIENTOS DEL SERVICIO APOYOS PARA LA SEGURIDAD ECONÓMICA TIPO C, REQUERIDOS PARA EL OPORTUNO Y ADECUADO REGISTRO, CRUCE Y REPORTE DE LOS DATOS EN EL SISTEMA MISIONAL SIRBE, QUE CONTRIBUYAN A LA GARANTÍA DE LOS DERECHOS DE LA POBLACIÓN MAYOR EN EL MARCO DE LA POLÍTICA PÚBLICA SOCIAL PARA EL ENVEJECIMIENTO Y LA VEJEZ EN EL DISTRITO CAPITAL A CARGO DE LA ALCALDÍA LOCAL","Inversión","Un nuevo contrato social y ambiental para la Bogotá del Siglo XXI",1,{"$f":"IF(ISERROR(VLOOKUP(K144,Proposito_programa!$C$2:$E$59,2,FALSE)),\" \",VLOOKUP(K144,Proposito_programa!$C$2:$E$59,2,FALSE))","v":"Subsidios y transferencias para la equidad"},{"$f":"IF(ISERROR(VLOOKUP(K144,Proposito_programa!$C$2:$E$59,3,FALSE)),\" \",VLOOKUP(K144,Proposito_programa!$C$2:$E$59,3,FALSE))","v":"Propósito 1: Hacer un nuevo contrato social para incrementar la inclusión social, productiva y política"},"O23011601010000001636",1,52374822,"JAQUELINE GALLEGO CASTELLANOS","Persona Natural",null,null,null,null,37400000,null,1,3400000,40800000,34000000,"2022-01-26","2022-02-01","2023-01-22",330,1,30,null,null,null,null,"Terminacion Anticipada",0.83333333333333337]
[135,2022,"FDLRUU-CD-134-2022","https://community.secop.gov.co/Public/Tendering/OpportunityDetail/Index?noticeUID=CO1.NTC.2714126&isFromPublicArea=True&isModal=False\n\n","Contratos de prestación de servicios profesionales y de apoyo a la gestión","Contratación directa","Prestación de servicios profesionales y de apoyo a la gestión, o para la ejecución de trabajos artísticos que sólo puedan encomendarse a determinadas personas naturales","PRESTAR LOS SERVICIOS TÉCNICOS PARA LA OPERACIÓN, SEGUIMIENTO Y CUMPLIMIENTO DE LOS PROCESOS Y PROCEDIMIENTOS DEL SERVICIO APOYOS PARA LA SEGURIDAD ECONÓMICA TIPO C, REQUERIDOS PARA EL OPORTUNO Y ADECUADO REGISTRO, CRUCE Y REPORTE DE LOS DATOS EN EL SISTEMA MISIONAL SIRBE, QUE CONTRIBUYAN A LA GARANTÍA DE LOS DERECHOS DE LA POBLACIÓN MAYOR EN EL MARCO DE LA POLÍTICA PÚBLICA SOCIAL PARA EL ENVEJECIMIENTO Y LA VEJEZ EN EL DISTRITO CAPITAL A CARGO DE LA ALCALDÍA LOCAL","Inversión","Un nuevo contrato social y ambiental para la Bogotá del Siglo XXI",1,{"$f":"IF(ISERROR(VLOOKUP(K145,Proposito_programa!$C$2:$E$59,2,FALSE)),\" \",VLOOKUP(K145,Proposito_programa!$C$2:$E$59,2,FALSE))","v":"Subsidios y transferencias para la equidad"},{"$f":"IF(ISERROR(VLOOKUP(K145,Proposito_programa!$C$2:$E$59,3,FALSE)),\" \",VLOOKUP(K145,Proposito_programa!$C$2:$E$59,3,FALSE))","v":"Propósito 1: Hacer un nuevo contrato social para incrementar la inclusión social, productiva y política"},"O23011601010000001636",1,1014197762,"\tIngrid Tatiana Caro Rodríguez","Persona Natural",null,null,null,null,37400000,null,1,3853333,41253333,{"$f":"30600000+AL145","v":34453333},"2022-01-26","2022-01-27","2023-01-23",330,1,34,52834869,"YANILY ANDREA MONTENEGRO TRIVIÑO","2022-03-01",3853333,"Terminacion Anticipada",0.83516483383294149]
[136,2022,"FDLRUU-CD-136-2022","https://Community.seCop.gov.Co/PubliC/Tendering/OpportunityDetail/Index?notiCeUID=CO1.NTC.2729724&isFromPubliCArea=True&isModal=False","Contratos de prestación de servicios profesionales y de apoyo a la gestión","Contratación directa","Prestación de servicios profesionales y de apoyo a la gestión, o para la ejecución de trabajos artísticos que sólo puedan encomendarse a determinadas personas naturales","PRESTAR LOS SERVICIOS TÉCNICOS PARA LA OPERACIÓN, SEGUIMIENTO Y CUMPLIMIENTO DE LOS PROCESOS Y PROCEDIMIENTOS DEL SERVICIO APOYOS PARA LA SEGURIDAD ECONÓMICA TIPO C, REQUERIDOS PARA EL OPORTUNO Y ADECUADO REGISTRO, CRUCE Y REPORTE DE LOS DATOS EN EL SISTEMA MISIONAL SIRBE, QUE CONTRIBUYAN A LA GARANTÍA DE LOS DERECHOS DE LA POBLACIÓN MAYOR EN EL MARCO DE LA POLÍTICA PÚBLICA SOCIAL PARA EL ENVEJECIMIENTO Y LA VEJEZ EN EL DISTRITO CAPITAL A CARGO DE LA ALCALDÍA LOCAL","Inversión","Un nuevo contrato social y ambiental para la Bogotá del Siglo XXI",1,{"$f":"IF(ISERROR(VLOOKUP(K146,Proposito_programa!$C$2:$E$59,2,FALSE)),\" \",VLOOKUP(K146,Proposito_programa!$C$2:$E$59,2,FALSE))","v":"Subsidios y transferencias para la equidad"},{"$f":"IF(ISERROR(VLOOKUP(K146,Proposito_programa!$C$2:$E$59,3,FALSE)),\" \",VLOOKUP(K146,Proposito_programa!$C$2:$E$59,3,FALSE))","v":"Propósito 1: Hacer un nuevo contrato social para incrementar la inclusión social, productiva y política"},"O23011601010000001636",1,1013610988,"ADRIANA MARCELA MURILLO GARCIA","Persona Natural",null,null,null,null,37400000,null,1,3740000,41140000,34340000,"2022-01-26","2022-01-28","2023-01-19",330,1,33,null,null,null,null,"Terminacion Anticipada",0.83471074380165289]
[137,2022,"FDLRUU-CD-137-2022","https://Community.seCop.gov.Co/PubliC/Tendering/OpportunityDetail/Index?notiCeUID=CO1.NTC.2714597&isFromPubliCArea=True&isModal=False","Contratos de prestación de servicios profesionales y de apoyo a la gestión","Contratación directa","Prestación de servicios profesionales y de apoyo a la gestión, o para la ejecución de trabajos artísticos que sólo puedan encomendarse a determinadas personas naturales","PRESTAR LOS SERVICIOS PROFESIONALES PARA LA OPERACIÓN, SEGUIMIENTO Y CUMPLIMIENTO DE LOS PROCESOS Y PROCEDIMIENTOS DEL SERVICIO APOYO ECONÓMICO TIPO C, REQUERIDOS PARA EL OPORTUNO Y ADECUADO REGISTRO, CRUCE Y REPORTE DE LOS DATOS EN EL SISTEMA MISIONAL SIRBE, QUE CONTRIBUYAN A LA GARANTÍA DE LOS DERECHOS DE LA POBLACIÓN MAYOR EN EL MARCO DE LA POLÍTICA PÚBLICA SOCIAL PARA EL ENVEJECIMIENTO Y LA VEJEZ EN EL DISTRITO CAPITAL A CARGO DE LA ALCALDÍA LOCAL","Inversión","Un nuevo contrato social y ambiental para la Bogotá del Siglo XXI",1,{"$f":"IF(ISERROR(VLOOKUP(K147,Proposito_programa!$C$2:$E$59,2,FALSE)),\" \",VLOOKUP(K147,Proposito_programa!$C$2:$E$59,2,FALSE))","v":"Subsidios y transferencias para la equidad"},{"$f":"IF(ISERROR(VLOOKUP(K147,Proposito_programa!$C$2:$E$59,3,FALSE)),\" \",VLOOKUP(K147,Proposito_programa!$C$2:$E$59,3,FALSE))","v":"Propósito 1: Hacer un nuevo contrato social para incrementar la inclusión social, productiva y política"},"O23011601010000001636",1,1022374922,"SONIA PATRICIA CUJABAN ARTUNDUAGA","Persona Natural",null,null,null,null,59400000,null,null,null,59400000,52560000,"2022-01-26","2022-02-09","2023-01-08",330,null,null,null,null,null,null,"Terminado",0.88484848484848488]
[138,2022,"FDLRUU-CD-138-2022","https://Community.seCop.gov.Co/PubliC/Tendering/OpportunityDetail/Index?notiCeUID=CO1.NTC.2732644&isFromPubliCArea=True&isModal=False\n","Contratos de prestación de servicios profesionales y de apoyo a la gestión","Contratación directa","Prestación de servicios profesionales y de apoyo a la gestión, o para la ejecución de trabajos artísticos que sólo puedan encomendarse a determinadas personas naturales","PRESTAR LOS SERVICIOS PROFESIONALES PARA LA OPERACIÓN, SEGUIMIENTO Y CUMPLIMIENTO DE LOS PROCESOS Y PROCEDIMIENTOS DEL SERVICIO APOYO ECONÓMICO TIPO C, REQUERIDOS PARA EL OPORTUNO Y ADECUADO REGISTRO, CRUCE Y REPORTE DE LOS DATOS EN EL SISTEMA MISIONAL SIRBE, QUE CONTRIBUYAN A LA GARANTÍA DE LOS DERECHOS DE LA POBLACIÓN MAYOR EN EL MARCO DE LA POLÍTICA PÚBLICA SOCIAL PARA EL ENVEJECIMIENTO Y LA VEJEZ EN EL DISTRITO CAPITAL A CARGO DE LA ALCALDÍA LOCAL.","Inversión","Un nuevo contrato social y ambiental para la Bogotá del Siglo XXI",1,{"$f":"IF(ISERROR(VLOOKUP(K148,Proposito_programa!$C$2:$E$59,2,FALSE)),\" \",VLOOKUP(K148,Proposito_programa!$C$2:$E$59,2,FALSE))","v":"Subsidios y transferencias para la equidad"},{"$f":"IF(ISERROR(VLOOKUP(K148,Proposito_programa!$C$2:$E$59,3,FALSE)),\" \",VLOOKUP(K148,Proposito_programa!$C$2:$E$59,3,FALSE))","v":"Propósito 1: Hacer un nuevo contrato social para incrementar la inclusión social, productiva y política"},"O23011601010000001636",1,52363835,"ERIKA YOLIMA GELVEZ RUIZ","Persona Natural",null,null,null,null,59400000,null,1,5220000,64620000,48240000,"2022-01-27","2022-02-02","2023-01-22",330,1,29,null,null,null,null,"Terminacion Anticipada",0.74651810584958223]
[139,2022,"FDLRUU-CD-139-2022","https://Community.seCop.gov.Co/PubliC/Tendering/OpportunityDetail/Index?notiCeUID=CO1.NTC.2753678&isFromPubliCArea=True&isModal=False","Contratos de prestación de servicios profesionales y de apoyo a la gestión","Contratación directa","Prestación de servicios profesionales y de apoyo a la gestión, o para la ejecución de trabajos artísticos que sólo puedan encomendarse a determinadas personas naturales","PRESTAR LOS SERVICIOS PROFESIONALES DE APOYO EN EL ÁREA DE GESTIÓN DE DESARROLLO LOCAL PARA ADELANTAR LAS ACTIVIDADES, TRAMITES Y PROCEDIMIENTOS RELACIONADOS CON EL MARCO NORMATIVO CONTABLE.","Inversión","Un nuevo contrato social y ambiental para la Bogotá del Siglo XXI",57,{"$f":"IF(ISERROR(VLOOKUP(K149,Proposito_programa!$C$2:$E$59,2,FALSE)),\" \",VLOOKUP(K149,Proposito_programa!$C$2:$E$59,2,FALSE))","v":"Gestión pública local"},{"$f":"IF(ISERROR(VLOOKUP(K149,Proposito_programa!$C$2:$E$59,3,FALSE)),\" \",VLOOKUP(K149,Proposito_programa!$C$2:$E$59,3,FALSE))","v":"Propósito 5: Construir Bogotá - Región con gobierno abierto, transparente y ciudadanía consciente"},"O23011605570000001697",1,79880521,"NICOLAS RODRIGUEZ DUCAT","Persona Natural",null,null,null,null,59400000,null,null,null,59400000,52560000,"2022-01-27","2022-02-09","2023-01-08",330,null,null,null,null,null,null,"Terminado",0.88484848484848488]
[140,2022,"FDLRUU-CD-140-2022","https://Community.seCop.gov.Co/PubliC/Tendering/OpportunityDetail/Index?notiCeUID=CO1.NTC.2733538&isFromPubliCArea=True&isModal=False\n","Contratos de prestación de servicios profesionales y de apoyo a la gestión","Contratación directa","Prestación de servicios profesionales y de apoyo a la gestión, o para la ejecución de trabajos artísticos que sólo puedan encomendarse a determinadas personas naturales","APOYAR LA GESTIÓN DOCUMENTAL DE LA ALCALDÍA LOCAL DE RAFAEL URIBE URIBE PARA LA IMPLEMENTACIÓN DEL PROCESO DE VERIFICACIÓN, SOPORTE Y ACOMPAÑAMIENTO, EN EL DESARROLLO DE LAS ACTIVIDADES PROPIAS DE LOS PROCESOS Y ACTUACIONES ADMINISTRATIVAS EXISTENTES EN EL AREA DE GESTION POLICIVA Y JURIDICA.","Inversión","Un nuevo contrato social y ambiental para la Bogotá del Siglo XXI",57,{"$f":"IF(ISERROR(VLOOKUP(K150,Proposito_programa!$C$2:$E$59,2,FALSE)),\" \",VLOOKUP(K150,Proposito_programa!$C$2:$E$59,2,FALSE))","v":"Gestión pública local"},{"$f":"IF(ISERROR(VLOOKUP(K150,Proposito_programa!$C$2:$E$59,3,FALSE)),\" \",VLOOKUP(K150,Proposito_programa!$C$2:$E$59,3,FALSE))","v":"Propósito 5: Construir Bogotá - Región con gobierno abierto, transparente y ciudadanía consciente"},"O23011605570000001698",1,52828741,"NINI JOHANA VALENZUELA ROMERO","Persona Natural",null,null,null,null,20400000,null,null,null,20400000,20400000,"2022-01-26","2022-01-27","2022-07-26",180,null,null,null,null,null,null,"Terminado",1]
[141,2022,"FDLRUU-CD-140-2022","https://Community.seCop.gov.Co/PubliC/Tendering/OpportunityDetail/Index?notiCeUID=CO1.NTC.2733538&isFromPubliCArea=True&isModal=False\n","Contratos de prestación de servicios profesionales y de apoyo a la gestión","Contratación directa","Prestación de servicios profesionales y de apoyo a la gestión, o para la ejecución de trabajos artísticos que sólo puedan encomendarse a determinadas personas naturales","APOYAR LA GESTIÓN DOCUMENTAL DE LA ALCALDÍA LOCAL DE RAFAEL URIBE URIBE PARA LA IMPLEMENTACIÓN DEL PROCESO DE VERIFICACIÓN, SOPORTE Y ACOMPAÑAMIENTO, EN EL DESARROLLO DE LAS ACTIVIDADES PROPIAS DE LOS PROCESOS Y ACTUACIONES ADMINISTRATIVAS EXISTENTES EN EL AREA DE GESTION POLICIVA Y JURIDICA.","Inversión","Un nuevo contrato social y ambiental para la Bogotá del Siglo XXI",57,{"$f":"IF(ISERROR(VLOOKUP(K151,Proposito_programa!$C$2:$E$59,2,FALSE)),\" \",VLOOKUP(K151,Proposito_programa!$C$2:$E$59,2,FALSE))","v":"Gestión pública local"},{"$f":"IF(ISERROR(VLOOKUP(K151,Proposito_programa!$C$2:$E$59,3,FALSE)),\" \",VLOOKUP(K151,Proposito_programa!$C$2:$E$59,3,FALSE))","v":"Propósito 5: Construir Bogotá - Región con gobierno abierto, transparente y ciudadanía consciente"},"O23011605570000001698",1,41799594,"ANA CONSUELO TRIVIÑO MORALES","Persona Natural",null,null,null,null,20400000,null,1,10200000,30600000,30600000,"2022-01-26","2022-01-27","2022-10-26",180,1,90,null,null,null,null,"Terminado",1]
[142,2022,"FDLRUU-CD-142-2022","https://Community.seCop.gov.Co/PubliC/Tendering/OpportunityDetail/Index?notiCeUID=CO1.NTC.2734760&isFromPubliCArea=True&isModal=False","Contratos de prestación de servicios profesionales y de apoyo a la gestión","Contratación directa","Prestación de servicios profesionales y de apoyo a la gestión, o para la ejecución de trabajos artísticos que sólo puedan encomendarse a determinadas personas naturales","APOYAR JURIDICAMENTE EN EL ACOMPAÑAMIENTO A LOS OPERATIVOS Y JORNADAS RELACIONADAS CON ASUNTOS DE SEGURIDAD CIUDADANA, CONVIVENCIA Y PREVENCIÓN DE CONFLICTIVIDADES PARA EL AREA DE GESTION POLICIVA DE LA ALCALDIA LOCAL DE RAFAEL URIBE URIBE\t","Inversión","Un nuevo contrato social y ambiental para la Bogotá del Siglo XXI",57,{"$f":"IF(ISERROR(VLOOKUP(K152,Proposito_programa!$C$2:$E$59,2,FALSE)),\" \",VLOOKUP(K152,Proposito_programa!$C$2:$E$59,2,FALSE))","v":"Gestión pública local"},{"$f":"IF(ISERROR(VLOOKUP(K152,Proposito_programa!$C$2:$E$59,3,FALSE)),\" \",VLOOKUP(K152,Proposito_programa!$C$2:$E$59,3,FALSE))","v":"Propósito 5: Construir Bogotá - Región con gobierno abierto, transparente y ciudadanía consciente"},"O23011605570000001698",1,79650934,"HERNAN FABIO PALMAR CONTRERAS","Persona Natural",null,null,null,null,32400000,null,1,16200000,48600000,48600000,"2022-01-28","2022-02-01","2022-10-31",180,1,90,null,null,null,null,"Terminado",1]
[143,2022,"FDLRUU-CD-143-2022","https://Community.seCop.gov.Co/PubliC/Tendering/OpportunityDetail/Index?notiCeUID=CO1.NTC.2739760&isFromPubliCArea=True&isModal=False","Contratos de prestación de servicios profesionales y de apoyo a la gestión","Contratación directa","Prestación de servicios profesionales y de apoyo a la gestión, o para la ejecución de trabajos artísticos que sólo puedan encomendarse a determinadas personas naturales","APOYAR LA FORMULACIÓN, GESTIÓN Y SEGUIMIENTO DE ACTIVIDADES ENFOCADAS A LA GESTIÓN AMBIENTAL EXTERNA, ENCAMINADAS A LA MITIGACIÓN DE LOS DIFERENTES IMPACTOS AMBIENTALES Y LA CONSERVACIÓN DE LOS RECURSOS NATURALES DE LA LOCALIDAD\t","Inversión","Un nuevo contrato social y ambiental para la Bogotá del Siglo XXI",57,{"$f":"IF(ISERROR(VLOOKUP(K153,Proposito_programa!$C$2:$E$59,2,FALSE)),\" \",VLOOKUP(K153,Proposito_programa!$C$2:$E$59,2,FALSE))","v":"Gestión pública local"},{"$f":"IF(ISERROR(VLOOKUP(K153,Proposito_programa!$C$2:$E$59,3,FALSE)),\" \",VLOOKUP(K153,Proposito_programa!$C$2:$E$59,3,FALSE))","v":"Propósito 5: Construir Bogotá - Región con gobierno abierto, transparente y ciudadanía consciente"},"O23011605570000001697",1,52538287,"MARIBEL PEÑA PRIETO","Persona Natural",null,null,null,null,32400000,null,null,null,32400000,32400000,"2022-01-26","2022-01-28","2022-07-27",180,null,null,null,null,null,null,"Terminado",1]
[144,2022,"\t\nCPS-144-2022\n","https://Community.seCop.gov.Co/PubliC/Tendering/OpportunityDetail/Index?notiCeUID=CO1.NTC.2735938&isFromPubliCArea=True&isModal=False","Contratos de prestación de servicios profesionales y de apoyo a la gestión","Contratación directa","Prestación de servicios profesionales y de apoyo a la gestión, o para la ejecución de trabajos artísticos que sólo puedan encomendarse a determinadas personas naturales","PRESTAR LOS SERVICIOS PROFESIONALES AL DESPACHO EN EL SEGUIMIENTO E IMPLEMENTACION DE POLITICAS PUBLICAS DISTRITALES EN LA ALCALDÍA LOCAL DE RAFAEL URIBE URIBE","Inversión","Un nuevo contrato social y ambiental para la Bogotá del Siglo XXI",57,{"$f":"IF(ISERROR(VLOOKUP(K154,Proposito_programa!$C$2:$E$59,2,FALSE)),\" \",VLOOKUP(K154,Proposito_programa!$C$2:$E$59,2,FALSE))","v":"Gestión pública local"},{"$f":"IF(ISERROR(VLOOKUP(K154,Proposito_programa!$C$2:$E$59,3,FALSE)),\" \",VLOOKUP(K154,Proposito_programa!$C$2:$E$59,3,FALSE))","v":"Propósito 5: Construir Bogotá - Región con gobierno abierto, transparente y ciudadanía consciente"},"O23011605570000001697",1,80442207,"LEONARDO GUERRA RAMIREZ","Persona Natural",null,null,null,null,42240000,null,null,null,42240000,42240000,"2022-01-28","2022-01-28","2022-07-27",180,null,null,null,null,null,null,"Terminado",1]
[145,2022,"FDLRUU-CD-145-2022","https://Community.seCop.gov.Co/PubliC/Tendering/OpportunityDetail/Index?notiCeUID=CO1.NTC.2739687&isFromPubliCArea=True&isModal=False","Contratos de prestación de servicios profesionales y de apoyo a la gestión","Contratación directa","Prestación de servicios profesionales y de apoyo a la gestión, o para la ejecución de trabajos artísticos que sólo puedan encomendarse a determinadas personas naturales","APOYAR TÉCNICAMENTE LAS DISTINTAS ETAPAS DE LOS PROCESOS DE COMPETENCIA DE LA ALCALDÍA LOCAL PARA LA DEPURACIÓN D E LAS ACTUACIONES ADMINISTRATIVAS.\t","Inversión","Un nuevo contrato social y ambiental para la Bogotá del Siglo XXI",57,{"$f":"IF(ISERROR(VLOOKUP(K155,Proposito_programa!$C$2:$E$59,2,FALSE)),\" \",VLOOKUP(K155,Proposito_programa!$C$2:$E$59,2,FALSE))","v":"Gestión pública local"},{"$f":"IF(ISERROR(VLOOKUP(K155,Proposito_programa!$C$2:$E$59,3,FALSE)),\" \",VLOOKUP(K155,Proposito_programa!$C$2:$E$59,3,FALSE))","v":"Propósito 5: Construir Bogotá - Región con gobierno abierto, transparente y ciudadanía consciente"},"O23011605570000001698",1,19410967,"ORLANDO MERCHAN BARRETO","Persona Natural",null,null,null,null,32400000,null,1,16200000,48600000,48600000,"2022-01-26","2022-01-28","2022-10-27",180,1,90,null,null,null,null,"Terminado",1]
[146,2022,"FDLRUU-CD-146-2022","https://Community.seCop.gov.Co/PubliC/Tendering/OpportunityDetail/Index?notiCeUID=CO1.NTC.2743615&isFromPubliCArea=True&isModal=False","Contratos de prestación de servicios profesionales y de apoyo a la gestión","Contratación directa","Prestación de servicios profesionales y de apoyo a la gestión, o para la ejecución de trabajos artísticos que sólo puedan encomendarse a determinadas personas naturales","APOYAR TÉCNICAMENTE LAS DISTINTAS ETAPAS DE LOS PROCESOS DE COMPETENCIA DE LA ALCALDÍA LOCAL PARA LA DEPURACIÓN D E LAS ACTUACIONES ADMINISTRATIVAS.\t","Inversión","Un nuevo contrato social y ambiental para la Bogotá del Siglo XXI",57,{"$f":"IF(ISERROR(VLOOKUP(K156,Proposito_programa!$C$2:$E$59,2,FALSE)),\" \",VLOOKUP(K156,Proposito_programa!$C$2:$E$59,2,FALSE))","v":"Gestión pública local"},{"$f":"IF(ISERROR(VLOOKUP(K156,Proposito_programa!$C$2:$E$59,3,FALSE)),\" \",VLOOKUP(K156,Proposito_programa!$C$2:$E$59,3,FALSE))","v":"Propósito 5: Construir Bogotá - Región con gobierno abierto, transparente y ciudadanía consciente"},"O23011605570000001698",1,79692123,"CAMPO ELIAS GUTIERREZ GARCÍA","Persona Natural",null,null,null,null,32400000,null,1,16200000,48600000,{"$f":"30240000+AL156","v":48600000},"2022-01-26","2022-01-28","2022-10-27",180,1,90,1023886101,"HEYDY MILENA RAMIREZ CARDENAS","2022-05-10",18360000,"Terminado",1]
[147,2022,"FDLRUU-CD-147-2022","https://Community.seCop.gov.Co/PubliC/Tendering/OpportunityDetail/Index?notiCeUID=CO1.NTC.2769423&isFromPubliCArea=True&isModal=False","Contratos de prestación de servicios profesionales y de apoyo a la gestión","Contratación directa","Prestación de servicios profesionales y de apoyo a la gestión, o para la ejecución de trabajos artísticos que sólo puedan encomendarse a determinadas personas naturales","APOYAR TÉCNICAMENTE LAS DISTINTAS ETAPAS DE LOS PROCESOS DE COMPETENCIA DE LA ALCALDÍA LOCAL PARA LA DEPURACIÓN DE LAS ACTUACIONES ADMINISTRATIVAS\t","Inversión","Un nuevo contrato social y ambiental para la Bogotá del Siglo XXI",57,{"$f":"IF(ISERROR(VLOOKUP(K157,Proposito_programa!$C$2:$E$59,2,FALSE)),\" \",VLOOKUP(K157,Proposito_programa!$C$2:$E$59,2,FALSE))","v":"Gestión pública local"},{"$f":"IF(ISERROR(VLOOKUP(K157,Proposito_programa!$C$2:$E$59,3,FALSE)),\" \",VLOOKUP(K157,Proposito_programa!$C$2:$E$59,3,FALSE))","v":"Propósito 5: Construir Bogotá - Región con gobierno abierto, transparente y ciudadanía consciente"},"O23011605570000001698",1,1020753752,"CARLOS FELIPE SUAREZ PIEDRAHITA","Persona Natural",null,null,null,null,32400000,null,1,16200000,48600000,48600000,"2022-01-28","2022-02-01","2022-10-31",180,1,90,null,null,null,null,"Terminado",1]
[148,2022,"FDLRUU-CD-148-2022","https://Community.seCop.gov.Co/PubliC/Tendering/OpportunityDetail/Index?notiCeUID=CO1.NTC.2756046&isFromPubliCArea=True&isModal=False","Contratos de prestación de servicios profesionales y de apoyo a la gestión","Contratación directa","Prestación de servicios profesionales y de apoyo a la gestión, o para la ejecución de trabajos artísticos que sólo puedan encomendarse a determinadas personas naturales","APOYAR TÉCNICAMENTE LAS DISTINTAS ETAPAS DE LOS PROCESOS DE COMPETENCIA DE LA ALCALDÍA LOCAL PARA LA DEPURACIÓN DE LAS ACTUACIONES ADMINISTRATIVAS.\t","Inversión","Un nuevo contrato social y ambiental para la Bogotá del Siglo XXI",57,{"$f":"IF(ISERROR(VLOOKUP(K158,Proposito_programa!$C$2:$E$59,2,FALSE)),\" \",VLOOKUP(K158,Proposito_programa!$C$2:$E$59,2,FALSE))","v":"Gestión pública local"},{"$f":"IF(ISERROR(VLOOKUP(K158,Proposito_programa!$C$2:$E$59,3,FALSE)),\" \",VLOOKUP(K158,Proposito_programa!$C$2:$E$59,3,FALSE))","v":"Propósito 5: Construir Bogotá - Región con gobierno abierto, transparente y ciudadanía consciente"},"O23011605570000001698",1,79743591,"CAMILO ANDRES ALVAREZ GACHARNA","Persona Natural",null,null,null,null,32400000,null,null,null,32400000,32400000,"2022-01-27","2022-02-01","2022-07-31",180,null,null,null,null,null,null,"Terminado",1]
[149,2022,"FDLRUU-CD-149-2022","https://Community.seCop.gov.Co/PubliC/Tendering/ContraCtNotiCePhases/View?PPI=CO1.PPI.17266334&isFromPubliCArea=True&isModal=False\n","Contratos de prestación de servicios profesionales y de apoyo a la gestión","Contratación directa","Prestación de servicios profesionales y de apoyo a la gestión, o para la ejecución de trabajos artísticos que sólo puedan encomendarse a determinadas personas naturales","APOYAR TÉCNICAMENTE LAS DISTINTAS ETAPAS DE LOS PROCESOS DE COMPETENCIA DE LA ALCALDÍA LOCAL PARA LA DEPURACIÓN DE LAS ACTUACIONES ADMINISTRATIVAS.\t","Inversión","Un nuevo contrato social y ambiental para la Bogotá del Siglo XXI",57,{"$f":"IF(ISERROR(VLOOKUP(K159,Proposito_programa!$C$2:$E$59,2,FALSE)),\" \",VLOOKUP(K159,Proposito_programa!$C$2:$E$59,2,FALSE))","v":"Gestión pública local"},{"$f":"IF(ISERROR(VLOOKUP(K159,Proposito_programa!$C$2:$E$59,3,FALSE)),\" \",VLOOKUP(K159,Proposito_programa!$C$2:$E$59,3,FALSE))","v":"Propósito 5: Construir Bogotá - Región con gobierno abierto, transparente y ciudadanía consciente"},"O23011605570000001698",1,80098149,"GEOVANNY ROJAS CASTRO","Persona Natural",null,null,null,null,32400000,null,1,16200000,48600000,48600000,"2022-01-27","2022-02-01","2022-10-31",180,1,90,null,null,null,null,"Terminado",1]
[150,2022,"FDLRUU-CD-150-2022","https://Community.seCop.gov.Co/PubliC/Tendering/OpportunityDetail/Index?notiCeUID=CO1.NTC.2789706&isFromPubliCArea=True&isModal=False","Contratos de prestación de servicios profesionales y de apoyo a la gestión","Contratación directa","Prestación de servicios profesionales y de apoyo a la gestión, o para la ejecución de trabajos artísticos que sólo puedan encomendarse a determinadas personas naturales","EL CONTRATISTA SE OBLIGA A PRESTAR SERVICIOS PROFESIONALES PARA REALIZAR ACUERDOS QUE GENEREN CIRCULOS O ESPACIOS PRODUCTIVOS E INICIATIVAS PARA LA FORMALIZACION DE LOS VENDEDORES INFORMALES EN RAFAEL URIBE URIBE EN EL MARCO DEL PROYECTO DE INVERSIÓN 1681\t","Inversión","Un nuevo contrato social y ambiental para la Bogotá del Siglo XXI",45,{"$f":"IF(ISERROR(VLOOKUP(K160,Proposito_programa!$C$2:$E$59,2,FALSE)),\" \",VLOOKUP(K160,Proposito_programa!$C$2:$E$59,2,FALSE))","v":"Espacio público más seguro y construido colectivamente"},{"$f":"IF(ISERROR(VLOOKUP(K160,Proposito_programa!$C$2:$E$59,3,FALSE)),\" \",VLOOKUP(K160,Proposito_programa!$C$2:$E$59,3,FALSE))","v":"Propósito 3: Inspirar confianza y legitimidad para vivir sin miedo y ser epicentro de cultura ciudadana, paz y reconciliación"},"O23011603450000001681",1,53043856,"NINI JOHANNA HERNANDEZ HERNANDEZ","Persona Natural",null,null,null,null,57200000,null,null,null,57200000,52000000,"2022-01-28","2022-02-01","2023-01-31",330,null,null,null,null,null,null,"Terminado",0.90909090909090906]
[151,2022,"FDLRUU-CD-151-2022","https://Community.seCop.gov.Co/PubliC/Tendering/OpportunityDetail/Index?notiCeUID=CO1.NTC.2767520&isFromPubliCArea=True&isModal=False","Contratos de prestación de servicios profesionales y de apoyo a la gestión","Contratación directa","Prestación de servicios profesionales y de apoyo a la gestión, o para la ejecución de trabajos artísticos que sólo puedan encomendarse a determinadas personas naturales","PRESTAR SERVICIOS PROFESIONALES PARA REALIZAR ACUERDOS QUE GENEREN CIRCULOS O ESPACIOS PRODUCTIVOS E INICIATIVAS PARA LA FORMALIZACION DE LOS VENDEDORES INFORMALES EN RAFAEL URIBE URIBE EN EL MARCO DEL PROYECTO DE INVERSIÓN 1681\t","Inversión","Un nuevo contrato social y ambiental para la Bogotá del Siglo XXI",45,{"$f":"IF(ISERROR(VLOOKUP(K161,Proposito_programa!$C$2:$E$59,2,FALSE)),\" \",VLOOKUP(K161,Proposito_programa!$C$2:$E$59,2,FALSE))","v":"Espacio público más seguro y construido colectivamente"},{"$f":"IF(ISERROR(VLOOKUP(K161,Proposito_programa!$C$2:$E$59,3,FALSE)),\" \",VLOOKUP(K161,Proposito_programa!$C$2:$E$59,3,FALSE))","v":"Propósito 3: Inspirar confianza y legitimidad para vivir sin miedo y ser epicentro de cultura ciudadana, paz y reconciliación"},"O23011603450000001681",1,79497759,"JORGE MAURICIO CARDENAS ROBAYO ","Persona Natural",null,null,null,null,57200000,null,1,5200000,62400000,52000000,"2022-01-28","2022-02-01","2023-01-30",330,1,30,null,null,null,null,"Terminado",0.83333333333333337]
[152,2022,"FDLRUU-CD-152-2022","https://Community.seCop.gov.Co/PubliC/Tendering/OpportunityDetail/Index?notiCeUID=CO1.NTC.2772697&isFromPubliCArea=True&isModal=False","Contratos de prestación de servicios profesionales y de apoyo a la gestión","Contratación directa","Prestación de servicios profesionales y de apoyo a la gestión, o para la ejecución de trabajos artísticos que sólo puedan encomendarse a determinadas personas naturales","PRESTAR SERVICIOS PROFESIONALES PARA EL APOYO Y GESTIÓN INTERINSTUCIONAL CON LAS ENTIDADES DEL DISTRITO ENCARGADAS DE LA RECREACIÓN, DEPORTE Y CULTURA PARA FOCALIZAR LA OFERTA EN USUARIOS DE TRANSPORTE NO MOTORIZADOS Y EL BUEN USO DEL ESPACIO PÚBLICO EN RAFAEL URIBE URIBE\t","Inversión","Un nuevo contrato social y ambiental para la Bogotá del Siglo XXI",45,{"$f":"IF(ISERROR(VLOOKUP(K162,Proposito_programa!$C$2:$E$59,2,FALSE)),\" \",VLOOKUP(K162,Proposito_programa!$C$2:$E$59,2,FALSE))","v":"Espacio público más seguro y construido colectivamente"},{"$f":"IF(ISERROR(VLOOKUP(K162,Proposito_programa!$C$2:$E$59,3,FALSE)),\" \",VLOOKUP(K162,Proposito_programa!$C$2:$E$59,3,FALSE))","v":"Propósito 3: Inspirar confianza y legitimidad para vivir sin miedo y ser epicentro de cultura ciudadana, paz y reconciliación"},"O23011603450000001681",1,1014178675,"ADRIANA MARITZA ANGULO LEON","Persona Natural",null,null,null,null,57200000,null,null,null,57200000,50613333,"2022-01-28","2022-02-09","2023-01-08",330,null,null,null,null,null,null,"Terminado",0.88484847902097907]
[153,2022,"FDLRUU-CD-153-2022","https://Community.seCop.gov.Co/PubliC/Tendering/OpportunityDetail/Index?notiCeUID=CO1.NTC.2791007&isFromPubliCArea=True&isModal=False","Contratos de prestación de servicios profesionales y de apoyo a la gestión","Contratación directa","Prestación de servicios profesionales y de apoyo a la gestión, o para la ejecución de trabajos artísticos que sólo puedan encomendarse a determinadas personas naturales","PRESTAR SERVICIOS PROFESIONALES PARA EL APOYO Y GESTIÓN INTERINSTUCIONAL CON LAS ENTIDADES DEL DISTRITO ENCARGADAS DE LA RECREACIÓN, DEPORTE Y CULTURA PARA FOCALIZAR LA OFERTA EN USUARIOS DE TRANSPORTE NO MOTORIZADOS Y EL BUEN USO DEL ESPACIO PÚBLICO EN RAFAEL URIBE URIBE.\t","Inversión","Un nuevo contrato social y ambiental para la Bogotá del Siglo XXI",45,{"$f":"IF(ISERROR(VLOOKUP(K163,Proposito_programa!$C$2:$E$59,2,FALSE)),\" \",VLOOKUP(K163,Proposito_programa!$C$2:$E$59,2,FALSE))","v":"Espacio público más seguro y construido colectivamente"},{"$f":"IF(ISERROR(VLOOKUP(K163,Proposito_programa!$C$2:$E$59,3,FALSE)),\" \",VLOOKUP(K163,Proposito_programa!$C$2:$E$59,3,FALSE))","v":"Propósito 3: Inspirar confianza y legitimidad para vivir sin miedo y ser epicentro de cultura ciudadana, paz y reconciliación"},"O23011603450000001681",1,52968152,"DIANA MARIA MORA RAMIREZ ","Persona Natural",null,null,null,null,57200000,null,1,5026667,62226667,51826667,"2022-01-28","2022-02-02","2023-01-30",330,1,29,null,null,null,null,"Terminado",0.83286908167522455]
[154,2022,"FDLRUU-CD-154-2022","https://Community.seCop.gov.Co/PubliC/Tendering/OpportunityDetail/Index?notiCeUID=CO1.NTC.2747004&isFromPubliCArea=True&isModal=False","Contratos de prestación de servicios profesionales y de apoyo a la gestión","Contratación directa","Prestación de servicios profesionales y de apoyo a la gestión, o para la ejecución de trabajos artísticos que sólo puedan encomendarse a determinadas personas naturales","PRESTAR LOS SERVICIOS DE APOYO TÉCNICO EN LA GESTIÓN EN LAS LABORES ADMINISTRATIVAS, OPERATIVAS Y LOGÍSTICAS QUE SE REQUIERAN EN EL ÁREA DE GESTIÓN DEL DESARROLLO DE LA ALCALDÍA LOCAL DE RAFAEL URIBE URIBE","Inversión","Un nuevo contrato social y ambiental para la Bogotá del Siglo XXI",57,{"$f":"IF(ISERROR(VLOOKUP(K164,Proposito_programa!$C$2:$E$59,2,FALSE)),\" \",VLOOKUP(K164,Proposito_programa!$C$2:$E$59,2,FALSE))","v":"Gestión pública local"},{"$f":"IF(ISERROR(VLOOKUP(K164,Proposito_programa!$C$2:$E$59,3,FALSE)),\" \",VLOOKUP(K164,Proposito_programa!$C$2:$E$59,3,FALSE))","v":"Propósito 5: Construir Bogotá - Región con gobierno abierto, transparente y ciudadanía consciente"},"O23011605570000001697",1,19445797,"CARLOS ALBERTO ESCOBAR LARA","Persona Natural",null,null,null,null,24000000,null,1,12000000,36000000,36000000,"2022-01-27","2022-01-28","2022-10-27",180,1,90,null,null,null,null,"Terminado",1]
[155,2022,"FDLRUU-CD-155-2022","https://Community.seCop.gov.Co/PubliC/Tendering/OpportunityDetail/Index?notiCeUID=CO1.NTC.2749007&isFromPubliCArea=True&isModal=False","Contratos de prestación de servicios profesionales y de apoyo a la gestión","Contratación directa","Prestación de servicios profesionales y de apoyo a la gestión, o para la ejecución de trabajos artísticos que sólo puedan encomendarse a determinadas personas naturales","PRESTAR LOS SERVICIOS DE APOYO TÉCNICO EN LA GESTIÓN EN LAS LABORES ADMINISTRATIVAS, OPERATIVAS Y LOGÍSTICAS QUE SE REQUIERAN EN EL ÁREA DE GESTIÓN DEL DESARROLLO DE LA ALCALDÍA LOCAL DE RAFAEL URIBE URIBE","Inversión","Un nuevo contrato social y ambiental para la Bogotá del Siglo XXI",57,{"$f":"IF(ISERROR(VLOOKUP(K165,Proposito_programa!$C$2:$E$59,2,FALSE)),\" \",VLOOKUP(K165,Proposito_programa!$C$2:$E$59,2,FALSE))","v":"Gestión pública local"},{"$f":"IF(ISERROR(VLOOKUP(K165,Proposito_programa!$C$2:$E$59,3,FALSE)),\" \",VLOOKUP(K165,Proposito_programa!$C$2:$E$59,3,FALSE))","v":"Propósito 5: Construir Bogotá - Región con gobierno abierto, transparente y ciudadanía consciente"},"O23011605570000001697",1,1030559488,"CARLOS GIOVANNY CASTELLANOS GUZMAN","Persona Natural",null,null,null,null,24000000,null,1,12000000,36000000,36000000,"2022-01-27","2022-01-28","2022-10-27",180,1,90,null,null,null,null,"Terminado",1]
[156,2022,"FDLRUU-CD-156-2022","https://Community.seCop.gov.Co/PubliC/Tendering/OpportunityDetail/Index?notiCeUID=CO1.NTC.2741288&isFromPubliCArea=True&isModal=False","Contratos de prestación de servicios profesionales y de apoyo a la gestión","Contratación directa","Prestación de servicios profesionales y de apoyo a la gestión, o para la ejecución de trabajos artísticos que sólo puedan encomendarse a determinadas personas naturales","PRESTAR LOS SERVICIOS PROFESIONALES EN LA ALCALDÍA LOCAL DE RAFAEL URIBE URIBE EN TODAS LAS GESTIONES JURÍDICAS Y ADMINISTRATIVAS EN MATERIA DE PROPIEDAD HORIZONTAL, TRAMITES DE SOLICITUDES DE VENDEDORES INFORMALE Y ACTUACIONES ADMINISTRATIVAS.","Inversión","Un nuevo contrato social y ambiental para la Bogotá del Siglo XXI",57,{"$f":"IF(ISERROR(VLOOKUP(K166,Proposito_programa!$C$2:$E$59,2,FALSE)),\" \",VLOOKUP(K166,Proposito_programa!$C$2:$E$59,2,FALSE))","v":"Gestión pública local"},{"$f":"IF(ISERROR(VLOOKUP(K166,Proposito_programa!$C$2:$E$59,3,FALSE)),\" \",VLOOKUP(K166,Proposito_programa!$C$2:$E$59,3,FALSE))","v":"Propósito 5: Construir Bogotá - Región con gobierno abierto, transparente y ciudadanía consciente"},"O23011605570000001698",1,51922807,"CLAUDIA MAYERLING RODRIGUEZ MELO","Persona Natural",null,null,null,null,32400000,null,null,null,32400000,32400000,"2022-01-27","2022-01-28","2022-07-27",180,null,null,null,null,null,null,"Terminado",1]
[157,2022,"FDLRUU-CD-157-2022","https://Community.seCop.gov.Co/PubliC/Tendering/OpportunityDetail/Index?notiCeUID=CO1.NTC.2744866&isFromPubliCArea=True&isModal=False","Contratos de prestación de servicios profesionales y de apoyo a la gestión","Contratación directa","Prestación de servicios profesionales y de apoyo a la gestión, o para la ejecución de trabajos artísticos que sólo puedan encomendarse a determinadas personas naturales","PRESTAR LOS SERVICIOS PROFESIONALES PARA APOYAR LA FORMULACION, EJECUCIÓN Y SEGUIMIENTO DE LOS PROYECTOS DE INVERSIÓN DEL SECTOR AMBIENTE EN EL MARCO DEL CUMPLIMIENTO DEL PLAN DE DESARROLLO LOCAL DE LA ALCALDÍA LOCAL DE RAFAEL URIBE URIBE 2021 2024.\t","Inversión","Un nuevo contrato social y ambiental para la Bogotá del Siglo XXI",57,{"$f":"IF(ISERROR(VLOOKUP(K167,Proposito_programa!$C$2:$E$59,2,FALSE)),\" \",VLOOKUP(K167,Proposito_programa!$C$2:$E$59,2,FALSE))","v":"Gestión pública local"},{"$f":"IF(ISERROR(VLOOKUP(K167,Proposito_programa!$C$2:$E$59,3,FALSE)),\" \",VLOOKUP(K167,Proposito_programa!$C$2:$E$59,3,FALSE))","v":"Propósito 5: Construir Bogotá - Región con gobierno abierto, transparente y ciudadanía consciente"},"O23011605570000001697",1,1018475446,"MAIRA ALEJANDRA MORENO LOZANO","Persona Natural",null,null,null,null,32400000,null,1,16200000,48600000,48600000,"2022-01-27","2022-02-01","2022-10-31",180,1,90,null,null,null,null,"Terminado",1]
[158,2022,"FDLRUU-CD-158-2022","https://Community.seCop.gov.Co/PubliC/Tendering/OpportunityDetail/Index?notiCeUID=CO1.NTC.2745734&isFromPubliCArea=True&isModal=False","Contratos de prestación de servicios profesionales y de apoyo a la gestión","Contratación directa","Prestación de servicios profesionales y de apoyo a la gestión, o para la ejecución de trabajos artísticos que sólo puedan encomendarse a determinadas personas naturales","PRESTAR LOS SERVICIOS PROFESIONALES PARA APOYAR LA FORMULACION, EJECUCIÓN Y SEGUIMIENTO DE LOS PROYECTOS DE INVERSIÓN DEL SECTOR AMBIENTE EN EL MARCO DEL CUMPLIMIENTO DEL PLAN DE DESARROLLO LOCAL DE LA ALCALDÍA LOCAL DE RAFAEL URIBE URIBE 2021 2024.\t","Inversión","Un nuevo contrato social y ambiental para la Bogotá del Siglo XXI",57,{"$f":"IF(ISERROR(VLOOKUP(K168,Proposito_programa!$C$2:$E$59,2,FALSE)),\" \",VLOOKUP(K168,Proposito_programa!$C$2:$E$59,2,FALSE))","v":"Gestión pública local"},{"$f":"IF(ISERROR(VLOOKUP(K168,Proposito_programa!$C$2:$E$59,3,FALSE)),\" \",VLOOKUP(K168,Proposito_programa!$C$2:$E$59,3,FALSE))","v":"Propósito 5: Construir Bogotá - Región con gobierno abierto, transparente y ciudadanía consciente"},"O23011605570000001697",1,1026279529,"DIANA CAROLINA PINZON PEREZ","Persona Natural",null,null,null,null,32400000,null,1,16200000,48600000,48600000,"2022-01-27","2022-01-28","2022-10-27",180,1,90,null,null,null,null,"Terminado",1]
[159,2022,"FDLRUU-CD-159-2022","https://Community.seCop.gov.Co/PubliC/Tendering/OpportunityDetail/Index?notiCeUID=CO1.NTC.2746408&isFromPubliCArea=True&isModal=False","Contratos de prestación de servicios profesionales y de apoyo a la gestión","Contratación directa","Prestación de servicios profesionales y de apoyo a la gestión, o para la ejecución de trabajos artísticos que sólo puedan encomendarse a determinadas personas naturales","APOYAR JURÍDICAMENTE LAS ACCIONES REQUERIDAS PARA LA DEPURACIÓN DE LAS ACTUACIONES ADMINISTRATIVAS QUE CURSAN EN LA ALCALDÍA LOCAL DE RAFAEL URIBE URIBE.\t","Inversión","Un nuevo contrato social y ambiental para la Bogotá del Siglo XXI",57,{"$f":"IF(ISERROR(VLOOKUP(K169,Proposito_programa!$C$2:$E$59,2,FALSE)),\" \",VLOOKUP(K169,Proposito_programa!$C$2:$E$59,2,FALSE))","v":"Gestión pública local"},{"$f":"IF(ISERROR(VLOOKUP(K169,Proposito_programa!$C$2:$E$59,3,FALSE)),\" \",VLOOKUP(K169,Proposito_programa!$C$2:$E$59,3,FALSE))","v":"Propósito 5: Construir Bogotá - Región con gobierno abierto, transparente y ciudadanía consciente"},"O23011605570000001698",1,1018467983,"MOISES DAYAN FRANCISCO GOMEZ GUERRERO","Persona Natural",null,null,null,null,32400000,null,1,16200000,48600000,45720000,"2022-01-27","2022-01-28","2022-11-16",180,1,90,null,null,null,null,"Terminado",0.94074074074074077]
[160,2022,"FDLRUU-CD-160-2022","https://Community.seCop.gov.Co/PubliC/Tendering/OpportunityDetail/Index?notiCeUID=CO1.NTC.2764254&isFromPubliCArea=True&isModal=False","Contratos de prestación de servicios profesionales y de apoyo a la gestión","Contratación directa","Prestación de servicios profesionales y de apoyo a la gestión, o para la ejecución de trabajos artísticos que sólo puedan encomendarse a determinadas personas naturales","PRESTAR LOS SERVICIOS PROFESIONALES ESPECIALIZADOS PARA APOYAR EL SEGUIMIENTO Y LA SUPERVISIÓN DE LA EJECUCIÓN DE LOS PROYECTOS DE INVERSIÓN DESTINADOS A LA INTERVENCIÓN DE PARQUES Y DEMÁS INFRAESTRUCTURA DE LA LOCALIDAD DE RAFAEL URIBE URI\t","Inversión","Un nuevo contrato social y ambiental para la Bogotá del Siglo XXI",57,{"$f":"IF(ISERROR(VLOOKUP(K170,Proposito_programa!$C$2:$E$59,2,FALSE)),\" \",VLOOKUP(K170,Proposito_programa!$C$2:$E$59,2,FALSE))","v":"Gestión pública local"},{"$f":"IF(ISERROR(VLOOKUP(K170,Proposito_programa!$C$2:$E$59,3,FALSE)),\" \",VLOOKUP(K170,Proposito_programa!$C$2:$E$59,3,FALSE))","v":"Propósito 5: Construir Bogotá - Región con gobierno abierto, transparente y ciudadanía consciente"},"O23011605570000001697",1,68290146,"CLAUDIA INDIRA JIMENEZ ACOSTA","Persona Natural",null,null,null,null,42600000,null,1,21300000,63900000,{"$f":"52540000+AL170","v":63900000},"2022-01-27","2022-01-28","2022-10-27",180,1,90,80061073,"ENVER JULIAN LOPEZ ANGEL ","2022-03-16",11360000,"Terminado",1]
[161,2022,"FDLRUU-CD-161-2022","https://Community.seCop.gov.Co/PubliC/Tendering/OpportunityDetail/Index?notiCeUID=CO1.NTC.2740671&isFromPubliCArea=True&isModal=False","Contratos de prestación de servicios profesionales y de apoyo a la gestión","Contratación directa","Prestación de servicios profesionales y de apoyo a la gestión, o para la ejecución de trabajos artísticos que sólo puedan encomendarse a determinadas personas naturales","PRESTAR SERVICIOS PROFESIONALES ESPECIALIZADOS EN EL ÁREA DE GESTIÓN DEL DESARROLLO LOCAL PARA EL APOYO AL SEGUIMIENTO DE LA EJECUCIÓN DE LOS PROYECTOS DE INVERSIÓN DESTINADOS A LA INTERVENCIÓN DE INFRAESTRUCTURA DE LA LOCALIDAD DE RAFAEL URIBE URIBE.\t","Inversión","Un nuevo contrato social y ambiental para la Bogotá del Siglo XXI",57,{"$f":"IF(ISERROR(VLOOKUP(K171,Proposito_programa!$C$2:$E$59,2,FALSE)),\" \",VLOOKUP(K171,Proposito_programa!$C$2:$E$59,2,FALSE))","v":"Gestión pública local"},{"$f":"IF(ISERROR(VLOOKUP(K171,Proposito_programa!$C$2:$E$59,3,FALSE)),\" \",VLOOKUP(K171,Proposito_programa!$C$2:$E$59,3,FALSE))","v":"Propósito 5: Construir Bogotá - Región con gobierno abierto, transparente y ciudadanía consciente"},"O23011605570000001697",1,79594955,"HECTOR ENRIQUE ERIRA MORENO","Persona Natural",null,null,null,null,42600000,null,null,null,42600000,42600000,"2022-01-26","2022-02-01","2022-07-31",180,null,null,null,null,null,null,"Terminado",1]
[162,2022,"FDLRUU-CD-162-2022","https://community.secop.gov.co/Public/Tendering/OpportunityDetail/Index?noticeUID=CO1.NTC.2807757&isFromPublicArea=True&isModal=False\n\n","Contratos de prestación de servicios profesionales y de apoyo a la gestión","Contratación directa","Prestación de servicios profesionales y de apoyo a la gestión, o para la ejecución de trabajos artísticos que sólo puedan encomendarse a determinadas personas naturales","PRESTAR LOS SERVICIOS PROFESIONALES EN EL ÁREA DE GESTIÓN DE DESARROLLO LOCAL DESARROLLANDO LAS DIFERENTES ACTIVIDADES A CARGO DE ESTA DEPENDENCIA EN TEMAS RELACIONADOS CON LA GESTIÓN DE BIENES E INVENTARIOS DE CONFORMIDAD CON LA NATURALEZA DEL SERVICIO Y LOS ESTUDIOS PREVIOS","Inversión","Un nuevo contrato social y ambiental para la Bogotá del Siglo XXI",57,{"$f":"IF(ISERROR(VLOOKUP(K172,Proposito_programa!$C$2:$E$59,2,FALSE)),\" \",VLOOKUP(K172,Proposito_programa!$C$2:$E$59,2,FALSE))","v":"Gestión pública local"},{"$f":"IF(ISERROR(VLOOKUP(K172,Proposito_programa!$C$2:$E$59,3,FALSE)),\" \",VLOOKUP(K172,Proposito_programa!$C$2:$E$59,3,FALSE))","v":"Propósito 5: Construir Bogotá - Región con gobierno abierto, transparente y ciudadanía consciente"},"O23011605570000001697",1,80779609,"FREDY ALBERTO BAQUERO MICAN","Persona Natural",null,null,null,null,27600000,null,null,null,27600000,27600000,"2022-01-28","2022-02-09","2022-08-08",180,null,null,null,null,null,null,"Terminado",1]
[163,2022,"FDLRUU-CD-163-2022","https://Community.seCop.gov.Co/PubliC/Tendering/OpportunityDetail/Index?notiCeUID=CO1.NTC.2747812&isFromPubliCArea=True&isModal=False","Contratos de prestación de servicios profesionales y de apoyo a la gestión","Contratación directa","Prestación de servicios profesionales y de apoyo a la gestión, o para la ejecución de trabajos artísticos que sólo puedan encomendarse a determinadas personas naturales","PRESTAR LOS SERVICIOS PROFESIONALES COMO ABOGADO PARA APOYAR AL FONDO DE DESARROLLO LOCAL EN EL ANÁLISIS, REVISIÓN, TRÁMITE PARA COBRO PERSUASIVO Y COACTIVO, SOLICITUDES DE ENTES DE CONTROL, CORPORACIONES PÚBLICAS Y LOS CONCEPTOS JURÍDICOS QUE SE LE SOLICITEN","Inversión","Un nuevo contrato social y ambiental para la Bogotá del Siglo XXI",57,{"$f":"IF(ISERROR(VLOOKUP(K173,Proposito_programa!$C$2:$E$59,2,FALSE)),\" \",VLOOKUP(K173,Proposito_programa!$C$2:$E$59,2,FALSE))","v":"Gestión pública local"},{"$f":"IF(ISERROR(VLOOKUP(K173,Proposito_programa!$C$2:$E$59,3,FALSE)),\" \",VLOOKUP(K173,Proposito_programa!$C$2:$E$59,3,FALSE))","v":"Propósito 5: Construir Bogotá - Región con gobierno abierto, transparente y ciudadanía consciente"},"O23011605570000001698",1,1033773166,"YURY TATIANA ANGULO PATIÑO","Persona Natural",null,null,null,null,35400000,null,1,17700000,53100000,53100000,"2022-01-27","2022-02-01","2022-10-31",180,1,90,null,null,null,null,"Terminado",1]
[164,2022,"FDLRUU-CD-164-2022","https://Community.seCop.gov.Co/PubliC/Tendering/OpportunityDetail/Index?notiCeUID=CO1.NTC.2745525&isFromPubliCArea=True&isModal=False","Contratos de prestación de servicios profesionales y de apoyo a la gestión","Contratación directa","Prestación de servicios profesionales y de apoyo a la gestión, o para la ejecución de trabajos artísticos que sólo puedan encomendarse a determinadas personas naturales","PRESTAR SUS SERVICIOS DE APOYO ADMINISTRATIVO ASISTENCIAL AL DESPACHO DE LA ALCALDÍA LOCAL DE RAFAEL URIBE URIBE","Inversión","Un nuevo contrato social y ambiental para la Bogotá del Siglo XXI",57,{"$f":"IF(ISERROR(VLOOKUP(K174,Proposito_programa!$C$2:$E$59,2,FALSE)),\" \",VLOOKUP(K174,Proposito_programa!$C$2:$E$59,2,FALSE))","v":"Gestión pública local"},{"$f":"IF(ISERROR(VLOOKUP(K174,Proposito_programa!$C$2:$E$59,3,FALSE)),\" \",VLOOKUP(K174,Proposito_programa!$C$2:$E$59,3,FALSE))","v":"Propósito 5: Construir Bogotá - Región con gobierno abierto, transparente y ciudadanía consciente"},"O23011605570000001697",1,1014266791,"ALEJANDRA RODRIGUEZ BERNAL","Persona Natural",null,null,null,null,16200000,null,null,null,16200000,16200000,"2022-01-27","2022-02-01","2022-07-31",180,null,null,null,null,null,null,"Terminado",1]
[165,2022,"FDLRUU-CD-165-2022","https://Community.seCop.gov.Co/PubliC/Tendering/ContraCtNotiCePhases/View?PPI=CO1.PPI.17227836&isFromPubliCArea=True&isModal=False","Contratos de prestación de servicios profesionales y de apoyo a la gestión","Contratación directa","Prestación de servicios profesionales y de apoyo a la gestión, o para la ejecución de trabajos artísticos que sólo puedan encomendarse a determinadas personas naturales","PRESTAR LOS SERVICIOS PROFESIONALES E N LAS RESPUESTAS A LAS EMERGENCIAS QUE SE PRESENTEN EN LA LOCALIDAD, ASÍ COMO A LAS ACTUACIONES ADMINISTRATIVAS QUE SE ESTÉN ADELANTANDO CONFORME A LA NORMATIVIDAD APLICABLE EN EL MARCO DEL CONSEJO LOCAL DE GESTIÓN DEL RIESGO Y CAMBIO CLIMÁTICO (CLGR CC) DE LA ALCALDÍA LOCAL DE RAFAEL URIBE URIBE\t","Inversión","Un nuevo contrato social y ambiental para la Bogotá del Siglo XXI",57,{"$f":"IF(ISERROR(VLOOKUP(K175,Proposito_programa!$C$2:$E$59,2,FALSE)),\" \",VLOOKUP(K175,Proposito_programa!$C$2:$E$59,2,FALSE))","v":"Gestión pública local"},{"$f":"IF(ISERROR(VLOOKUP(K175,Proposito_programa!$C$2:$E$59,3,FALSE)),\" \",VLOOKUP(K175,Proposito_programa!$C$2:$E$59,3,FALSE))","v":"Propósito 5: Construir Bogotá - Región con gobierno abierto, transparente y ciudadanía consciente"},"O23011605570000001698",1,71624800,"ELKIN DE JESUS GUTIERREZ HENAO","Persona Natural",null,null,null,null,59400000,null,1,5940000,65340000,54540000,"2022-01-27","2022-01-28","2023-01-30",330,1,33,null,null,null,null,"Terminado",0.83471074380165289]
[166,2022,"FDLRUU-CD-167-2022","https://Community.seCop.gov.Co/PubliC/Tendering/OpportunityDetail/Index?notiCeUID=CO1.NTC.2745905&isFromPubliCArea=True&isModal=False","Contratos de prestación de servicios profesionales y de apoyo a la gestión","Contratación directa","Prestación de servicios profesionales y de apoyo a la gestión, o para la ejecución de trabajos artísticos que sólo puedan encomendarse a determinadas personas naturales","PRESTAR SERVICIOS DE APOYO TECNICO AL GRUPO DE PLANEACION PARA APOYAR LA FORMULACION,Ejecucion Y SEGUIMIENTO DE LOS PROYECTOS DE INVERSION QUE FORMAN PARTE DEL PLAN DE DESARROLLO LOCAL 2021 2024 DE LA LOCALIDAD DE RAFAEL URIBE URIBE\t","Inversión","Un nuevo contrato social y ambiental para la Bogotá del Siglo XXI",57,{"$f":"IF(ISERROR(VLOOKUP(K176,Proposito_programa!$C$2:$E$59,2,FALSE)),\" \",VLOOKUP(K176,Proposito_programa!$C$2:$E$59,2,FALSE))","v":"Gestión pública local"},{"$f":"IF(ISERROR(VLOOKUP(K176,Proposito_programa!$C$2:$E$59,3,FALSE)),\" \",VLOOKUP(K176,Proposito_programa!$C$2:$E$59,3,FALSE))","v":"Propósito 5: Construir Bogotá - Región con gobierno abierto, transparente y ciudadanía consciente"},"O23011605570000001697",1,1019054181,"JENNY ELVIRA PRIETO OLARTE","Persona Natural",null,null,null,null,24000000,null,null,null,24000000,24000000,"2022-01-27","2022-01-28","2022-07-27",180,null,null,null,null,null,null,"Terminado",1]
[167,2022,"FDLRUU-CD-167-2022","https://Community.seCop.gov.Co/PubliC/Tendering/OpportunityDetail/Index?notiCeUID=CO1.NTC.2745905&isFromPubliCArea=True&isModal=False","Contratos de prestación de servicios profesionales y de apoyo a la gestión","Contratación directa","Prestación de servicios profesionales y de apoyo a la gestión, o para la ejecución de trabajos artísticos que sólo puedan encomendarse a determinadas personas naturales","PRESTAR SERVICIOS DE APOYO TECNICO AL GRUPO DE PLANEACION PARA APOYAR LA FORMULACION,Ejecucion Y SEGUIMIENTO DE LOS PROYECTOS DE INVERSION QUE FORMAN PARTE DEL PLAN DE DESARROLLO LOCAL 2021 2024 DE LA LOCALIDAD DE RAFAEL URIBE URIBE","Inversión","Un nuevo contrato social y ambiental para la Bogotá del Siglo XXI",57,{"$f":"IF(ISERROR(VLOOKUP(K177,Proposito_programa!$C$2:$E$59,2,FALSE)),\" \",VLOOKUP(K177,Proposito_programa!$C$2:$E$59,2,FALSE))","v":"Gestión pública local"},{"$f":"IF(ISERROR(VLOOKUP(K177,Proposito_programa!$C$2:$E$59,3,FALSE)),\" \",VLOOKUP(K177,Proposito_programa!$C$2:$E$59,3,FALSE))","v":"Propósito 5: Construir Bogotá - Región con gobierno abierto, transparente y ciudadanía consciente"},"O23011605570000001697",1,1033750473,"BRAYAN ANDRES MORALES CASTIBLANCO","Persona Natural",null,null,null,null,24000000,null,null,null,24000000,24000000,"2022-01-27","2022-01-28","2022-07-27",180,null,null,null,null,null,null,"Terminado",1]
[168,2022,"FDLRUU-CD-167-2022","https://Community.seCop.gov.Co/PubliC/Tendering/OpportunityDetail/Index?notiCeUID=CO1.NTC.2745905&isFromPubliCArea=True&isModal=False","Contratos de prestación de servicios profesionales y de apoyo a la gestión","Contratación directa","Prestación de servicios profesionales y de apoyo a la gestión, o para la ejecución de trabajos artísticos que sólo puedan encomendarse a determinadas personas naturales","\nPRESTAR SERVICIOS DE APOYO TECNICO AL GRUPO DE PLANEACION PARA APOYAR LA FORMULACION,Ejecucion Y SEGUIMIENTO DE LOS PROYECTOS DE INVERSION QUE FORMAN PARTE DEL PLAN DE DESARROLLO LOCAL 2021 2024 DE LA LOCALIDAD DE RAFAEL URIBE URIBE","Inversión","Un nuevo contrato social y ambiental para la Bogotá del Siglo XXI",57,{"$f":"IF(ISERROR(VLOOKUP(K178,Proposito_programa!$C$2:$E$59,2,FALSE)),\" \",VLOOKUP(K178,Proposito_programa!$C$2:$E$59,2,FALSE))","v":"Gestión pública local"},{"$f":"IF(ISERROR(VLOOKUP(K178,Proposito_programa!$C$2:$E$59,3,FALSE)),\" \",VLOOKUP(K178,Proposito_programa!$C$2:$E$59,3,FALSE))","v":"Propósito 5: Construir Bogotá - Región con gobierno abierto, transparente y ciudadanía consciente"},"O23011605570000001697",1,1031163818,"SHAMIR ALEJANDRA HERNANDEZ MARTINEZ","Persona Natural",null,null,null,null,24000000,null,1,12000000,36000000,35600000,"2022-01-27","2022-02-04","2022-11-03",180,1,90,null,null,null,null,"Terminado",0.98888888888888893]
[169,2022,"FDLRUU-CD-169-2022","https://Community.seCop.gov.Co/PubliC/Tendering/OpportunityDetail/Index?notiCeUID=CO1.NTC.2749320&isFromPubliCArea=True&isModal=False","Contratos de prestación de servicios profesionales y de apoyo a la gestión","Contratación directa","Prestación de servicios profesionales y de apoyo a la gestión, o para la ejecución de trabajos artísticos que sólo puedan encomendarse a determinadas personas naturales","PRESTAR SUS SERVICIOS DE APOYO ADMINISTRATIVO ASISTENCIAL AL DESPACHO DE LA ALCALDÍA LOCAL DE RAFAEL URIBE URIBE","Inversión","Un nuevo contrato social y ambiental para la Bogotá del Siglo XXI",57,{"$f":"IF(ISERROR(VLOOKUP(K179,Proposito_programa!$C$2:$E$59,2,FALSE)),\" \",VLOOKUP(K179,Proposito_programa!$C$2:$E$59,2,FALSE))","v":"Gestión pública local"},{"$f":"IF(ISERROR(VLOOKUP(K179,Proposito_programa!$C$2:$E$59,3,FALSE)),\" \",VLOOKUP(K179,Proposito_programa!$C$2:$E$59,3,FALSE))","v":"Propósito 5: Construir Bogotá - Región con gobierno abierto, transparente y ciudadanía consciente"},"O23011605570000001697",1,79287603,"DIEGO ANDRES LOPEZ MORENO","Persona Natural",null,null,null,null,16200000,null,1,8100000,24300000,24300000,"2022-01-27","2022-01-28","2022-10-27",180,1,90,null,null,null,null,"Terminado",1]
[170,2022,"FDLRUU-CD-170-2022","https://Community.seCop.gov.Co/PubliC/Tendering/OpportunityDetail/Index?notiCeUID=CO1.NTC.2745374&isFromPubliCArea=True&isModal=False","Contratos de prestación de servicios profesionales y de apoyo a la gestión","Contratación directa","Prestación de servicios profesionales y de apoyo a la gestión, o para la ejecución de trabajos artísticos que sólo puedan encomendarse a determinadas personas naturales","PRESTAR LOS SERVICIOS PROFESIONALES PARA LA OPERACIÓN, SEGUIMIENTO Y CUMPLIMIENTO E LOS PROCESOS Y PROCEDIMIENTOS DEL SERVICIO APOYO ECONÓMICO TIPO C, REQUERIDOS PARA EL OPORTUNO Y ADECUADO REGISTRO, CRUCE Y REPORTE DE LOS DATOS EN EL SISTEMA MISIONAL SIRBE, QUE CONTRIBUYAN A LA GARANTÍA DE LOS DERECHOS DE LA POBLACIÓN MAYOR EN EL MARCO DE LA POLÍTICA PÚBLICA SOCIAL PARA EL ENVEJECIMIENTO Y LA VEJEZ EN EL DISTRITO CAPITAL A CARGO DE LA ALCALDÍA LOCAL","Inversión","Un nuevo contrato social y ambiental para la Bogotá del Siglo XXI",1,{"$f":"IF(ISERROR(VLOOKUP(K180,Proposito_programa!$C$2:$E$59,2,FALSE)),\" \",VLOOKUP(K180,Proposito_programa!$C$2:$E$59,2,FALSE))","v":"Subsidios y transferencias para la equidad"},{"$f":"IF(ISERROR(VLOOKUP(K180,Proposito_programa!$C$2:$E$59,3,FALSE)),\" \",VLOOKUP(K180,Proposito_programa!$C$2:$E$59,3,FALSE))","v":"Propósito 1: Hacer un nuevo contrato social para incrementar la inclusión social, productiva y política"},"O23011601010000001636",1,1033695003,"Nancy Rojas Mendoza","Persona Natural",null,null,null,null,59400000,null,1,5400000,64800000,{"$f":"17460000+AL180","v":54000000},"2022-01-28","2022-02-01","2023-01-30",330,1,30,1013616944,"DANIEL VELASCO MONSALVE","2022-08-24",36540000,"Terminado",0.83333333333333337]
[171,2022,"FDLRUU-CD-171-2022","https://Community.seCop.gov.Co/PubliC/Tendering/OpportunityDetail/Index?notiCeUID=CO1.NTC.2747053&isFromPubliCArea=True&isModal=False","Contratos de prestación de servicios profesionales y de apoyo a la gestión","Contratación directa","Prestación de servicios profesionales y de apoyo a la gestión, o para la ejecución de trabajos artísticos que sólo puedan encomendarse a determinadas personas naturales","PRESTAR LOS SERVICIOS PROFESIONALES EN EL ÁREA DE GESTIÓN DE DESARROLLO LOCAL EN EL APOYO A LA SUPERVISIÓN DE LOS CONTRATOS Y/O CONVENIOS QUE LE SEAN DESIGNADOS EN SU IMPLEMENTACIÓN Y SEGUIMIENTO EN LA LOCALIDAD DE RAFAEL URIBE URIBE","Inversión","Un nuevo contrato social y ambiental para la Bogotá del Siglo XXI",57,{"$f":"IF(ISERROR(VLOOKUP(K181,Proposito_programa!$C$2:$E$59,2,FALSE)),\" \",VLOOKUP(K181,Proposito_programa!$C$2:$E$59,2,FALSE))","v":"Gestión pública local"},{"$f":"IF(ISERROR(VLOOKUP(K181,Proposito_programa!$C$2:$E$59,3,FALSE)),\" \",VLOOKUP(K181,Proposito_programa!$C$2:$E$59,3,FALSE))","v":"Propósito 5: Construir Bogotá - Región con gobierno abierto, transparente y ciudadanía consciente"},"O23011605570000001697",1,80372860,"EDISON ANGULO ARIAS","Persona Natural",null,null,null,null,37200000,null,null,null,37200000,37200000,"2022-01-27","2022-01-28","2022-07-27",180,null,null,null,null,null,null,"Terminado",1]
[172,2022,"FDLRUU-CD-172-2022","https://Community.seCop.gov.Co/PubliC/Tendering/OpportunityDetail/Index?notiCeUID=CO1.NTC.2770190&isFromPubliCArea=True&isModal=False","Contratos de prestación de servicios profesionales y de apoyo a la gestión","Contratación directa","Prestación de servicios profesionales y de apoyo a la gestión, o para la ejecución de trabajos artísticos que sólo puedan encomendarse a determinadas personas naturales","PRESTAR LOS SERVICIOS PROFESIONALES Y TECNICOS EN EL SEGUIMIENTO DE PAGOS, ACTUALIZACIÓN, LIQUIDACIÓN Y DEPURACIÓN DE LAS OBLIGACIONES POR PAGAR DE CONTRATOS DE OBRA PUBLICA E INFRAESTRUCTURA DE VIGENCIAS ANTERIORES QUE SE ENCUENTRAN VIGENTES EN EL FONDO DE DESARROLLO LOCAL DE RAFAEL URIBE URIBE\t","Inversión","Un nuevo contrato social y ambiental para la Bogotá del Siglo XXI",57,{"$f":"IF(ISERROR(VLOOKUP(K182,Proposito_programa!$C$2:$E$59,2,FALSE)),\" \",VLOOKUP(K182,Proposito_programa!$C$2:$E$59,2,FALSE))","v":"Gestión pública local"},{"$f":"IF(ISERROR(VLOOKUP(K182,Proposito_programa!$C$2:$E$59,3,FALSE)),\" \",VLOOKUP(K182,Proposito_programa!$C$2:$E$59,3,FALSE))","v":"Propósito 5: Construir Bogotá - Región con gobierno abierto, transparente y ciudadanía consciente"},"O23011605570000001697",1,79956583,"JORGE ANDRES HERNAN TORRES","Persona Natural",null,null,null,null,32400000,null,null,null,32400000,32400000,"2022-01-28","2022-02-01","2022-07-31",180,null,null,null,null,null,null,"Terminado",1]
[173,2022,"FDLRUU-CD-173-2022","https://Community.seCop.gov.Co/PubliC/Tendering/OpportunityDetail/Index?notiCeUID=CO1.NTC.2747790&isFromPubliCArea=True&isModal=False","Contratos de prestación de servicios profesionales y de apoyo a la gestión","Contratación directa","Prestación de servicios profesionales y de apoyo a la gestión, o para la ejecución de trabajos artísticos que sólo puedan encomendarse a determinadas personas naturales","APOYAR TÉCNICAMENTE A LA ALCALDÍA LOCAL EN EL ADECUADO MANEJO DE LOS DOCUMENTOS OFICIALES, MEDIANTE LA SOCIALIZACIÓN, IMPLEMENTACIÓN, MONITOREO Y SEGUIMIENTO AL APLICATIVO ORFEO, EN LAS DIFERENTES DEPENDENCIAS, CON ÉNFASIS EN EL CDI DEL AREA DE GESTION DE DESARROLLO LOCAL","Inversión","Un nuevo contrato social y ambiental para la Bogotá del Siglo XXI",57,{"$f":"IF(ISERROR(VLOOKUP(K183,Proposito_programa!$C$2:$E$59,2,FALSE)),\" \",VLOOKUP(K183,Proposito_programa!$C$2:$E$59,2,FALSE))","v":"Gestión pública local"},{"$f":"IF(ISERROR(VLOOKUP(K183,Proposito_programa!$C$2:$E$59,3,FALSE)),\" \",VLOOKUP(K183,Proposito_programa!$C$2:$E$59,3,FALSE))","v":"Propósito 5: Construir Bogotá - Región con gobierno abierto, transparente y ciudadanía consciente"},"O23011605570000001697",1,1030587570,"STEPHANIE ANDREA ARIAS RIVERA","Persona Natural",null,null,null,null,20400000,null,1,10200000,30600000,20400000,"2022-01-27","2022-02-01","2022-10-31",180,1,90,null,null,null,null,"Terminado",0.66666666666666663]
[174,2022,"FDLRUU-CD-174-2022","https://Community.seCop.gov.Co/PubliC/Tendering/OpportunityDetail/Index?notiCeUID=CO1.NTC.2747411&isFromPubliCArea=True&isModal=False","Contratos de prestación de servicios profesionales y de apoyo a la gestión","Contratación directa","Prestación de servicios profesionales y de apoyo a la gestión, o para la ejecución de trabajos artísticos que sólo puedan encomendarse a determinadas personas naturales","PRESTAR LOS SERVICIOS PROFESIONALES PARA APOYAR LA FORMULACION, EJECUCIÓN Y SEGUIMIENTO DE LOS PROYECTOS DE INVERSIÓN EN EL MARCO DEL CUMPLIMIENTO DEL PLAN DE DESARROLLO LOCAL DE LA ALCALDÍA LOCAL DE RAFAEL URIBE URIBE 2021 2024\t","Inversión","Un nuevo contrato social y ambiental para la Bogotá del Siglo XXI",57,{"$f":"IF(ISERROR(VLOOKUP(K184,Proposito_programa!$C$2:$E$59,2,FALSE)),\" \",VLOOKUP(K184,Proposito_programa!$C$2:$E$59,2,FALSE))","v":"Gestión pública local"},{"$f":"IF(ISERROR(VLOOKUP(K184,Proposito_programa!$C$2:$E$59,3,FALSE)),\" \",VLOOKUP(K184,Proposito_programa!$C$2:$E$59,3,FALSE))","v":"Propósito 5: Construir Bogotá - Región con gobierno abierto, transparente y ciudadanía consciente"},"O23011605570000001697",1,1013625644,"ANABIA JULIETH ANGARITA GALINDO","Persona Natural",null,null,null,null,59400000,null,null,null,59400000,54540000,"2022-01-27","2022-01-28","2022-12-27",330,null,null,null,null,null,null,"Terminado",0.91818181818181821]
[175,2022,"FDLRUU-CD-175-2022","https://Community.seCop.gov.Co/PubliC/Tendering/OpportunityDetail/Index?notiCeUID=CO1.NTC.2746967&isFromPubliCArea=True&isModal=False","Contratos de prestación de servicios profesionales y de apoyo a la gestión","Contratación directa","Prestación de servicios profesionales y de apoyo a la gestión, o para la ejecución de trabajos artísticos que sólo puedan encomendarse a determinadas personas naturales","APOYAR LA GESTIÓN DOCUMENTAL DE LA ALCALDÍA LOCAL AL EQUIPO JURÍDICO DE DEPURACIÓN EN LAS LABORES OPERATIVAS QUE GENERA EL PROCESO DE IMPULSO DE LAS ACTUACIONES ADMINISTRATIVAS EXISTENTES EN LA ALCALDÍA LOCAL DE RAFAEL URIBE URIBE\t","Inversión","Un nuevo contrato social y ambiental para la Bogotá del Siglo XXI",57,{"$f":"IF(ISERROR(VLOOKUP(K185,Proposito_programa!$C$2:$E$59,2,FALSE)),\" \",VLOOKUP(K185,Proposito_programa!$C$2:$E$59,2,FALSE))","v":"Gestión pública local"},{"$f":"IF(ISERROR(VLOOKUP(K185,Proposito_programa!$C$2:$E$59,3,FALSE)),\" \",VLOOKUP(K185,Proposito_programa!$C$2:$E$59,3,FALSE))","v":"Propósito 5: Construir Bogotá - Región con gobierno abierto, transparente y ciudadanía consciente"},"O23011605570000001698",1,52517945,"INGRIS YOHANNA MORALES SUAREZ","Persona Natural",null,null,null,null,11280000,null,1,5640000,16920000,16920000,"2022-01-27","2022-02-01","2022-10-31",180,1,90,null,null,null,null,"Terminado",1]
[176,2022,"FDLRUU-CD-176-2026","https://Community.seCop.gov.Co/PubliC/Tendering/OpportunityDetail/Index?notiCeUID=CO1.NTC.2749492&isFromPubliCArea=True&isModal=False","Contratos de prestación de servicios profesionales y de apoyo a la gestión","Contratación directa","Prestación de servicios profesionales y de apoyo a la gestión, o para la ejecución de trabajos artísticos que sólo puedan encomendarse a determinadas personas naturales","APOYAR Y DAR SOPORTE TÉCNICO AL ADMINISTRADOR Y USUARIO FINAL DE LA RED DE SISTEMAS Y TECNOLOGÍA E INFORMACIÓN DE LA ALCALDÍA LOCAL.\t","Inversión","Un nuevo contrato social y ambiental para la Bogotá del Siglo XXI",57,{"$f":"IF(ISERROR(VLOOKUP(K186,Proposito_programa!$C$2:$E$59,2,FALSE)),\" \",VLOOKUP(K186,Proposito_programa!$C$2:$E$59,2,FALSE))","v":"Gestión pública local"},{"$f":"IF(ISERROR(VLOOKUP(K186,Proposito_programa!$C$2:$E$59,3,FALSE)),\" \",VLOOKUP(K186,Proposito_programa!$C$2:$E$59,3,FALSE))","v":"Propósito 5: Construir Bogotá - Región con gobierno abierto, transparente y ciudadanía consciente"},"O23011605570000001697",1,52316051,"WALDINA CONTRERAS ALFONSO","Persona Natural",null,null,null,null,24000000,null,1,12000000,36000000,36000000,"2022-01-27","2022-01-27","2022-10-26",180,1,90,null,null,null,null,"Terminado",1]
[177,2022,"FDLRUU-CD-177-2022","https://Community.seCop.gov.Co/PubliC/Tendering/OpportunityDetail/Index?notiCeUID=CO1.NTC.2749841&isFromPubliCArea=True&isModal=False","Contratos de prestación de servicios profesionales y de apoyo a la gestión","Contratación directa","Prestación de servicios profesionales y de apoyo a la gestión, o para la ejecución de trabajos artísticos que sólo puedan encomendarse a determinadas personas naturales","APOYAR Y DAR SOPORTE TÉCNICO AL ADMINISTRADOR Y USUARIO FINAL DE LA RED DE SISTEMAS Y TECNOLOGÍA E INFORMACIÓN DE LA ALCALDÍA LOCAL.\t","Inversión","Un nuevo contrato social y ambiental para la Bogotá del Siglo XXI",57,{"$f":"IF(ISERROR(VLOOKUP(K187,Proposito_programa!$C$2:$E$59,2,FALSE)),\" \",VLOOKUP(K187,Proposito_programa!$C$2:$E$59,2,FALSE))","v":"Gestión pública local"},{"$f":"IF(ISERROR(VLOOKUP(K187,Proposito_programa!$C$2:$E$59,3,FALSE)),\" \",VLOOKUP(K187,Proposito_programa!$C$2:$E$59,3,FALSE))","v":"Propósito 5: Construir Bogotá - Región con gobierno abierto, transparente y ciudadanía consciente"},"O23011605570000001697",1,79910956,"JHON ALEXANDER OLAYA CUESTA","Persona Natural",null,null,null,null,24000000,null,1,12000000,36000000,36000000,"2022-01-27","2022-02-01","2022-10-31",180,1,90,null,null,null,null,"Terminado",1]
[178,2022,"FDLRUU-CD-178-2022","https://Community.seCop.gov.Co/PubliC/Tendering/OpportunityDetail/Index?notiCeUID=CO1.NTC.2747809&isFromPubliCArea=True&isModal=False","Contratos de prestación de servicios profesionales y de apoyo a la gestión","Contratación directa","Prestación de servicios profesionales y de apoyo a la gestión, o para la ejecución de trabajos artísticos que sólo puedan encomendarse a determinadas personas naturales","APOYAR LA GESTIÓN DOCUMENTAL DE LA ALCALDÍA LOCAL, ACOMPAÑANDO AL EQUIPO JURÍDICO DE DEPURACIÓN EN LAS LABORES OPERATIVAS QUE GENERA EL PROCESO DE IMPULSO DE LAS ACTUACIONES ADMINISTRATIVAS EXISTENTES EN LA ALCALDÍA LOCAL DE RAFAEL URIBE URIBE\t","Inversión","Un nuevo contrato social y ambiental para la Bogotá del Siglo XXI",57,{"$f":"IF(ISERROR(VLOOKUP(K188,Proposito_programa!$C$2:$E$59,2,FALSE)),\" \",VLOOKUP(K188,Proposito_programa!$C$2:$E$59,2,FALSE))","v":"Gestión pública local"},{"$f":"IF(ISERROR(VLOOKUP(K188,Proposito_programa!$C$2:$E$59,3,FALSE)),\" \",VLOOKUP(K188,Proposito_programa!$C$2:$E$59,3,FALSE))","v":"Propósito 5: Construir Bogotá - Región con gobierno abierto, transparente y ciudadanía consciente"},"O23011605570000001698",1,52993109,"YULY PAOLA LEGUIZAMON PIÑEROS","Persona Natural",null,null,null,null,16200000,null,1,8100000,24300000,{"$f":"7830000+AL188","v":24300000},"2022-01-27","2022-01-28","2022-10-27",180,1,90,52832043,"NANCY BRIGITTE RUIZ BUITRAGO","2022-08-01",16470000,"Terminado",1]
[179,2022,"FDLRUU-CD-179-2022","https://Community.seCop.gov.Co/PubliC/Tendering/OpportunityDetail/Index?notiCeUID=CO1.NTC.2770860&isFromPubliCArea=True&isModal=False","Contratos de prestación de servicios profesionales y de apoyo a la gestión","Contratación directa","Prestación de servicios profesionales y de apoyo a la gestión, o para la ejecución de trabajos artísticos que sólo puedan encomendarse a determinadas personas naturales","EL CONTRATISTA SE OBLIGA APOYAR LA GESTIÓN DOCUMENTAL DE LA ALCALDÍA LOCAL, ACOMPAÑANDO AL EQUIPO JURÍDICO DE DEPURACIÓN EN LAS LABORES OPERATIVAS QUE GENERA EL PROCESO DE IMPULSO DE LAS ACTUACIONES ADMINISTRATIVAS EXISTENTES EN LA ALCALDÍA LOCAL DE RAFAEL URIBE URIBE\t","Inversión","Un nuevo contrato social y ambiental para la Bogotá del Siglo XXI",57,{"$f":"IF(ISERROR(VLOOKUP(K189,Proposito_programa!$C$2:$E$59,2,FALSE)),\" \",VLOOKUP(K189,Proposito_programa!$C$2:$E$59,2,FALSE))","v":"Gestión pública local"},{"$f":"IF(ISERROR(VLOOKUP(K189,Proposito_programa!$C$2:$E$59,3,FALSE)),\" \",VLOOKUP(K189,Proposito_programa!$C$2:$E$59,3,FALSE))","v":"Propósito 5: Construir Bogotá - Región con gobierno abierto, transparente y ciudadanía consciente"},"O23011605570000001698",1,1031177773,"NICOLAS MORA RODRIGUEZ","Persona Natural",null,null,null,null,16200000,null,1,8100000,24300000,24300000,"2022-01-28","2022-02-01","2022-10-31",180,1,90,null,null,null,null,"Terminado",1]
[180,2022,"FDLRUU-CD-180-2022","https://Community.seCop.gov.Co/PubliC/Tendering/OpportunityDetail/Index?notiCeUID=CO1.NTC.2747091&isFromPubliCArea=True&isModal=False","Contratos de prestación de servicios profesionales y de apoyo a la gestión","Contratación directa","Prestación de servicios profesionales y de apoyo a la gestión, o para la ejecución de trabajos artísticos que sólo puedan encomendarse a determinadas personas naturales","APOYAR LA GESTIÓN DOCUMENTAL DE LA ALCALDÍA LOCAL, ACOMPAÑANDO AL EQUIPO JURÍDICO DE DEPURACIÓN EN LAS LABORES OPERATIVAS QUE GENERA EL PROCESO DE IMPULSO DE LAS ACTUACIONES ADMINISTRATIVAS EXISTENTES EN LA ALCALDÍA LOCAL DE RAFAEL URIBE URIBE\t","Inversión","Un nuevo contrato social y ambiental para la Bogotá del Siglo XXI",57,{"$f":"IF(ISERROR(VLOOKUP(K190,Proposito_programa!$C$2:$E$59,2,FALSE)),\" \",VLOOKUP(K190,Proposito_programa!$C$2:$E$59,2,FALSE))","v":"Gestión pública local"},{"$f":"IF(ISERROR(VLOOKUP(K190,Proposito_programa!$C$2:$E$59,3,FALSE)),\" \",VLOOKUP(K190,Proposito_programa!$C$2:$E$59,3,FALSE))","v":"Propósito 5: Construir Bogotá - Región con gobierno abierto, transparente y ciudadanía consciente"},"O23011605570000001698",1,1032436573,"CRISTHIAN CAMILO GARAVITO MARTINEZ","Persona Natural",null,null,null,null,16200000,null,1,8100000,24300000,24300000,"2022-01-27","2022-01-28","2022-10-27",180,1,90,null,null,null,null,"Terminado",1]
[181,2022,"FDLRUU-CD-181-2022","https://Community.seCop.gov.Co/PubliC/Tendering/OpportunityDetail/Index?notiCeUID=CO1.NTC.2776397&isFromPubliCArea=True&isModal=False","Contratos de prestación de servicios profesionales y de apoyo a la gestión","Contratación directa","Prestación de servicios profesionales y de apoyo a la gestión, o para la ejecución de trabajos artísticos que sólo puedan encomendarse a determinadas personas naturales","PRESTAR SUS SERVICIOS PROFESIONALES EN LA FORMULACION, SEGUIMIENTO Y EVALUACION DEL PROYECTO 1665 EN SU COMPONENTE DE VIGÍAS DEL RIESGO DE LA LOCALIDAD DE RAFAEL URIBE URIBE, A LA LUZ DEL PLAN DE DESARROLLO 2021 2024 'UN NUEVO CONTRATO AMBIENTAL Y SOCIAL","Inversión","Un nuevo contrato social y ambiental para la Bogotá del Siglo XXI",30,{"$f":"IF(ISERROR(VLOOKUP(K191,Proposito_programa!$C$2:$E$59,2,FALSE)),\" \",VLOOKUP(K191,Proposito_programa!$C$2:$E$59,2,FALSE))","v":"Eficiencia en la atención de emergencias"},{"$f":"IF(ISERROR(VLOOKUP(K191,Proposito_programa!$C$2:$E$59,3,FALSE)),\" \",VLOOKUP(K191,Proposito_programa!$C$2:$E$59,3,FALSE))","v":"Propósito 2 : Cambiar Nuestros Hábitos de Vida para Reverdecer a Bogotá y Adaptarnos y Mitigar la Crisis Climática"},"O23011602300000001665",1,1033747880,"KEVIN ORLANDO BALLESTEROS ROJAS","Persona Natural",null,null,null,null,27600000,null,1,13800000,41400000,41400000,"2022-01-28","2022-02-01","2022-10-31",180,1,90,null,null,null,null,"Terminado",1]
[182,2022,"FDLRUU-CD-182-2022","https://Community.seCop.gov.Co/PubliC/Tendering/OpportunityDetail/Index?notiCeUID=CO1.NTC.2774656&isFromPubliCArea=True&isModal=False","Contratos de prestación de servicios profesionales y de apoyo a la gestión","Contratación directa","Prestación de servicios profesionales y de apoyo a la gestión, o para la ejecución de trabajos artísticos que sólo puedan encomendarse a determinadas personas naturales","PRESTAR LOS SERVICIOS PROFESIONALES PARA APOYAR AL DESPACHO DEL ALCALDE LOCAL EN EL ANÁLISIS, REVISIÓN, TRÁMITE Y SUSCRIPCIÓN DE LOS ACTOS ADMINISTRATIVOS, DESPACHOS COMISORIOS, TUTELAS, SOLICITUDES DE ENTES DE CONTROL Y LOS CONCEPTOS JURÍDICOS QUE SE LE SOLICITEN POR PARTE DE LA ALCALDÍA LOCAL DE RAFAEL URIBE URIBE","Inversión","Un nuevo contrato social y ambiental para la Bogotá del Siglo XXI",57,{"$f":"IF(ISERROR(VLOOKUP(K192,Proposito_programa!$C$2:$E$59,2,FALSE)),\" \",VLOOKUP(K192,Proposito_programa!$C$2:$E$59,2,FALSE))","v":"Gestión pública local"},{"$f":"IF(ISERROR(VLOOKUP(K192,Proposito_programa!$C$2:$E$59,3,FALSE)),\" \",VLOOKUP(K192,Proposito_programa!$C$2:$E$59,3,FALSE))","v":"Propósito 5: Construir Bogotá - Región con gobierno abierto, transparente y ciudadanía consciente"},"O23011605570000001698",1,1111791373,"FELIX EDUARDO MURILLO PLATA","Persona Natural",null,null,null,null,38400000,null,null,null,38400000,38400000,"2022-01-28","2022-02-01","2022-07-31",180,null,null,null,null,null,null,"Terminado",1]
[183,2022,"FDLRUU-CD-183-2022","https://Community.seCop.gov.Co/PubliC/Tendering/OpportunityDetail/Index?notiCeUID=CO1.NTC.2755555&isFromPubliCArea=True&isModal=False","Contratos de prestación de servicios profesionales y de apoyo a la gestión","Contratación directa","Prestación de servicios profesionales y de apoyo a la gestión, o para la ejecución de trabajos artísticos que sólo puedan encomendarse a determinadas personas naturales","PRESTAR SUS SERVICIOS PROFESIONALES E N EL APOYO, SEGUIMIENTO Y CONTROL A LOS PROCEDIMIENTOS DE LA LEY 1801 DE 2016 COMO D E LOS SISTEMAS DE INFORMACIÓN VIGENTES DISPUESTOS PARA LAS ACTUACIONES DE POLICIA","Inversión","Un nuevo contrato social y ambiental para la Bogotá del Siglo XXI",57,{"$f":"IF(ISERROR(VLOOKUP(K193,Proposito_programa!$C$2:$E$59,2,FALSE)),\" \",VLOOKUP(K193,Proposito_programa!$C$2:$E$59,2,FALSE))","v":"Gestión pública local"},{"$f":"IF(ISERROR(VLOOKUP(K193,Proposito_programa!$C$2:$E$59,3,FALSE)),\" \",VLOOKUP(K193,Proposito_programa!$C$2:$E$59,3,FALSE))","v":"Propósito 5: Construir Bogotá - Región con gobierno abierto, transparente y ciudadanía consciente"},"O23011605570000001698",1,1144057374,"SARHA CRISTINA GARCÍA NAVARRETE","Persona Natural",null,null,null,null,32400000,null,null,null,32400000,{"$f":"27000000+AL193","v":32400000},"2022-01-27","2022-02-01","2022-07-31",180,null,null,1023910605,"LUIS ARIEL MOLINA MOTOVITA","2022-03-02",5400000,"Terminado",1]
[184,2022,"FDLRUU-CD-184-2022","https://Community.seCop.gov.Co/PubliC/Tendering/OpportunityDetail/Index?notiCeUID=CO1.NTC.2752828&isFromPubliCArea=True&isModal=False","Contratos de prestación de servicios profesionales y de apoyo a la gestión","Contratación directa","Prestación de servicios profesionales y de apoyo a la gestión, o para la ejecución de trabajos artísticos que sólo puedan encomendarse a determinadas personas naturales","PRESTAR SERVICIOS PROFESIONALES PARA APOYAR LA EJECUCION, GESTIÓN Y PUESTA EN MARCHA DEL PROYECTO DE INVERSIÓN 1681 CULTURA CIUDADANA Y OPTIMO USO DEL ESPACIO PÚBLICO EN LA LOCALIDAD RAFAEL URIBE","Inversión","Un nuevo contrato social y ambiental para la Bogotá del Siglo XXI",45,{"$f":"IF(ISERROR(VLOOKUP(K194,Proposito_programa!$C$2:$E$59,2,FALSE)),\" \",VLOOKUP(K194,Proposito_programa!$C$2:$E$59,2,FALSE))","v":"Espacio público más seguro y construido colectivamente"},{"$f":"IF(ISERROR(VLOOKUP(K194,Proposito_programa!$C$2:$E$59,3,FALSE)),\" \",VLOOKUP(K194,Proposito_programa!$C$2:$E$59,3,FALSE))","v":"Propósito 3: Inspirar confianza y legitimidad para vivir sin miedo y ser epicentro de cultura ciudadana, paz y reconciliación"},"O23011603450000001681",1,1088264048,"INDIRA CRISTINA PORTOCARREÑO OSPINA","Persona Natural",null,null,null,null,32400000,null,null,null,32400000,10800000,"2022-01-27","2022-02-01","2022-07-31",180,null,null,null,null,null,null,"Terminacion Anticipada",0.33333333333333331]
[185,2022,"FDLRUU-CD-185-2022","https://Community.seCop.gov.Co/PubliC/Tendering/OpportunityDetail/Index?notiCeUID=CO1.NTC.2767948&isFromPubliCArea=True&isModal=False","Contratos de prestación de servicios profesionales y de apoyo a la gestión","Contratación directa","Prestación de servicios profesionales y de apoyo a la gestión, o para la ejecución de trabajos artísticos que sólo puedan encomendarse a determinadas personas naturales","EL CONTRATISTA SE OBLIGA A PRESTAR SERVICIOS PROFESIONALES PARA INCENTIVAR PROCESOS DE PARTICIPACIÓN, CONVIVENCIA CIUDADANA Y EL USO DEL ESPACIO PÚBLICO DESDE UNA PERSPECTIVA DE PAZ Y DIALOGO, LLEVANDO A CABO ACUERDOS CIUDADANOS EN EL MARCO DEL PROYECTO 1681\t","Inversión","Un nuevo contrato social y ambiental para la Bogotá del Siglo XXI",45,{"$f":"IF(ISERROR(VLOOKUP(K195,Proposito_programa!$C$2:$E$59,2,FALSE)),\" \",VLOOKUP(K195,Proposito_programa!$C$2:$E$59,2,FALSE))","v":"Espacio público más seguro y construido colectivamente"},{"$f":"IF(ISERROR(VLOOKUP(K195,Proposito_programa!$C$2:$E$59,3,FALSE)),\" \",VLOOKUP(K195,Proposito_programa!$C$2:$E$59,3,FALSE))","v":"Propósito 3: Inspirar confianza y legitimidad para vivir sin miedo y ser epicentro de cultura ciudadana, paz y reconciliación"},"O23011603450000001681",1,1140826131,"JULIETH DEL CARMEN PERNA BERDUGO","Persona Natural",null,null,null,null,31200000,null,1,15600000,46800000,46800000,"2022-01-28","2022-02-01","2022-10-31",180,1,90,null,null,null,null,"Terminado",1]
[186,2022,"FDLRUU-CD-186-2022","https://Community.seCop.gov.Co/PubliC/Tendering/OpportunityDetail/Index?notiCeUID=CO1.NTC.2761237&isFromPubliCArea=True&isModal=False","Contratos de prestación de servicios profesionales y de apoyo a la gestión","Contratación directa","Prestación de servicios profesionales y de apoyo a la gestión, o para la ejecución de trabajos artísticos que sólo puedan encomendarse a determinadas personas naturales","PRESTAR SERVICIOS PROFESIONALES PARA INCENTIVAR PROCESOS DE PARTICIPACIÓN, CONVIVENCIA CIUDADANA Y EL USO DEL ESPACIO PÚBLICO DESDE UNA PERSPECTIVA DE PAZ Y DIALOGO, LLEVANDO A CABO ACUERDOS CIUDADANOS EN EL MARCO DEL PROYECTO 1681.","Inversión","Un nuevo contrato social y ambiental para la Bogotá del Siglo XXI",45,{"$f":"IF(ISERROR(VLOOKUP(K196,Proposito_programa!$C$2:$E$59,2,FALSE)),\" \",VLOOKUP(K196,Proposito_programa!$C$2:$E$59,2,FALSE))","v":"Espacio público más seguro y construido colectivamente"},{"$f":"IF(ISERROR(VLOOKUP(K196,Proposito_programa!$C$2:$E$59,3,FALSE)),\" \",VLOOKUP(K196,Proposito_programa!$C$2:$E$59,3,FALSE))","v":"Propósito 3: Inspirar confianza y legitimidad para vivir sin miedo y ser epicentro de cultura ciudadana, paz y reconciliación"},"O23011603450000001681",1,79845438,"CARLOS ANDRES SUESCUM LESMES","Persona Natural",null,null,null,null,31200000,null,1,15600000,46800000,46800000,"2022-01-27","2022-02-01","2022-10-31",180,1,90,null,null,null,null,"Terminado",1]
[187,2022,"FDLRUU-CD-187-2022","https://Community.seCop.gov.Co/PubliC/Tendering/OpportunityDetail/Index?notiCeUID=CO1.NTC.2803640&isFromPubliCArea=True&isModal=False","Contratos de prestación de servicios profesionales y de apoyo a la gestión","Contratación directa","Prestación de servicios profesionales y de apoyo a la gestión, o para la ejecución de trabajos artísticos que sólo puedan encomendarse a determinadas personas naturales","PRESTAR LOS SERVICIOS PROFESIONALES PARA LA OPERACIÓN, SEGUIMIENTO Y CUMPLIMIENTO DE LOS PROCESOS Y PROCEDIMIENTOS DEL SERVICIO APOYO ECONÓMICO TIPO C, REQUERIDOS PARA EL OPORTUNO Y ADECUADO REGISTRO, CRUCE Y REPORTE DE LOS DATOS EN EL SISTEMA MISIONAL SIRBE, QUE CONTRIBUYAN A LA GARANTÍA DE LOS DERECHOS DE LA POBLACIÓN MAYOR EN EL MARCO DE LA POLÍTICA PÚBLICA SOCIAL PARA EL ENVEJECIMIENTO Y LA VEJEZ EN EL DISTRITO CAPITAL A CARGO DE LA ALCALDÍA LOCAL","Inversión","Un nuevo contrato social y ambiental para la Bogotá del Siglo XXI",1,{"$f":"IF(ISERROR(VLOOKUP(K197,Proposito_programa!$C$2:$E$59,2,FALSE)),\" \",VLOOKUP(K197,Proposito_programa!$C$2:$E$59,2,FALSE))","v":"Subsidios y transferencias para la equidad"},{"$f":"IF(ISERROR(VLOOKUP(K197,Proposito_programa!$C$2:$E$59,3,FALSE)),\" \",VLOOKUP(K197,Proposito_programa!$C$2:$E$59,3,FALSE))","v":"Propósito 1: Hacer un nuevo contrato social para incrementar la inclusión social, productiva y política"},"O23011601010000001636",1,1031134255,"DIEGO ALEXANDER GUERRERO RODRIGUEZ","Persona Natural",null,null,null,null,59400000,null,1,4860000,64260000,53460000,"2022-01-28","2022-02-04","2023-01-23",330,1,27,null,null,null,null,"Terminacion Anticipada",0.83193277310924374]
[188,2022,"FDLRUU-CD-188-2022","https://Community.seCop.gov.Co/PubliC/Tendering/OpportunityDetail/Index?notiCeUID=CO1.NTC.2758412&isFromPubliCArea=True&isModal=False","Contratos de prestación de servicios profesionales y de apoyo a la gestión","Contratación directa","Prestación de servicios profesionales y de apoyo a la gestión, o para la ejecución de trabajos artísticos que sólo puedan encomendarse a determinadas personas naturales","PRESTAR LOS SERVICIOS PROFESIONALES PARA LA OPERACIÓN, SEGUIMIENTO Y CUMPLIMIENTO DE LOS PROCESOS Y PROCEDIMIENTOS DEL SERVICIO APOYO ECONÓMICO TIPO C, REQUERIDOS PARA EL OPORTUNO Y ADECUADO REGISTRO, CRUCE Y REPORTE DE LOS DATOS EN EL SISTEMA MISIONAL SIRBE, QUE CONTRIBUYAN A LA GARANTÍA DE LOS DERECHOS DE LA POBLACIÓN MAYOR EN EL MARCO DE LA POLÍTICA PÚBLICA SOCIAL PARA EL ENVEJECIMIENTO Y LA VEJEZ EN EL DISTRITO CAPITAL A CARGO DE LA ALCALDÍA LOCAL.","Inversión","Un nuevo contrato social y ambiental para la Bogotá del Siglo XXI",1,{"$f":"IF(ISERROR(VLOOKUP(K198,Proposito_programa!$C$2:$E$59,2,FALSE)),\" \",VLOOKUP(K198,Proposito_programa!$C$2:$E$59,2,FALSE))","v":"Subsidios y transferencias para la equidad"},{"$f":"IF(ISERROR(VLOOKUP(K198,Proposito_programa!$C$2:$E$59,3,FALSE)),\" \",VLOOKUP(K198,Proposito_programa!$C$2:$E$59,3,FALSE))","v":"Propósito 1: Hacer un nuevo contrato social para incrementar la inclusión social, productiva y política"},"O23011601010000001636",1,52955747,"ANDREA ALEXANDRA ANGEL ALDANA","Persona Natural",null,null,null,null,59400000,null,1,5400000,64800000,{"$f":"41940000+AL198","v":43560000},"2022-01-28","2022-02-01","2023-01-12",330,1,30,"52811514\n52844341","CLAUDIA MILENA AVENDAÑO DEL RIO\nCESION 2 \nCARMEN ANDREA AVELLANEDA SANTOYA","09/02/2022\n8/04/2022",1620000,"Terminacion Anticipada",0.67222222222222228]
[189,2022,"FDLRUU-CD-189-2022","https://Community.seCop.gov.Co/PubliC/Tendering/OpportunityDetail/Index?notiCeUID=CO1.NTC.2749159&isFromPubliCArea=True&isModal=False","Contratos de prestación de servicios profesionales y de apoyo a la gestión","Contratación directa","Prestación de servicios profesionales y de apoyo a la gestión, o para la ejecución de trabajos artísticos que sólo puedan encomendarse a determinadas personas naturales","Apoyar téCniCamente a los responsables e integrantes de los proCesos en la implementaCión de herramientas de gestión, siguiendo los lineamientos metodológiCos estableCidos por la OfiCina Asesora de PlaneaCión de la SeCretaría Distrital de Gobierno","Inversión","Un nuevo contrato social y ambiental para la Bogotá del Siglo XXI",57,{"$f":"IF(ISERROR(VLOOKUP(K199,Proposito_programa!$C$2:$E$59,2,FALSE)),\" \",VLOOKUP(K199,Proposito_programa!$C$2:$E$59,2,FALSE))","v":"Gestión pública local"},{"$f":"IF(ISERROR(VLOOKUP(K199,Proposito_programa!$C$2:$E$59,3,FALSE)),\" \",VLOOKUP(K199,Proposito_programa!$C$2:$E$59,3,FALSE))","v":"Propósito 5: Construir Bogotá - Región con gobierno abierto, transparente y ciudadanía consciente"},"O23011605570000001697",1,1000333532,"JUAN SEBASTIAN CORAL ARTEAGA","Persona Natural",null,null,null,null,32400000,null,1,16200000,48600000,{"$f":"12060000+AL199","v":48240000},"2022-01-27","2022-01-28","2022-10-27",180,1,90,1019023768,"BRIGGETH JOHANA MORA DUARTE","2022-08-23",36180000,"Terminado",0.99259259259259258]
[191,2022,"FDLRUU-CD-191-2022","https://Community.seCop.gov.Co/PubliC/Tendering/OpportunityDetail/Index?notiCeUID=CO1.NTC.2753050&isFromPubliCArea=True&isModal=False","Contratos de prestación de servicios profesionales y de apoyo a la gestión","Contratación directa","Prestación de servicios profesionales y de apoyo a la gestión, o para la ejecución de trabajos artísticos que sólo puedan encomendarse a determinadas personas naturales","APOYAR AL ÁREA DE DESARROLLO LOCAL EN EL CENTRO DE DOCUMENTACIÓN E INFORMACIÓN (CDI) EN EL MANEJO DE LAS COMUNICACIONES DE ENTRADA, INTERNAS Y EXTERNAS Y EN LA ATENCIÓN A LOS CIUDADANOS EN LOS DIFERENTES CANALES ESTABLECIDOS POR LA ENTIDAD","Inversión","Un nuevo contrato social y ambiental para la Bogotá del Siglo XXI",57,{"$f":"IF(ISERROR(VLOOKUP(K200,Proposito_programa!$C$2:$E$59,2,FALSE)),\" \",VLOOKUP(K200,Proposito_programa!$C$2:$E$59,2,FALSE))","v":"Gestión pública local"},{"$f":"IF(ISERROR(VLOOKUP(K200,Proposito_programa!$C$2:$E$59,3,FALSE)),\" \",VLOOKUP(K200,Proposito_programa!$C$2:$E$59,3,FALSE))","v":"Propósito 5: Construir Bogotá - Región con gobierno abierto, transparente y ciudadanía consciente"},"O23011605570000001697",1,1016109867,"LAURA VANESSA PAEZ LOPEZ","Persona Natural",null,null,null,null,16200000,null,1,8100000,24300000,24300000,"2022-01-27","2022-01-28","2022-10-27",180,1,90,null,null,null,null,"Terminado",1]
[192,2022,"FDLRUU-CD-192-2022","https://Community.seCop.gov.Co/PubliC/Tendering/OpportunityDetail/Index?notiCeUID=CO1.NTC.2753413&isFromPubliCArea=True&isModal=False","Contratos de prestación de servicios profesionales y de apoyo a la gestión","Contratación directa","Prestación de servicios profesionales y de apoyo a la gestión, o para la ejecución de trabajos artísticos que sólo puedan encomendarse a determinadas personas naturales","\tAPOYAR AL ÁREA DE DESARROLLO LOCAL EN EL CENTRO DE DOCUMENTACIÓN E INFORMACIÓN (CDI) EN EL MANEJO DE LAS COMUNICACIONES DE ENTRADA, INTERNAS Y EXTERNAS Y EN LA ATENCIÓN A LOS CIUDADANOS EN LOS DIFERENTES CANALES ESTABLECIDOS POR LA ENTIDAD","Inversión","Un nuevo contrato social y ambiental para la Bogotá del Siglo XXI",57,{"$f":"IF(ISERROR(VLOOKUP(K201,Proposito_programa!$C$2:$E$59,2,FALSE)),\" \",VLOOKUP(K201,Proposito_programa!$C$2:$E$59,2,FALSE))","v":"Gestión pública local"},{"$f":"IF(ISERROR(VLOOKUP(K201,Proposito_programa!$C$2:$E$59,3,FALSE)),\" \",VLOOKUP(K201,Proposito_programa!$C$2:$E$59,3,FALSE))","v":"Propósito 5: Construir Bogotá - Región con gobierno abierto, transparente y ciudadanía consciente"},"O23011605570000001697",1,1052388338,"MARLON ALEJANDRO LEAL PENAGOS","Persona Natural",null,null,null,null,16200000,null,1,8100000,24300000,24300000,"2022-01-27","2022-01-28","2022-10-27",180,1,90,null,null,null,null,"Terminado",1]
[193,2022,"FDLRUU-CD-193-2022","https://Community.seCop.gov.Co/PubliC/Tendering/OpportunityDetail/Index?notiCeUID=CO1.NTC.2757694&isFromPubliCArea=True&isModal=False","Contratos de prestación de servicios profesionales y de apoyo a la gestión","Contratación directa","Prestación de servicios profesionales y de apoyo a la gestión, o para la ejecución de trabajos artísticos que sólo puedan encomendarse a determinadas personas naturales","APOYAR AL ÁREA DE DESARROLLO LOCAL EN EL CENTRO DE DOCUMENTACIÓN E INFORMACIÓN (CDI) EN EL MANEJO DE LAS COMUNICACIONES DE ENTRADA, INTERNAS Y EXTERNAS Y EN LA ATENCIÓN A LOS CIUDADANOS EN LOS DIFERENTES CANALES ESTABLECIDOS POR LA ENTIDAD","Inversión","Un nuevo contrato social y ambiental para la Bogotá del Siglo XXI",57,{"$f":"IF(ISERROR(VLOOKUP(K202,Proposito_programa!$C$2:$E$59,2,FALSE)),\" \",VLOOKUP(K202,Proposito_programa!$C$2:$E$59,2,FALSE))","v":"Gestión pública local"},{"$f":"IF(ISERROR(VLOOKUP(K202,Proposito_programa!$C$2:$E$59,3,FALSE)),\" \",VLOOKUP(K202,Proposito_programa!$C$2:$E$59,3,FALSE))","v":"Propósito 5: Construir Bogotá - Región con gobierno abierto, transparente y ciudadanía consciente"},"O23011605570000001697",1,1033819386,"ANDREA CAROLINA CAICEDO GARAVITO","Persona Natural",null,null,null,null,16200000,null,1,8100000,24300000,24300000,"2022-01-27","2022-01-28","2022-10-27",180,1,90,null,null,null,null,"Terminado",1]
[194,2022,"FDLRUU-CD194-2022","https://community.secop.gov.co/Public/Tendering/ContractNoticePhases/View?PPI=CO1.PPI.17250694&isFromPublicArea=True&isModal=False","Contratos de prestación de servicios profesionales y de apoyo a la gestión","Contratación directa","Prestación de servicios profesionales y de apoyo a la gestión, o para la ejecución de trabajos artísticos que sólo puedan encomendarse a determinadas personas naturales","APOYAR AL ÁREA DE DESARROLLO LOCAL EN EL CENTRO DE DOCUMENTACIÓN E INFORMACIÓN (CDI) EN EL MANEJO DE LAS COMUNICACIONES DE ENTRADA, INTERNAS Y EXTERNAS Y EN LA ATENCIÓN A LOS CIUDADANOS EN LOS DIFERENTES CANALES ESTABLECIDOS POR LA ENTIDAD","Inversión","Un nuevo contrato social y ambiental para la Bogotá del Siglo XXI",57,{"$f":"IF(ISERROR(VLOOKUP(K203,Proposito_programa!$C$2:$E$59,2,FALSE)),\" \",VLOOKUP(K203,Proposito_programa!$C$2:$E$59,2,FALSE))","v":"Gestión pública local"},{"$f":"IF(ISERROR(VLOOKUP(K203,Proposito_programa!$C$2:$E$59,3,FALSE)),\" \",VLOOKUP(K203,Proposito_programa!$C$2:$E$59,3,FALSE))","v":"Propósito 5: Construir Bogotá - Región con gobierno abierto, transparente y ciudadanía consciente"},"O23011605570000001697",1,52903975,"SONIA PATRICIA HERNANDEZ RODRIGUEZ","Persona Natural",null,null,null,null,16200000,null,1,8100000,24300000,24300000,"2022-01-27","2022-02-01","2022-10-31",180,1,90,null,null,null,null,"Terminado",1]
[195,2022,"FDLRUU-CD-195-2022","https://Community.seCop.gov.Co/PubliC/Tendering/OpportunityDetail/Index?notiCeUID=CO1.NTC.2753029&isFromPubliCArea=True&isModal=False","Contratos de prestación de servicios profesionales y de apoyo a la gestión","Contratación directa","Prestación de servicios profesionales y de apoyo a la gestión, o para la ejecución de trabajos artísticos que sólo puedan encomendarse a determinadas personas naturales","PRESTAR LOS SERVICIOS PROFESIONALES E N EL ÁREA DE GESTIÓN DE DESARROLLO LOCAL APOYANDO LA GESTIÓN, ANÁLISIS Y SEGUIMIENTO DE LA INFORMACIÓN FINANCIERA Y CONTABLE EN CUMPLIMIENTO AL MARCO NORMATIVO CONTABLE","Inversión","Un nuevo contrato social y ambiental para la Bogotá del Siglo XXI",57,{"$f":"IF(ISERROR(VLOOKUP(K204,Proposito_programa!$C$2:$E$59,2,FALSE)),\" \",VLOOKUP(K204,Proposito_programa!$C$2:$E$59,2,FALSE))","v":"Gestión pública local"},{"$f":"IF(ISERROR(VLOOKUP(K204,Proposito_programa!$C$2:$E$59,3,FALSE)),\" \",VLOOKUP(K204,Proposito_programa!$C$2:$E$59,3,FALSE))","v":"Propósito 5: Construir Bogotá - Región con gobierno abierto, transparente y ciudadanía consciente"},"O23011605570000001697",1,1023016773,"NICOLAS MORENO SANCHEZ","Persona Natural",null,null,null,null,27600000,null,null,null,27600000,27600000,"2022-01-27","2022-01-28","2022-07-27",180,null,null,null,null,null,null,"Terminado",1]
[196,2022,"FDLRUU-CD-196-2022","https://Community.seCop.gov.Co/PubliC/Tendering/OpportunityDetail/Index?notiCeUID=CO1.NTC.2802561&isFromPubliCArea=True&isModal=False","Contratos de prestación de servicios profesionales y de apoyo a la gestión","Contratación directa","Prestación de servicios profesionales y de apoyo a la gestión, o para la ejecución de trabajos artísticos que sólo puedan encomendarse a determinadas personas naturales","PRESTAR LOS SERVICIOS PROFESIONALES PARA APOYAR JURIDICAMENTE LA FORMULA CION, EJECUCIÓN Y SEGUIMIENTO DE LOS PROCESOS ASOCIADOS CON LOS PROYECTOS DE INVERSIÓN DEL PLAN DE DESARROLLO LOCAL VIGENCIA 2021  2024.\t","Inversión","Un nuevo contrato social y ambiental para la Bogotá del Siglo XXI",57,{"$f":"IF(ISERROR(VLOOKUP(K205,Proposito_programa!$C$2:$E$59,2,FALSE)),\" \",VLOOKUP(K205,Proposito_programa!$C$2:$E$59,2,FALSE))","v":"Gestión pública local"},{"$f":"IF(ISERROR(VLOOKUP(K205,Proposito_programa!$C$2:$E$59,3,FALSE)),\" \",VLOOKUP(K205,Proposito_programa!$C$2:$E$59,3,FALSE))","v":"Propósito 5: Construir Bogotá - Región con gobierno abierto, transparente y ciudadanía consciente"},"O23011605570000001697",1,1013593388,"LEVIS STEVEEN PAEZ UBAQUE","Persona Natural",null,null,null,null,39000000,null,null,null,39000000,38350000,"2022-01-28","2022-02-04","2022-08-03",180,null,null,null,null,null,null,"Terminado",0.98333333333333328]
[197,2022,"FDLRUU-CD-197-2022","https://Community.seCop.gov.Co/PubliC/Tendering/OpportunityDetail/Index?notiCeUID=CO1.NTC.2757335&isFromPubliCArea=True&isModal=False","Contratos de prestación de servicios profesionales y de apoyo a la gestión","Contratación directa","Prestación de servicios profesionales y de apoyo a la gestión, o para la ejecución de trabajos artísticos que sólo puedan encomendarse a determinadas personas naturales","APOYAR CON SERVICIOS PROFESIONALES AL ÁREA DE GESTIÓN DE DESARROLLO LOCAL PARA APOYAR A LA ADMINISTRACIÓN EN LA FORMULACIÓN Y SEGUIMIENTO A LOS PROYECTOS DE INVERSIÓN Y GASTOS DE FUNCIONAMIENTO DEL PROYECTO DE FORTALECIMIENTO INSTITUCIONAL DE LA ALCALDÍA LOCAL.","Inversión","Un nuevo contrato social y ambiental para la Bogotá del Siglo XXI",57,{"$f":"IF(ISERROR(VLOOKUP(K206,Proposito_programa!$C$2:$E$59,2,FALSE)),\" \",VLOOKUP(K206,Proposito_programa!$C$2:$E$59,2,FALSE))","v":"Gestión pública local"},{"$f":"IF(ISERROR(VLOOKUP(K206,Proposito_programa!$C$2:$E$59,3,FALSE)),\" \",VLOOKUP(K206,Proposito_programa!$C$2:$E$59,3,FALSE))","v":"Propósito 5: Construir Bogotá - Región con gobierno abierto, transparente y ciudadanía consciente"},"O23011605570000001697",1,19398360,"ALVARO DE JESUS APARICIO CELY","Persona Natural",null,null,null,null,37200000,null,1,18600000,{"$f":"+W206+X206+Z206","v":55800000},55800000,"2022-01-27","2022-01-28","2022-10-27",180,1,90,null,null,null,null,"Terminado",{"$f":"IF(ISERROR(AB206/AA206),\"-\",(AB206/AA206))","v":1}]
[198,2022,"FDLRUU-CD-198-2022","https://Community.seCop.gov.Co/PubliC/Tendering/OpportunityDetail/Index?notiCeUID=CO1.NTC.2769486&isFromPubliCArea=True&isModal=False","Contratos de prestación de servicios profesionales y de apoyo a la gestión","Contratación directa","Prestación de servicios profesionales y de apoyo a la gestión, o para la ejecución de trabajos artísticos que sólo puedan encomendarse a determinadas personas naturales","ADMINISTRATIVO PARA EL ÁREA DE GESTIÓN DE DESARROLLO LOCAL DE LA ALCALDÍA LOCAL DE RAFAEL URIBE URIBE EN TEMAS DE INFRAESTRUCTURA COMO PARTE DE LAEjecucion DEL PLAN DE DESARROLLO LOCAL","Inversión","Un nuevo contrato social y ambiental para la Bogotá del Siglo XXI",57,{"$f":"IF(ISERROR(VLOOKUP(K207,Proposito_programa!$C$2:$E$59,2,FALSE)),\" \",VLOOKUP(K207,Proposito_programa!$C$2:$E$59,2,FALSE))","v":"Gestión pública local"},{"$f":"IF(ISERROR(VLOOKUP(K207,Proposito_programa!$C$2:$E$59,3,FALSE)),\" \",VLOOKUP(K207,Proposito_programa!$C$2:$E$59,3,FALSE))","v":"Propósito 5: Construir Bogotá - Región con gobierno abierto, transparente y ciudadanía consciente"},"O23011605570000001697",1,1023896385,"ANGIE PAOLA BAUTISTA TRIANA","Persona Natural",null,null,null,null,24000000,null,1,12000000,36000000,36000000,"2022-01-28","2022-02-01","2022-10-31",180,1,90,null,null,null,null,"Terminado",1]
[199,2022,"FDLRUU-CD-199-2022","https://Community.seCop.gov.Co/PubliC/Tendering/OpportunityDetail/Index?notiCeUID=CO1.NTC.2781390&isFromPubliCArea=True&isModal=False","Contratos de prestación de servicios profesionales y de apoyo a la gestión","Contratación directa","Prestación de servicios profesionales y de apoyo a la gestión, o para la ejecución de trabajos artísticos que sólo puedan encomendarse a determinadas personas naturales","PRESTAR LOS SERVICIOS PROFESIONALES A LA ALCALDÍA LOCAL DE RAFAEL URIBE URIBE, PARA LA EJECUCIÓN Y DIVULGACION DE LAS ACTIVIDADES COMUNITARIAS Y DE APOYO A LOS PROCESOS DE PARTICIPACIÓN EN EL MARCO DEL SISTEMA LOCAL Y DISTRITAL DE PARTICIPACIÓN, LAS RELACIONES INTERINSTITUCIONALES Y LA EJECUCIÓN DE LOS PROYECTOS QUE HACEN PARTE DEL PLAN DE DESARROLLO\t","Inversión","Un nuevo contrato social y ambiental para la Bogotá del Siglo XXI",57,{"$f":"IF(ISERROR(VLOOKUP(K208,Proposito_programa!$C$2:$E$59,2,FALSE)),\" \",VLOOKUP(K208,Proposito_programa!$C$2:$E$59,2,FALSE))","v":"Gestión pública local"},{"$f":"IF(ISERROR(VLOOKUP(K208,Proposito_programa!$C$2:$E$59,3,FALSE)),\" \",VLOOKUP(K208,Proposito_programa!$C$2:$E$59,3,FALSE))","v":"Propósito 5: Construir Bogotá - Región con gobierno abierto, transparente y ciudadanía consciente"},"O23011605570000001697",1,51931227," MARÍA ANTONIA TOVAR CONTRERAS","Persona Natural",null,null,null,null,32400000,null,null,null,32400000,{"$f":"13320000+AL208","v":32400000},"2022-01-28","2022-02-01","2022-07-31",180,null,null,1014225405,"LAURA DANIELA GUERRERO","2022-06-06",19080000,"Terminado",1]
[200,2022,"FDLRUU-CD-200-2022","https://Community.seCop.gov.Co/PubliC/Tendering/OpportunityDetail/Index?notiCeUID=CO1.NTC.2786465&isFromPubliCArea=True&isModal=False","Contratos de prestación de servicios profesionales y de apoyo a la gestión","Contratación directa","Prestación de servicios profesionales y de apoyo a la gestión, o para la ejecución de trabajos artísticos que sólo puedan encomendarse a determinadas personas naturales","o PRESTAR LOS SERVICIOS PROFESIONALES A LA ALCALDÍA LOCAL DE RAFAEL URIBE URIBE, PARA LA EJECUCIÓN Y DIVULGACION DE LAS ACTIVIDADES COMUNITARIAS Y DE APOYO A LOS PROCESOS DE PARTICIPACIÓN EN EL MARCO DEL SISTEMA LOCAL Y DISTRITAL DE PARTICIPACIÓN, LAS RELACIONES INTERINSTITUCIONALES Y LA EJECUCIÓN DE LOS PROYECTOS QUE HACEN PARTE DEL PLAN DE DESARROLLO\t","Inversión","Un nuevo contrato social y ambiental para la Bogotá del Siglo XXI",57,{"$f":"IF(ISERROR(VLOOKUP(K209,Proposito_programa!$C$2:$E$59,2,FALSE)),\" \",VLOOKUP(K209,Proposito_programa!$C$2:$E$59,2,FALSE))","v":"Gestión pública local"},{"$f":"IF(ISERROR(VLOOKUP(K209,Proposito_programa!$C$2:$E$59,3,FALSE)),\" \",VLOOKUP(K209,Proposito_programa!$C$2:$E$59,3,FALSE))","v":"Propósito 5: Construir Bogotá - Región con gobierno abierto, transparente y ciudadanía consciente"},"O23011605570000001697",1,1071548371,"LADY JOHANNA MORENO HERRERA","Persona Natural",null,null,null,null,32400000,null,1,16200000,48600000,48600000,"2022-01-28","2022-02-01","2022-10-31",180,1,90,null,null,null,null,"Terminado",1]
[201,2022,"FDLRUU-CD-201-2022","https://Community.seCop.gov.Co/PubliC/Tendering/OpportunityDetail/Index?notiCeUID=CO1.NTC.2769997&isFromPubliCArea=True&isModal=False","Contratos de prestación de servicios profesionales y de apoyo a la gestión","Contratación directa","Prestación de servicios profesionales y de apoyo a la gestión, o para la ejecución de trabajos artísticos que sólo puedan encomendarse a determinadas personas naturales","PRESTAR LOS SERVICIOS TECNICOS COMO GESTOR COMUNITARIO EN LOS ESPACIOS DE PARTICIPACIÓN DE RAFAEL URIBE URIBE CON ENFOQUE EN LA COMUNIDAD\t","Inversión","Un nuevo contrato social y ambiental para la Bogotá del Siglo XXI",57,{"$f":"IF(ISERROR(VLOOKUP(K210,Proposito_programa!$C$2:$E$59,2,FALSE)),\" \",VLOOKUP(K210,Proposito_programa!$C$2:$E$59,2,FALSE))","v":"Gestión pública local"},{"$f":"IF(ISERROR(VLOOKUP(K210,Proposito_programa!$C$2:$E$59,3,FALSE)),\" \",VLOOKUP(K210,Proposito_programa!$C$2:$E$59,3,FALSE))","v":"Propósito 5: Construir Bogotá - Región con gobierno abierto, transparente y ciudadanía consciente"},"O23011605570000001697",1,1026568078,"MONICA TATIANA ARIZA ARDILA","Persona Natural",null,null,null,null,18600000,null,null,null,18600000,18600000,"2022-01-28","2022-02-01","2022-07-31",180,null,null,null,null,null,null,"Terminado",1]
[202,2021,"FDLRUU-CD-202-2021","https://community.secop.gov.co/Public/Tendering/OpportunityDetail/Index?noticeUID=CO1.NTC.1859804&isFromPublicArea=True&isModal=False\n","Contratos interadministrativos","Contratación directa","Contratos interadministrativos","INSTALACIÓN, CONFIGURACIÓN Y PUESTA EN FUNCIONAMIENTO DEL SERVICIO DE CONECTIVIDAD WIFI E INTERNET PARA LA ALCALDÍA LOCAL DE RAFAEL URIBE URIBE","Funcionamiento","Un nuevo contrato social y ambiental para la Bogotá del Siglo XXI","No aplica",{"$f":"IF(ISERROR(VLOOKUP(K211,Proposito_programa!$C$2:$E$59,2,FALSE)),\" \",VLOOKUP(K211,Proposito_programa!$C$2:$E$59,2,FALSE))","v":" "},{"$f":"IF(ISERROR(VLOOKUP(K211,Proposito_programa!$C$2:$E$59,3,FALSE)),\" \",VLOOKUP(K211,Proposito_programa!$C$2:$E$59,3,FALSE))","v":" "},131020202030404,1,899999115,"EMPRESA DE TELECOMUNICACIONES DE BOGOTA   ETB SA ESP","Persona Jurídica",null,null,null,null,0,null,1,13769436,13769436,7342885,"2021-03-19","2021-03-24","2022-03-23",360,null,null,null,null,null,null,"Terminado",0.53327420237110656]
[203,2022,"FDLRUU-CD-203-2022","https://Community.seCop.gov.Co/PubliC/Tendering/OpportunityDetail/Index?notiCeUID=CO1.NTC.2759260&isFromPubliCArea=True&isModal=False","Contratos de prestación de servicios profesionales y de apoyo a la gestión","Contratación directa","Prestación de servicios profesionales y de apoyo a la gestión, o para la ejecución de trabajos artísticos que sólo puedan encomendarse a determinadas personas naturales","APOYAR AL ALCALDE (SA) LOCAL EN LA PROMOCIÓN, ACOMPAÑAMIENTO, COORDINACIÓN Y ATENCIÓN DE LAS INSTANCIAS DE COORDINACIÓN INTERINSTITUCIONALES Y LAS INSTANCIAS DE PARTICIPACIÓN LOCALES, ASÍ COMO LOS PROCESOS COMUNITARIOS EN LA LOCALIDAD\t","Inversión","Un nuevo contrato social y ambiental para la Bogotá del Siglo XXI",57,{"$f":"IF(ISERROR(VLOOKUP(K212,Proposito_programa!$C$2:$E$59,2,FALSE)),\" \",VLOOKUP(K212,Proposito_programa!$C$2:$E$59,2,FALSE))","v":"Gestión pública local"},{"$f":"IF(ISERROR(VLOOKUP(K212,Proposito_programa!$C$2:$E$59,3,FALSE)),\" \",VLOOKUP(K212,Proposito_programa!$C$2:$E$59,3,FALSE))","v":"Propósito 5: Construir Bogotá - Región con gobierno abierto, transparente y ciudadanía consciente"},"O23011605570000001697",1,80913594,"CARLOS ALEXANDER CASTILLO MUÑOZ","Persona Natural",null,null,null,null,41400000,null,1,20700000,62100000,{"$f":"26450000+AL212","v":62100000},"2022-01-27","2022-02-01","2022-10-31",180,1,90,1022942908,"EDISON YESIR RODRIGUEZ ROMERO","2022-07-05",35650000,"Terminado",1]
[204,2022,"FDLRUU-CD-204-2022","https://Community.seCop.gov.Co/PubliC/Tendering/OpportunityDetail/Index?notiCeUID=CO1.NTC.2767298&isFromPubliCArea=True&isModal=False","Contratos de prestación de servicios profesionales y de apoyo a la gestión","Contratación directa","Prestación de servicios profesionales y de apoyo a la gestión, o para la ejecución de trabajos artísticos que sólo puedan encomendarse a determinadas personas naturales","PRESTAR LOS SERVICIOS PROFESIONALES EN EL SEGUIMIENTO DE PAGOS, LA ACTUALIZACIÓN, LIQUIDACIÓN Y DEPURACIÓN DE LOS CONTRATOS QUE SE ENCUENTRAN ENEjecucion Y/O OBLIGACIONES POR PAGAR DE VIGENCIAS ANTERIORES QUE SE ENCUENTRAN VIGENTES EN EL FONDO DE DESARROLLO LOCAL DE RAFAEL URIBE URIBE\t","Inversión","Un nuevo contrato social y ambiental para la Bogotá del Siglo XXI",57,{"$f":"IF(ISERROR(VLOOKUP(K213,Proposito_programa!$C$2:$E$59,2,FALSE)),\" \",VLOOKUP(K213,Proposito_programa!$C$2:$E$59,2,FALSE))","v":"Gestión pública local"},{"$f":"IF(ISERROR(VLOOKUP(K213,Proposito_programa!$C$2:$E$59,3,FALSE)),\" \",VLOOKUP(K213,Proposito_programa!$C$2:$E$59,3,FALSE))","v":"Propósito 5: Construir Bogotá - Región con gobierno abierto, transparente y ciudadanía consciente"},"O23011605570000001697",1,1022950072,"JENNY VIVIANA SASTOQUE LOPEZ","Persona Natural",null,null,null,null,32400000,null,1,16200000,48600000,48600000,"2022-01-28","2022-01-28","2022-10-27",180,1,90,null,null,null,null,"Terminado",1]
[205,2022,"FDLRUU-CD-205-2022","https://Community.seCop.gov.Co/PubliC/Tendering/OpportunityDetail/Index?notiCeUID=CO1.NTC.2754929&isFromPubliCArea=True&isModal=False","Contratos de prestación de servicios profesionales y de apoyo a la gestión","Contratación directa","Prestación de servicios profesionales y de apoyo a la gestión, o para la ejecución de trabajos artísticos que sólo puedan encomendarse a determinadas personas naturales","PRESTAR LOS SERVICIOS COMO OPERADOR DE MAQUINARIA AMARILLA, AL SERVICIO DE LA ADMINISTRACION LOCAL DE RAFAEL URIBE URIBE EN LA REALIZACIÓN DE LAEjecucion DEL PROYECTO  1685 MOVILIDAD MULTIMODAL, INCLUYENTE Y SOSTENIBLE EN RAFAEL URIBE URIBE, ASÍ COMO APOYAR LAS DEMÁS ACTIVIDADES QUE SE GENEREN EN EL ÁREA DE GESTIÓN DEL DESARROLLO CON RELACION AL PROYECTO EN MENCION\t","Inversión","Un nuevo contrato social y ambiental para la Bogotá del Siglo XXI",57,{"$f":"IF(ISERROR(VLOOKUP(K214,Proposito_programa!$C$2:$E$59,2,FALSE)),\" \",VLOOKUP(K214,Proposito_programa!$C$2:$E$59,2,FALSE))","v":"Gestión pública local"},{"$f":"IF(ISERROR(VLOOKUP(K214,Proposito_programa!$C$2:$E$59,3,FALSE)),\" \",VLOOKUP(K214,Proposito_programa!$C$2:$E$59,3,FALSE))","v":"Propósito 5: Construir Bogotá - Región con gobierno abierto, transparente y ciudadanía consciente"},"O23011605570000001697",1,80139417,"JUAN CARLOS OLEGUA HURTADO","Persona Natural",null,null,null,null,16200000,null,null,null,16200000,16200000,"2022-01-27","2022-01-28","2022-07-27",180,null,null,null,null,null,null,"Terminado",1]
[206,2022,"FDLRUU-CD-206-2022","https://Community.seCop.gov.Co/PubliC/Tendering/OpportunityDetail/Index?notiCeUID=CO1.NTC.2755639&isFromPubliCArea=True&isModal=False","Contratos de prestación de servicios profesionales y de apoyo a la gestión","Contratación directa","Prestación de servicios profesionales y de apoyo a la gestión, o para la ejecución de trabajos artísticos que sólo puedan encomendarse a determinadas personas naturales","PRESTAR LOS SERVICIOS COMO OPERADOR DE MAQUINARIA AMARILLA, AL SERVICIO DE LA ADMINISTRACION LOCAL DE RAFAEL URIBE URIBE EN LA REALIZACIÓN DE LAEjecucion DEL PROYECTO  1685 MOVILIDAD MULTIMODAL, INCLUYENTE Y SOSTENIBLE EN RAFAEL URIBE URIBE, ASÍ COMO APOYAR LAS DEMÁS ACTIVIDADES QUE SE GENEREN EN EL ÁREA DE GESTIÓN DEL DESARROLLO CON RELACION AL PROYECTO EN MENCION\t","Inversión","Un nuevo contrato social y ambiental para la Bogotá del Siglo XXI",57,{"$f":"IF(ISERROR(VLOOKUP(K215,Proposito_programa!$C$2:$E$59,2,FALSE)),\" \",VLOOKUP(K215,Proposito_programa!$C$2:$E$59,2,FALSE))","v":"Gestión pública local"},{"$f":"IF(ISERROR(VLOOKUP(K215,Proposito_programa!$C$2:$E$59,3,FALSE)),\" \",VLOOKUP(K215,Proposito_programa!$C$2:$E$59,3,FALSE))","v":"Propósito 5: Construir Bogotá - Región con gobierno abierto, transparente y ciudadanía consciente"},"O23011605570000001697",1,1031154746,"JAIME ALEJANDRO QUINTERO MARTINEZ","Persona Natural",null,null,null,null,16200000,null,1,8100000,24300000,24210000,"2022-01-27","2022-01-28","2022-11-15",180,1,90,null,null,null,null,"Terminado",0.99629629629629635]
[207,2022,"FDLRUU-CD-207-2022","https://Community.seCop.gov.Co/PubliC/Tendering/OpportunityDetail/Index?notiCeUID=CO1.NTC.2776544&isFromPubliCArea=True&isModal=False","Contratos de prestación de servicios profesionales y de apoyo a la gestión","Contratación directa","Prestación de servicios profesionales y de apoyo a la gestión, o para la ejecución de trabajos artísticos que sólo puedan encomendarse a determinadas personas naturales","PRESTAR LOS SERVICIOS COMO OPERADOR DE MAQUINARIA AMARILLA, AL SERVICIO DE LA ADMINISTRACION LOCAL DE RAFAEL URIBE URIBE EN LA REALIZACIÓN DE LAEjecucion DEL PROYECTO  1685 MOVILIDAD MULTIMODAL, INCLUYENTE Y SOSTENIBLE EN RAFAEL URIBE URIBE, ASÍ COMO APOYAR LAS DEMÁS ACTIVIDADES QUE SE GENEREN EN EL ÁREA DE GESTIÓN DEL DESARROLLO CON RELACION AL PROYECTO EN MENCION\t","Inversión","Un nuevo contrato social y ambiental para la Bogotá del Siglo XXI",57,{"$f":"IF(ISERROR(VLOOKUP(K216,Proposito_programa!$C$2:$E$59,2,FALSE)),\" \",VLOOKUP(K216,Proposito_programa!$C$2:$E$59,2,FALSE))","v":"Gestión pública local"},{"$f":"IF(ISERROR(VLOOKUP(K216,Proposito_programa!$C$2:$E$59,3,FALSE)),\" \",VLOOKUP(K216,Proposito_programa!$C$2:$E$59,3,FALSE))","v":"Propósito 5: Construir Bogotá - Región con gobierno abierto, transparente y ciudadanía consciente"},"O23011605570000001697",1,1022955000,"LUIS EDUARO PEREZ PATARROYO","Persona Natural",null,null,null,null,16200000,null,1,8100000,24300000,24300000,"2022-01-28","2022-01-28","2022-10-27",180,1,90,null,null,null,null,"Terminado",1]
[208,2022,"FDLRUU-CD-208-2022","https://Community.seCop.gov.Co/PubliC/Tendering/OpportunityDetail/Index?notiCeUID=CO1.NTC.2766223&isFromPubliCArea=True&isModal=False","Contratos de prestación de servicios profesionales y de apoyo a la gestión","Contratación directa","Prestación de servicios profesionales y de apoyo a la gestión, o para la ejecución de trabajos artísticos que sólo puedan encomendarse a determinadas personas naturales","PRESTAR LOS SERVICIOS COMO OPERADOR DE MAQUINARIA AMARILLA, AL SERVICIO DE LA ADMINISTRACION LOCAL DE RAFAEL URIBE URIBE EN LA REALIZACIÓN DE LAEjecucion DEL PROYECTO  1685 MOVILIDAD MULTIMODAL, INCLUYENTE Y SOSTENIBLE EN RAFAEL URIBE URIBE, ASÍ COMO APOYAR LAS DEMÁS ACTIVIDADES QUE SE GENEREN EN EL ÁREA DE GESTIÓN DEL DESARROLLO CON RELACION AL PROYECTO EN MENCION\t","Inversión","Un nuevo contrato social y ambiental para la Bogotá del Siglo XXI",57,{"$f":"IF(ISERROR(VLOOKUP(K217,Proposito_programa!$C$2:$E$59,2,FALSE)),\" \",VLOOKUP(K217,Proposito_programa!$C$2:$E$59,2,FALSE))","v":"Gestión pública local"},{"$f":"IF(ISERROR(VLOOKUP(K217,Proposito_programa!$C$2:$E$59,3,FALSE)),\" \",VLOOKUP(K217,Proposito_programa!$C$2:$E$59,3,FALSE))","v":"Propósito 5: Construir Bogotá - Región con gobierno abierto, transparente y ciudadanía consciente"},"O23011605570000001697",1,19397700,"LUIS ALBERTO ESPINOSA PRIETO","Persona Natural",null,null,null,null,42200000,null,1,8100000,50300000,50210000,"2022-01-28","2022-01-28","2022-11-15",180,1,90,null,null,null,null,"Terminado",0.9982107355864811]
[209,2022,"FDLRUUCD-209-2022","https://Community.seCop.gov.Co/PubliC/Tendering/OpportunityDetail/Index?notiCeUID=CO1.NTC.2774020&isFromPubliCArea=True&isModal=False","Contratos de prestación de servicios profesionales y de apoyo a la gestión","Contratación directa","Prestación de servicios profesionales y de apoyo a la gestión, o para la ejecución de trabajos artísticos que sólo puedan encomendarse a determinadas personas naturales","APOYAR AL (A) ALCALDE (SA) LOCAL EN EL FORTALECIMIENTO E INCLUSIÓN DE LAS COMUNIDADES NEGRAS, AFROCOLOMBIANAS, PALENQUERAS E INDÍEGNAS EN EL MARCO DE LA POLÍTICA PÚBLICA DISTRITAL Y LOS ESPACIOS DE PARTICIPACIÓN\t","Inversión","Un nuevo contrato social y ambiental para la Bogotá del Siglo XXI",57,{"$f":"IF(ISERROR(VLOOKUP(K218,Proposito_programa!$C$2:$E$59,2,FALSE)),\" \",VLOOKUP(K218,Proposito_programa!$C$2:$E$59,2,FALSE))","v":"Gestión pública local"},{"$f":"IF(ISERROR(VLOOKUP(K218,Proposito_programa!$C$2:$E$59,3,FALSE)),\" \",VLOOKUP(K218,Proposito_programa!$C$2:$E$59,3,FALSE))","v":"Propósito 5: Construir Bogotá - Región con gobierno abierto, transparente y ciudadanía consciente"},"O23011605570000001697",1,1015402029,"JENNIFER ALEXANDRA MARTINEZ AYALA","Persona Natural",null,null,null,null,56600000,null,null,null,56600000,47136667,"2022-01-28","2022-02-07","2022-08-06",180,null,null,79893346,"JUAN CARLOS PRIETO CUENCA","2022-03-24",4080000,"Terminado",0.83280330388692581]
[210,2022,"FDLRUU-CD-210-2022","https://Community.seCop.gov.Co/PubliC/Tendering/OpportunityDetail/Index?notiCeUID=CO1.NTC.2755387&isFromPubliCArea=True&isModal=False","Contratos de prestación de servicios profesionales y de apoyo a la gestión","Contratación directa","Prestación de servicios profesionales y de apoyo a la gestión, o para la ejecución de trabajos artísticos que sólo puedan encomendarse a determinadas personas naturales","PRESTAR LOS SERVICIOS PROFESIONALES EN EL AREA DE GESTION DEL DESARROLLO LOCAL DE LA ALCALDIA RAFAEL URIBE URIBE EN TEMAS DE PLANEACION PARA LOGRAR EL CUMPLIMIENTO DE LAEjecucion Y METAS DEL PLAN DE DESARROLLO LOCAL DE LA LOCALIDAD DE RAFAEL URIBE URIBE 2021  2024","Inversión","Un nuevo contrato social y ambiental para la Bogotá del Siglo XXI",57,{"$f":"IF(ISERROR(VLOOKUP(K219,Proposito_programa!$C$2:$E$59,2,FALSE)),\" \",VLOOKUP(K219,Proposito_programa!$C$2:$E$59,2,FALSE))","v":"Gestión pública local"},{"$f":"IF(ISERROR(VLOOKUP(K219,Proposito_programa!$C$2:$E$59,3,FALSE)),\" \",VLOOKUP(K219,Proposito_programa!$C$2:$E$59,3,FALSE))","v":"Propósito 5: Construir Bogotá - Región con gobierno abierto, transparente y ciudadanía consciente"},"O23011605570000001697",1,14321634,"FERNANDO ANTONIO ORTIZ CALDERON","Persona Natural",null,null,null,null,39000000,null,1,19500000,58500000,55683333,"2022-01-27","2022-02-01","2022-10-31",180,1,90,null,null,null,null,"Terminado",0.9518518461538461]
[211,2022,"FDLRUUCD-211-2022","https://Community.seCop.gov.Co/PubliC/Tendering/OpportunityDetail/Index?notiCeUID=CO1.NTC.2755921&isFromPubliCArea=True&isModal=False","Contratos de prestación de servicios profesionales y de apoyo a la gestión","Contratación directa","Prestación de servicios profesionales y de apoyo a la gestión, o para la ejecución de trabajos artísticos que sólo puedan encomendarse a determinadas personas naturales","PRESTAR LOS SERVICIOS PROFESIONALES PARA EL APOYO A LA EJECUCIÓN INTEGRAL DE LOS PROCESOS DE FORMULACIÓN, EVALUACIÓN Y SEGUIMIENTO DE LOS PROYECTOS DE INFRAESTRUCTURA, MALLA VIAL, ESPACIO PÚBLICO, CICLO INFRAESTRUCTURA, PUENTES, SALONES COMUNALES, MITIGACIÓN Y PARQUES DE LA LOCALIDAD DE RAFAEL URIBE URIBE\t","Inversión","Un nuevo contrato social y ambiental para la Bogotá del Siglo XXI",57,{"$f":"IF(ISERROR(VLOOKUP(K220,Proposito_programa!$C$2:$E$59,2,FALSE)),\" \",VLOOKUP(K220,Proposito_programa!$C$2:$E$59,2,FALSE))","v":"Gestión pública local"},{"$f":"IF(ISERROR(VLOOKUP(K220,Proposito_programa!$C$2:$E$59,3,FALSE)),\" \",VLOOKUP(K220,Proposito_programa!$C$2:$E$59,3,FALSE))","v":"Propósito 5: Construir Bogotá - Región con gobierno abierto, transparente y ciudadanía consciente"},"O23011605570000001697",1,52381414,"ANGELICA MARIA SANCHEZ RODRIGUEZ","Persona Natural",null,null,null,null,35400000,null,null,null,35400000,35400000,"2022-01-27","2022-02-01","2022-07-31",180,null,null,null,null,null,null,"Terminado",1]
[212,2022,"FDLRUU-CD-212-2022","https://Community.seCop.gov.Co/PubliC/Tendering/OpportunityDetail/Index?notiCeUID=CO1.NTC.2775526&isFromPubliCArea=True&isModal=False","Contratos de prestación de servicios profesionales y de apoyo a la gestión","Contratación directa","Prestación de servicios profesionales y de apoyo a la gestión, o para la ejecución de trabajos artísticos que sólo puedan encomendarse a determinadas personas naturales","PRESTAR LOS SERVICIOS PROFESIONALES PARA EL APOYO A LA EJECUCIÓN INTEGRAL DE LOS PROCESOS DE FORMULACIÓN, EVALUACIÓN Y SEGUIMIENTO DE LOS PROYECTOS DE INFRAESTRUCTURA, MALLA VIAL, ESPACIO PÚBLICO, CICLO INFRAESTRUCTURA, PUENTES, SALONES COMUNALES, MITIGACIÓN Y PARQUES DE LA LOCALIDAD DE RAFAEL URIBE URIBE.\t","Inversión","Un nuevo contrato social y ambiental para la Bogotá del Siglo XXI",57,{"$f":"IF(ISERROR(VLOOKUP(K221,Proposito_programa!$C$2:$E$59,2,FALSE)),\" \",VLOOKUP(K221,Proposito_programa!$C$2:$E$59,2,FALSE))","v":"Gestión pública local"},{"$f":"IF(ISERROR(VLOOKUP(K221,Proposito_programa!$C$2:$E$59,3,FALSE)),\" \",VLOOKUP(K221,Proposito_programa!$C$2:$E$59,3,FALSE))","v":"Propósito 5: Construir Bogotá - Región con gobierno abierto, transparente y ciudadanía consciente"},"O23011605570000001697",1,1020751349,"LUZ ANGEE CRUZ GIRAL","Persona Natural",null,null,null,null,35400000,null,null,null,35400000,35400000,"2022-01-28","2022-02-01","2022-07-31",180,null,null,null,null,null,null,"Terminado",1]
[213,2022,"FDLRUU-CD-213-2022","https://Community.seCop.gov.Co/PubliC/Tendering/OpportunityDetail/Index?notiCeUID=CO1.NTC.2775834&isFromPubliCArea=True&isModal=False","Contratos de prestación de servicios profesionales y de apoyo a la gestión","Contratación directa","Prestación de servicios profesionales y de apoyo a la gestión, o para la ejecución de trabajos artísticos que sólo puedan encomendarse a determinadas personas naturales","PRESTAR LOS SERVICIOS PROFESIONALES PARA EL APOYO A LA EJECUCIÓN INTEGRAL DE LOS PROCESOS DE FORMULACIÓN, EVALUACIÓN Y SEGUIMIENTO DE LOS PROYECTOS DE INFRAESTRUCTURA, MALLA VIAL, ESPACIO PÚBLICO, CICLO INFRAESTRUCTURA, PUENTES, SALONES COMUNALES, MITIGACIÓN Y PARQUES DE LA LOCALIDAD DE RAFAEL URIBE URIBE.\t","Inversión","Un nuevo contrato social y ambiental para la Bogotá del Siglo XXI",57,{"$f":"IF(ISERROR(VLOOKUP(K222,Proposito_programa!$C$2:$E$59,2,FALSE)),\" \",VLOOKUP(K222,Proposito_programa!$C$2:$E$59,2,FALSE))","v":"Gestión pública local"},{"$f":"IF(ISERROR(VLOOKUP(K222,Proposito_programa!$C$2:$E$59,3,FALSE)),\" \",VLOOKUP(K222,Proposito_programa!$C$2:$E$59,3,FALSE))","v":"Propósito 5: Construir Bogotá - Región con gobierno abierto, transparente y ciudadanía consciente"},"O23011605570000001697",1,1020755560,"LUISA FERNANDA CHAVES MANRIQUE","Persona Natural",null,null,null,null,35400000,null,1,17700000,53100000,53100000,"2022-01-28","2022-02-01","2022-10-31",180,1,90,null,null,null,null,"Terminado",1]
[215,2021,"FDLRUU-CD-215-2021","https://community.secop.gov.co/Public/Tendering/OpportunityDetail/Index?noticeUID=CO1.NTC.1895358&isFromPublicArea=True&isModal=False\n","Contratos de prestación de servicios profesionales y de apoyo a la gestión","Contratación directa","Prestación de servicios profesionales y de apoyo a la gestión, o para la ejecución de trabajos artísticos que sólo puedan encomendarse a determinadas personas naturales","EL CONTRATISTA SE OBLIGA A PRESTAR SERVICIOS PROFESIONALES EN EL ÁREA DE GESTIÓN POLICIVA JURIDICA DE LA ALCALDÍA LOCAL DE RAFAEL URIBE URIBE, PARA VIGILANCIA Y CONTROL DE LAS ZONAS DE PROTECCION AMBIENTAL, REASENTAMIENTOS, RESERVAS AMBIENTALES, HUMEDALES Y ECOSISTEMAS Y CONTROL","Inversión","Un nuevo contrato social y ambiental para la Bogotá del Siglo XXI",57,{"$f":"IF(ISERROR(VLOOKUP(K223,Proposito_programa!$C$2:$E$59,2,FALSE)),\" \",VLOOKUP(K223,Proposito_programa!$C$2:$E$59,2,FALSE))","v":"Gestión pública local"},{"$f":"IF(ISERROR(VLOOKUP(K223,Proposito_programa!$C$2:$E$59,3,FALSE)),\" \",VLOOKUP(K223,Proposito_programa!$C$2:$E$59,3,FALSE))","v":"Propósito 5: Construir Bogotá - Región con gobierno abierto, transparente y ciudadanía consciente"},"O23011605570000001698",1,1030657007,"JUAN CAMILO MOLANO APONTE","Persona Natural",null,null,null,null,0,null,1,26000000,26000000,26000000,"2021-04-07","2021-04-19","2022-02-18",300,null,null,null,null,null,null,"Terminado",1]
[215,2022,"FDLRUU-CD-215-2022","https://Community.seCop.gov.Co/PubliC/Tendering/OpportunityDetail/Index?notiCeUID=CO1.NTC.2765405&isFromPubliCArea=True&isModal=False","Arrendamiento de bienes inmuebles","Contratación directa","El arrendamiento o adquisición de inmuebles","CONTRATAR EL ARRENDAMIENTO DE UN ÁREA QUE SIRVA COMO ESTACIONAMIENTO DE LOS VEHÍCULOS Y LA MAQUINARIA PESADA A CARGO DEL FONDO DE DESARROLLO LOCAL RAFAEL URIBE URIBE\t","Inversión","Un nuevo contrato social y ambiental para la Bogotá del Siglo XXI",49,{"$f":"IF(ISERROR(VLOOKUP(K224,Proposito_programa!$C$2:$E$59,2,FALSE)),\" \",VLOOKUP(K224,Proposito_programa!$C$2:$E$59,2,FALSE))","v":"Movilidad segura, sostenible y accesible"},{"$f":"IF(ISERROR(VLOOKUP(K224,Proposito_programa!$C$2:$E$59,3,FALSE)),\" \",VLOOKUP(K224,Proposito_programa!$C$2:$E$59,3,FALSE))","v":"Propósito 4: Hacer de Bogotá Región un modelo de movilidad multimodal, incluyente y sostenible"},"O23011604490000001685",1,35489792,"Arrendamiento Parqueadro Maquinaria Amarilla  , MARIA ELENA ROSAS MELO ","Persona Natural",null,null,null,null,41225508,null,null,null,41225508,34698136,"2022-02-01","2022-01-28","2023-01-27",360,1,30,null,null,null,null,"Terminado",0.84166666909234933]
[216,2021,"FDLRUU-CD-216-2021","https://community.secop.gov.co/Public/Tendering/OpportunityDetail/Index?noticeUID=CO1.NTC.1897422&isFromPublicArea=True&isModal=False\n","Contratos de prestación de servicios profesionales y de apoyo a la gestión","Contratación directa","Prestación de servicios profesionales y de apoyo a la gestión, o para la ejecución de trabajos artísticos que sólo puedan encomendarse a determinadas personas naturales","APOYAR AL ALCALDE LOCAL EN LA FORMULACIÓN, SEGUIMIENTO E IMPLEMENTACIÓN DE LA ESTRATEGIA LOCAL PARA LA TERMINACIÓN JURÍDICA DE LAS ACTUACIONES ADMINISTRATIVAS QUE CURSAN EN LA ALCALDÍA LOCAL","Inversión","Un nuevo contrato social y ambiental para la Bogotá del Siglo XXI",57,{"$f":"IF(ISERROR(VLOOKUP(K225,Proposito_programa!$C$2:$E$59,2,FALSE)),\" \",VLOOKUP(K225,Proposito_programa!$C$2:$E$59,2,FALSE))","v":"Gestión pública local"},{"$f":"IF(ISERROR(VLOOKUP(K225,Proposito_programa!$C$2:$E$59,3,FALSE)),\" \",VLOOKUP(K225,Proposito_programa!$C$2:$E$59,3,FALSE))","v":"Propósito 5: Construir Bogotá - Región con gobierno abierto, transparente y ciudadanía consciente"},"O23011605570000001698",1,1010169789,"VANESSA DOMINGUEZ PALOMINO","Persona Natural",null,null,null,null,0,null,1,34000000,34000000,34000000,"2021-04-07","2021-04-13","2022-02-12",300,null,null,null,null,null,null,"Terminado",1]
[216,2022,"FDLRUU-CD-216-2022","https://Community.seCop.gov.Co/PubliC/Tendering/OpportunityDetail/Index?notiCeUID=CO1.NTC.2763948&isFromPubliCArea=True&isModal=False","Contratos de prestación de servicios profesionales y de apoyo a la gestión","Contratación directa","Prestación de servicios profesionales y de apoyo a la gestión, o para la ejecución de trabajos artísticos que sólo puedan encomendarse a determinadas personas naturales","PRESTAR LOS SERVICIOS PROFESIONALES PARA APOYAR EN EL ANÁLISIS REVISIÓN, TRAMITE Y SUSCRIPCIÓN DE LOS ACTOS ADMINISTRATIVOS, DESPACHOS COMISORIOS, TUTELAS Y LOS CONCEPTOS JURÍDICOS QUE SE LE SOLICITEN POR PARTE DE LA ALCALDÍA LOCAL DE RAFAEL URIBE URIBE","Inversión","Un nuevo contrato social y ambiental para la Bogotá del Siglo XXI",57,{"$f":"IF(ISERROR(VLOOKUP(K226,Proposito_programa!$C$2:$E$59,2,FALSE)),\" \",VLOOKUP(K226,Proposito_programa!$C$2:$E$59,2,FALSE))","v":"Gestión pública local"},{"$f":"IF(ISERROR(VLOOKUP(K226,Proposito_programa!$C$2:$E$59,3,FALSE)),\" \",VLOOKUP(K226,Proposito_programa!$C$2:$E$59,3,FALSE))","v":"Propósito 5: Construir Bogotá - Región con gobierno abierto, transparente y ciudadanía consciente"},"O23011605570000001698",1,52177304,"MONICA ELVIRA CRUZ CORREAL","Persona Natural",null,null,null,null,35400000,null,null,null,35400000,35400000,"2022-01-28","2022-02-01","2022-07-31",180,null,null,null,null,null,null,"Terminado",1]
[217,2022,"FDLRUU-CD-217-2022","https://Community.seCop.gov.Co/PubliC/Tendering/OpportunityDetail/Index?notiCeUID=CO1.NTC.2755953&isFromPubliCArea=True&isModal=False","Contratos de prestación de servicios profesionales y de apoyo a la gestión","Contratación directa","Prestación de servicios profesionales y de apoyo a la gestión, o para la ejecución de trabajos artísticos que sólo puedan encomendarse a determinadas personas naturales","EL CONTRATISTA SE OBLIGA A PRESTAR SUS SERVICIOS PROFESIONALES PARA APOYAR EL ÁREA DE GESTIÓN DEL DESARROLLO LOCAL EN LA ELABORACIÓN DE ESTUDIOS PREVIOS, APOYO A LA SUPERVISIÓN, SEGUIMIENTO, EVALUACIÓN Y CONTROL DE LOS CONDUCTORES Y LA FLOTA VEHICULAR (VEHÍCULOS LIVIANOS, MAQUINARIA AMARILLA Y VOLQUETAS) DE PROPIEDAD Y/O TENENCIA DEL FDLRUU, ASÍ COMO APOYAR LAS DEMÁS ACTIVIDADES QUE SE GENEREN EN EL ÁREA DE GESTIÓN DEL DESARROLLO LOCAL","Inversión","Un nuevo contrato social y ambiental para la Bogotá del Siglo XXI",57,{"$f":"IF(ISERROR(VLOOKUP(K227,Proposito_programa!$C$2:$E$59,2,FALSE)),\" \",VLOOKUP(K227,Proposito_programa!$C$2:$E$59,2,FALSE))","v":"Gestión pública local"},{"$f":"IF(ISERROR(VLOOKUP(K227,Proposito_programa!$C$2:$E$59,3,FALSE)),\" \",VLOOKUP(K227,Proposito_programa!$C$2:$E$59,3,FALSE))","v":"Propósito 5: Construir Bogotá - Región con gobierno abierto, transparente y ciudadanía consciente"},"O23011605570000001697",1,79938168,"JUAMPABLO VICENTE BARRIGA GUZMAN ","Persona Natural",null,null,null,null,59400000,null,1,5940000,65340000,54540000,"2022-01-27","2022-01-28","2023-01-30",330,1,33,null,null,null,null,"Terminado",0.83471074380165289]
[218,2022,"FDLRUU-CD-218-2022","https://Community.seCop.gov.Co/PubliC/Tendering/OpportunityDetail/Index?notiCeUID=CO1.NTC.2775680&isFromPubliCArea=True&isModal=False","Contratos de prestación de servicios profesionales y de apoyo a la gestión","Contratación directa","Prestación de servicios profesionales y de apoyo a la gestión, o para la ejecución de trabajos artísticos que sólo puedan encomendarse a determinadas personas naturales","PRESTAR LOS SERVICIOS PROFESIONALES PARA ADELANTAR LAS ACCIONES TENDIENTES AL AGENCIAMIENTO E IMPLEMENTACIÓN DE LAS POLÍTICAS PÚBLICAS DEL ORDEN DISTRITAL EN LO LOCAL, SEGUIMIENTO AL PLAN DE DESARROLLO LOCAL, ACOMPAÑAR LAS INSTANCIAS DE PARTICIPACIÓN QUE LE SEAN ASIGNADAS POR EL SUPERVISOR Y APOYAR LAS DEMÁS ACTIVIDADES QUE SE GENEREN EN EL ÁREA DE GESTIÓN DEL DESARROLLO LOCAL","Inversión","Un nuevo contrato social y ambiental para la Bogotá del Siglo XXI",57,{"$f":"IF(ISERROR(VLOOKUP(K228,Proposito_programa!$C$2:$E$59,2,FALSE)),\" \",VLOOKUP(K228,Proposito_programa!$C$2:$E$59,2,FALSE))","v":"Gestión pública local"},{"$f":"IF(ISERROR(VLOOKUP(K228,Proposito_programa!$C$2:$E$59,3,FALSE)),\" \",VLOOKUP(K228,Proposito_programa!$C$2:$E$59,3,FALSE))","v":"Propósito 5: Construir Bogotá - Región con gobierno abierto, transparente y ciudadanía consciente"},"O23011605570000001697",1,79443062,"LUIS FERNANDO BARRETO GONZALEZ","Persona Natural",null,null,null,null,32400000,null,1,16200000,48600000,48600000,"2022-01-28","2022-02-01","2022-10-31",180,1,90,null,null,null,null,"Terminado",1]
[219,2022,"FDLRUU-CD-219-2022","https://Community.seCop.gov.Co/PubliC/Tendering/OpportunityDetail/Index?notiCeUID=CO1.NTC.2769720&isFromPubliCArea=True&isModal=False","Contratos de prestación de servicios profesionales y de apoyo a la gestión","Contratación directa","Prestación de servicios profesionales y de apoyo a la gestión, o para la ejecución de trabajos artísticos que sólo puedan encomendarse a determinadas personas naturales","PRESTAR LOS SERVICIOS PROFESIONALES PARA ADELANTAR LAS ACCIONES TENDIENTES AL AGENCIAMIENTO E IMPLEMENTACIÓN DE LAS POLÍTICAS PÚBLICAS DEL ORDEN DISTRITAL EN LO LOCAL, SEGUIMIENTO AL PLAN DE DESARROLLO LOCAL, ACOMPAÑAR LAS INSTANCIAS DE PARTICIPACIÓN QUE LE SEAN ASIGNADAS POR EL SUPERVISOR Y APOYAR LAS DEMÁS ACTIVIDADES QUE SE GENEREN EN EL ÁREA DE GESTIÓN DEL DESARROLLO LOCAL\t","Inversión","Un nuevo contrato social y ambiental para la Bogotá del Siglo XXI",57,{"$f":"IF(ISERROR(VLOOKUP(K229,Proposito_programa!$C$2:$E$59,2,FALSE)),\" \",VLOOKUP(K229,Proposito_programa!$C$2:$E$59,2,FALSE))","v":"Gestión pública local"},{"$f":"IF(ISERROR(VLOOKUP(K229,Proposito_programa!$C$2:$E$59,3,FALSE)),\" \",VLOOKUP(K229,Proposito_programa!$C$2:$E$59,3,FALSE))","v":"Propósito 5: Construir Bogotá - Región con gobierno abierto, transparente y ciudadanía consciente"},"O23011605570000001697",1,1026283917,"LIZETH JURANY HERNANDEZ SANABRIA","Persona Natural",null,null,null,null,32400000,null,1,16200000,48600000,{"$f":"44820000+AL229","v":48600000},"2022-01-28","2022-02-01","2022-10-31",180,1,90,52219936,"SANDRA PATRICIA SANABRIA HERNANDEZ","2022-02-22",3780000,"Terminado",1]
[220,2022,"FDLRUU-CD-220-2022","https://Community.seCop.gov.Co/PubliC/Tendering/OpportunityDetail/Index?notiCeUID=CO1.NTC.2760742&isFromPubliCArea=True&isModal=False","Contratos de prestación de servicios profesionales y de apoyo a la gestión","Contratación directa","Prestación de servicios profesionales y de apoyo a la gestión, o para la ejecución de trabajos artísticos que sólo puedan encomendarse a determinadas personas naturales","PRESTAR LOS SERVICIOS PROFESIONALES PARA ADELANTAR LAS ACCIONES TENDIENTES AL AGENCIAMIENTO E IMPLEMENTACIÓN DE LAS POLÍTICAS PÚBLICAS DEL ORDEN DISTRITAL EN LO LOCAL, SEGUIMIENTO AL PLAN DE DESARROLLO LOCAL, ACOMPAÑAR LAS INSTANCIAS DE PARTICIPACIÓN QUE LE SEAN ASIGNADAS POR EL SUPERVISOR Y APOYAR LAS DEMÁS ACTIVIDADES QUE SE GENEREN EN EL ÁREA DE GESTIÓN DEL DESARROLLO LOCA\t","Inversión","Un nuevo contrato social y ambiental para la Bogotá del Siglo XXI",57,{"$f":"IF(ISERROR(VLOOKUP(K230,Proposito_programa!$C$2:$E$59,2,FALSE)),\" \",VLOOKUP(K230,Proposito_programa!$C$2:$E$59,2,FALSE))","v":"Gestión pública local"},{"$f":"IF(ISERROR(VLOOKUP(K230,Proposito_programa!$C$2:$E$59,3,FALSE)),\" \",VLOOKUP(K230,Proposito_programa!$C$2:$E$59,3,FALSE))","v":"Propósito 5: Construir Bogotá - Región con gobierno abierto, transparente y ciudadanía consciente"},"O23011605570000001697",1,1010221253,"ANDREA CAROLINA BARRETO PEREZ","Persona Natural",null,null,null,null,32400000,null,1,16200000,48600000,48600000,"2022-01-27","2022-02-01","2022-10-31",180,1,90,null,null,null,null,"Terminado",1]
[221,2022,"FDLRUU-CD-221-2022","https://Community.seCop.gov.Co/PubliC/Tendering/OpportunityDetail/Index?notiCeUID=CO1.NTC.2764676&isFromPubliCArea=True&isModal=False","Contratos de prestación de servicios profesionales y de apoyo a la gestión","Contratación directa","Prestación de servicios profesionales y de apoyo a la gestión, o para la ejecución de trabajos artísticos que sólo puedan encomendarse a determinadas personas naturales","PRESTAR LOS SERVICIOS PROFESIONALES COMO ADMINISTRATIVOS EN EL SEGUIMIENTO DE PAGOS, LA ACTUALIZACIÓN, LIQUIDACIÓN Y DEPURACIÓN DE LOS CONTRATOS QUE SE ENCUENTRAN ENEjecucion Y/O OBLIGACIONES POR PAGAR DE VIGENCIAS ANTERIORES QUE SE ENCUENTRAN VIGENTES EN EL FONDO DE DESARROLLO LOCAL DE RAFAEL URIBE URIBE.\t","Inversión","Un nuevo contrato social y ambiental para la Bogotá del Siglo XXI",57,{"$f":"IF(ISERROR(VLOOKUP(K231,Proposito_programa!$C$2:$E$59,2,FALSE)),\" \",VLOOKUP(K231,Proposito_programa!$C$2:$E$59,2,FALSE))","v":"Gestión pública local"},{"$f":"IF(ISERROR(VLOOKUP(K231,Proposito_programa!$C$2:$E$59,3,FALSE)),\" \",VLOOKUP(K231,Proposito_programa!$C$2:$E$59,3,FALSE))","v":"Propósito 5: Construir Bogotá - Región con gobierno abierto, transparente y ciudadanía consciente"},"O23011605570000001697",1,52856574,"MILENA VANEGAS LOPEZ","Persona Natural",null,null,null,null,32400000,null,null,null,32400000,32400000,"2022-01-27","2022-02-01","2022-07-31",180,null,null,null,null,null,null,"Terminado",1]
[222,2022,"FDLRUU-CD-222-2022","https://Community.seCop.gov.Co/PubliC/Tendering/OpportunityDetail/Index?notiCeUID=CO1.NTC.2762753&isFromPubliCArea=True&isModal=False","Contratos de prestación de servicios profesionales y de apoyo a la gestión","Contratación directa","Prestación de servicios profesionales y de apoyo a la gestión, o para la ejecución de trabajos artísticos que sólo puedan encomendarse a determinadas personas naturales","PRESTAR LOS SERVICIOS PROFESIONALES COMO ADMINISTRATIVOS EN EL SEGUIMIENTO DE PAGOS, LA ACTUALIZACIÓN, LIQUIDACIÓN Y DEPURACIÓN DE LOS CONTRATOS QUE SE ENCUENTRAN ENEjecucion Y/O OBLIGACIONES POR PAGAR DE VIGENCIAS ANTERIORES QUE SE ENCUENTRAN VIGENTES EN EL FONDO DE DESARROLLO LOCAL DE RAFAEL URIBE URIBE.\t","Inversión","Un nuevo contrato social y ambiental para la Bogotá del Siglo XXI",57,{"$f":"IF(ISERROR(VLOOKUP(K232,Proposito_programa!$C$2:$E$59,2,FALSE)),\" \",VLOOKUP(K232,Proposito_programa!$C$2:$E$59,2,FALSE))","v":"Gestión pública local"},{"$f":"IF(ISERROR(VLOOKUP(K232,Proposito_programa!$C$2:$E$59,3,FALSE)),\" \",VLOOKUP(K232,Proposito_programa!$C$2:$E$59,3,FALSE))","v":"Propósito 5: Construir Bogotá - Región con gobierno abierto, transparente y ciudadanía consciente"},"O23011605570000001697",1,1101177020,"YIRLY NHAYIA PEÑA QUINTERO","Persona Natural",null,null,null,null,32400000,null,1,16200000,48600000,48600000,"2022-01-27","2022-02-01","2022-10-31",180,1,90,null,null,null,null,"Terminado",1]
[223,2022,"FDLRUU-CD-223-2022","https://Community.seCop.gov.Co/PubliC/Tendering/OpportunityDetail/Index?notiCeUID=CO1.NTC.2760969&isFromPubliCArea=True&isModal=False","Contratos de prestación de servicios profesionales y de apoyo a la gestión","Contratación directa","Prestación de servicios profesionales y de apoyo a la gestión, o para la ejecución de trabajos artísticos que sólo puedan encomendarse a determinadas personas naturales","PRESTAR LOS SERVICIOS PROFESIONALES COMO ADMINISTRATIVOS EN EL SEGUIMIENTO DE PAGOS, LA ACTUALIZACIÓN, LIQUIDACIÓN Y DEPURACIÓN DE LOS CONTRATOS QUE SE ENCUENTRAN ENEjecucion Y/O OBLIGACIONES POR PAGAR DE VIGENCIAS ANTERIORES QUE SE ENCUENTRAN VIGENTES EN EL FONDO DE DESARROLLO LOCAL DE RAFAEL URIBE URIBE.\t","Inversión","Un nuevo contrato social y ambiental para la Bogotá del Siglo XXI",57,{"$f":"IF(ISERROR(VLOOKUP(K233,Proposito_programa!$C$2:$E$59,2,FALSE)),\" \",VLOOKUP(K233,Proposito_programa!$C$2:$E$59,2,FALSE))","v":"Gestión pública local"},{"$f":"IF(ISERROR(VLOOKUP(K233,Proposito_programa!$C$2:$E$59,3,FALSE)),\" \",VLOOKUP(K233,Proposito_programa!$C$2:$E$59,3,FALSE))","v":"Propósito 5: Construir Bogotá - Región con gobierno abierto, transparente y ciudadanía consciente"},"O23011605570000001697",1,87941057,"JOSE LUIS GOMEZ GONZALEZ","Persona Natural",null,null,null,null,32400000,null,1,16200000,48600000,48600000,"2022-01-27","2022-02-01","2022-10-31",180,1,90,null,null,null,null,"Terminado",1]
[224,2022,"FDLRUU-CD-224-2022","https://Community.seCop.gov.Co/PubliC/Tendering/OpportunityDetail/Index?notiCeUID=CO1.NTC.2783836&isFromPubliCArea=True&isModal=False","Contratos de prestación de servicios profesionales y de apoyo a la gestión","Contratación directa","Prestación de servicios profesionales y de apoyo a la gestión, o para la ejecución de trabajos artísticos que sólo puedan encomendarse a determinadas personas naturales","APOYAR JURIDICAMENTE EN LAEjecucion Y EL SEGUIMIENTO DE LAS FUNCIONES ASIGNADAS AL AREA DE GESTION POLICIVA JURIDICA DE LA ALCALDIA LOCAL DE RAFAEL URIBE URIBE\t","Inversión","Un nuevo contrato social y ambiental para la Bogotá del Siglo XXI",57,{"$f":"IF(ISERROR(VLOOKUP(K234,Proposito_programa!$C$2:$E$59,2,FALSE)),\" \",VLOOKUP(K234,Proposito_programa!$C$2:$E$59,2,FALSE))","v":"Gestión pública local"},{"$f":"IF(ISERROR(VLOOKUP(K234,Proposito_programa!$C$2:$E$59,3,FALSE)),\" \",VLOOKUP(K234,Proposito_programa!$C$2:$E$59,3,FALSE))","v":"Propósito 5: Construir Bogotá - Región con gobierno abierto, transparente y ciudadanía consciente"},"O23011605570000001698",1,1077436601," MANUEL FERLEY MATURANA MENA","Persona Natural",null,null,null,null,32400000,null,1,16200000,48600000,48600000,"2022-02-28","2022-02-01","2022-10-31",180,1,90,null,null,null,null,"Terminado",1]
[225,2022,"FDLRUU-CD-225-2022","https://Community.seCop.gov.Co/PubliC/Tendering/OpportunityDetail/Index?notiCeUID=CO1.NTC.2774380&isFromPubliCArea=True&isModal=False","Contratos de prestación de servicios profesionales y de apoyo a la gestión","Contratación directa","Prestación de servicios profesionales y de apoyo a la gestión, o para la ejecución de trabajos artísticos que sólo puedan encomendarse a determinadas personas naturales","APOYAR JURIDICAMENTE EN LAEjecucion Y EL SEGUIMIENTO DE LAS FUNCIONES ASIGNADAS AL AREA DE GESTION POLICIVA JURIDICA DE LA ALCALDIA LOCAL DE RAFAEL URIBE URIBE\t","Inversión","Un nuevo contrato social y ambiental para la Bogotá del Siglo XXI",57,{"$f":"IF(ISERROR(VLOOKUP(K235,Proposito_programa!$C$2:$E$59,2,FALSE)),\" \",VLOOKUP(K235,Proposito_programa!$C$2:$E$59,2,FALSE))","v":"Gestión pública local"},{"$f":"IF(ISERROR(VLOOKUP(K235,Proposito_programa!$C$2:$E$59,3,FALSE)),\" \",VLOOKUP(K235,Proposito_programa!$C$2:$E$59,3,FALSE))","v":"Propósito 5: Construir Bogotá - Región con gobierno abierto, transparente y ciudadanía consciente"},"O23011605570000001698",1,13541996,"RAUL ENRIQUE DANGOND CONTRERAS","Persona Natural",null,null,null,null,32400000,null,1,16200000,48600000,48600000,"2022-02-28","2022-02-01","2022-10-31",180,1,90,null,null,null,null,"Terminado",1]
[226,2021,"FDLRUU-SABM-226-2021","https://community.secop.gov.co/Public/Tendering/OpportunityDetail/Index?noticeUID=CO1.NTC.2016319&isFromPublicArea=True&isModal=False\n","Contratos de prestación de servicios","Régimen especial","Decreto 92 de 2017","CONTRATAR LA PRESTACIÓN DEL SERVICIO DE VIGILANCIA Y SEGURIDAD PRIVADA A TRAVÉS DE LA BOLSA MERCANTIL DE COLOMBIA S.A. PARA LOS PREDIOS Y/O BIENES DE PROPIEDAD Y/O TENENCIA DEL FONDO DE DESARROLLO LOCAL RAFAEL URIBE URIBE DE CONFORMIDAD CON LAS CONDICIONES TÉCNICAS QUE DESIGNE","Funcionamiento","Un nuevo contrato social y ambiental para la Bogotá del Siglo XXI","No aplica",{"$f":"IF(ISERROR(VLOOKUP(K236,Proposito_programa!$C$2:$E$59,2,FALSE)),\" \",VLOOKUP(K236,Proposito_programa!$C$2:$E$59,2,FALSE))","v":" "},{"$f":"IF(ISERROR(VLOOKUP(K236,Proposito_programa!$C$2:$E$59,3,FALSE)),\" \",VLOOKUP(K236,Proposito_programa!$C$2:$E$59,3,FALSE))","v":" "},131020202030501,1,800095131,"MIGUEL QUIJANO Y COMPAÑIA S.A.","Persona Jurídica",null,null,null,null,0,null,3,137134916,137134916,135601409,"2021-06-04","2021-06-24","2022-03-31",240,1,39,null,null,null,null,"Terminado",0.98881753061342892]
[226,2022,"FDLRUU-CD-226-2022","https://Community.seCop.gov.Co/PubliC/Tendering/OpportunityDetail/Index?notiCeUID=CO1.NTC.2756361&isFromPubliCArea=True&isModal=False","Contratos de prestación de servicios profesionales y de apoyo a la gestión","Contratación directa","Prestación de servicios profesionales y de apoyo a la gestión, o para la ejecución de trabajos artísticos que sólo puedan encomendarse a determinadas personas naturales","\nPRESTAR LOS SERVICIOS PROFESIONALES PARA APOYAR LA FORMULACION, EJECUCIÓN Y SEGUIMIENTO DE LOS PROYECTOS DE INVERSIÓN EN EL MARCO DEL CUMPLIMIENTO DEL PLAN DE DESARROLLO LOCAL DE LA ALCALDÍA LOCAL DE RAFAEL URIBE URIBE 2021 2024","Inversión","Un nuevo contrato social y ambiental para la Bogotá del Siglo XXI",57,{"$f":"IF(ISERROR(VLOOKUP(K237,Proposito_programa!$C$2:$E$59,2,FALSE)),\" \",VLOOKUP(K237,Proposito_programa!$C$2:$E$59,2,FALSE))","v":"Gestión pública local"},{"$f":"IF(ISERROR(VLOOKUP(K237,Proposito_programa!$C$2:$E$59,3,FALSE)),\" \",VLOOKUP(K237,Proposito_programa!$C$2:$E$59,3,FALSE))","v":"Propósito 5: Construir Bogotá - Región con gobierno abierto, transparente y ciudadanía consciente"},"O23011605570000001697",1,1033696186,"Angel Alexander Gutierrez Beltran","Persona Natural",null,null,null,null,59400000,null,1,5940000,65340000,{"$f":"16200000+AL237","v":54540000},"2022-01-27","2022-01-28","2023-01-26",330,1,33,52529553,"INGRID BEATRIZ ACOSTA VELASQUEZ","2022-09-01",38340000,"Terminacion Anticipada",0.83471074380165289]
[227,2022,"FDLRUU-CD-227-2022","https://Community.seCop.gov.Co/PubliC/Tendering/OpportunityDetail/Index?notiCeUID=CO1.NTC.2780909&isFromPubliCArea=True&isModal=False","Contratos de prestación de servicios profesionales y de apoyo a la gestión","Contratación directa","Prestación de servicios profesionales y de apoyo a la gestión, o para la ejecución de trabajos artísticos que sólo puedan encomendarse a determinadas personas naturales","APOYAR TÉCNICAMENTE LAS DISTINTAS ETAPAS DE LOS PROCESOS DE COMPETENCIA DE LASINSPECCIONES DE POLICÍA DE LA LOCALIDAD, SEGÚN REPARTO","Inversión","Un nuevo contrato social y ambiental para la Bogotá del Siglo XXI",57,{"$f":"IF(ISERROR(VLOOKUP(K238,Proposito_programa!$C$2:$E$59,2,FALSE)),\" \",VLOOKUP(K238,Proposito_programa!$C$2:$E$59,2,FALSE))","v":"Gestión pública local"},{"$f":"IF(ISERROR(VLOOKUP(K238,Proposito_programa!$C$2:$E$59,3,FALSE)),\" \",VLOOKUP(K238,Proposito_programa!$C$2:$E$59,3,FALSE))","v":"Propósito 5: Construir Bogotá - Región con gobierno abierto, transparente y ciudadanía consciente"},"O23011605570000001698",1,79748235,"JORGE ANDRES MONCALEANO FLORIANO","Persona Natural",null,null,null,null,59400000,null,1,5400000,64800000,54000000,"2022-01-28","2022-02-01","2023-01-23",330,1,30,null,null,null,null,"Terminacion Anticipada",0.83333333333333337]
[228,2022,"FDLRUU-CD-228-2022","https://Community.seCop.gov.Co/PubliC/Tendering/OpportunityDetail/Index?notiCeUID=CO1.NTC.2757848&isFromPubliCArea=True&isModal=False","Contratos de prestación de servicios profesionales y de apoyo a la gestión","Contratación directa","Prestación de servicios profesionales y de apoyo a la gestión, o para la ejecución de trabajos artísticos que sólo puedan encomendarse a determinadas personas naturales","COORDINA, LIDERA Y ASESORA LOS PLANES Y ESTRATEGIAS DE COMUNICACIÓN INTERNA Y EXTERNA PARA LA DIVULGACIÓN DE LOS PROGRAMAS, PROYECTOS Y ACTIVIDADES DE LA ALCALDÍA LOCAL.","Inversión","Un nuevo contrato social y ambiental para la Bogotá del Siglo XXI",57,{"$f":"IF(ISERROR(VLOOKUP(K239,Proposito_programa!$C$2:$E$59,2,FALSE)),\" \",VLOOKUP(K239,Proposito_programa!$C$2:$E$59,2,FALSE))","v":"Gestión pública local"},{"$f":"IF(ISERROR(VLOOKUP(K239,Proposito_programa!$C$2:$E$59,3,FALSE)),\" \",VLOOKUP(K239,Proposito_programa!$C$2:$E$59,3,FALSE))","v":"Propósito 5: Construir Bogotá - Región con gobierno abierto, transparente y ciudadanía consciente"},"O23011605570000001697",1,50868594,"MARTHA LUCÍA AGAMEZ VILLEGAS","Persona Natural",null,null,null,null,41400000,null,null,null,41400000,41170000,"2022-01-27","2022-02-02","2022-08-01",180,null,null,null,null,null,null,"Terminado",0.99444444444444446]
[229,2022,"FDLRUU-CD-229-2022","https://Community.seCop.gov.Co/PubliC/Tendering/OpportunityDetail/Index?notiCeUID=CO1.NTC.2782928&isFromPubliCArea=True&isModal=False","Contratos de prestación de servicios profesionales y de apoyo a la gestión","Contratación directa","Prestación de servicios profesionales y de apoyo a la gestión, o para la ejecución de trabajos artísticos que sólo puedan encomendarse a determinadas personas naturales","\nPRESTAR LOS SERVICIOS TÉCNICOS PARA APOYAR A LA ALCALDIA LOCAL DE RAFAEL URIBE URIBE EN LA REALIZACION DE PIEZAS DIGITALES, DE ANIMACION, PUBLICITARIAS Y DE IMAGEN INSTITUCIONAL DE GRAN FORMATO","Inversión","Un nuevo contrato social y ambiental para la Bogotá del Siglo XXI",57,{"$f":"IF(ISERROR(VLOOKUP(K240,Proposito_programa!$C$2:$E$59,2,FALSE)),\" \",VLOOKUP(K240,Proposito_programa!$C$2:$E$59,2,FALSE))","v":"Gestión pública local"},{"$f":"IF(ISERROR(VLOOKUP(K240,Proposito_programa!$C$2:$E$59,3,FALSE)),\" \",VLOOKUP(K240,Proposito_programa!$C$2:$E$59,3,FALSE))","v":"Propósito 5: Construir Bogotá - Región con gobierno abierto, transparente y ciudadanía consciente"},"O23011605570000001697",1,1020721636,"ANTONY CARLOS MONROY CASTELLANOS","Persona Natural",null,null,null,null,24000000,null,1,12000000,36000000,32000000,"2022-01-28","2022-02-01","2022-10-31",180,1,90,null,null,null,null,"Terminado",0.88888888888888884]
[230,2022,"FDLRUU-CD-230-2022","https://Community.seCop.gov.Co/PubliC/Tendering/OpportunityDetail/Index?notiCeUID=CO1.NTC.2804946&isFromPubliCArea=True&isModal=False","Contratos de prestación de servicios profesionales y de apoyo a la gestión","Contratación directa","Prestación de servicios profesionales y de apoyo a la gestión, o para la ejecución de trabajos artísticos que sólo puedan encomendarse a determinadas personas naturales","APOYAR AL EQUIPO DE PRENSA Y COMUNICACIONES DE LA ALCALDÍA LOCAL EN LA REALIZACIÓN DE PRODUCTOS Y PIEZAS DIGITALES, IMPRESAS Y PUBLICITARIAS DE GRAN FORMATO Y DE ANIMACIÓN GRÁFICA, ASÍ COMO APOYAR LA PRODUCCIÓN Y MONTAJE DE EVENTOS.","Inversión","Un nuevo contrato social y ambiental para la Bogotá del Siglo XXI",57,{"$f":"IF(ISERROR(VLOOKUP(K241,Proposito_programa!$C$2:$E$59,2,FALSE)),\" \",VLOOKUP(K241,Proposito_programa!$C$2:$E$59,2,FALSE))","v":"Gestión pública local"},{"$f":"IF(ISERROR(VLOOKUP(K241,Proposito_programa!$C$2:$E$59,3,FALSE)),\" \",VLOOKUP(K241,Proposito_programa!$C$2:$E$59,3,FALSE))","v":"Propósito 5: Construir Bogotá - Región con gobierno abierto, transparente y ciudadanía consciente"},"O23011605570000001697",1,1012410729,"DANIEL FERNANDO AMADOR CARVAJAL ","Persona Natural",null,null,null,null,32400000,null,1,16200000,48600000,48600000,"2022-01-28","2022-02-03","2022-11-02",180,1,90,null,null,null,null,"Terminado",1]
[231,2022,"FDLRUU-CD-231-2022","https://Community.seCop.gov.Co/PubliC/Tendering/OpportunityDetail/Index?notiCeUID=CO1.NTC.2769789&isFromPubliCArea=True&isModal=False","Contratos de prestación de servicios profesionales y de apoyo a la gestión","Contratación directa","Prestación de servicios profesionales y de apoyo a la gestión, o para la ejecución de trabajos artísticos que sólo puedan encomendarse a determinadas personas naturales","\tAPOYAR AL EQUIPO DE PRENSA Y COMUNICACIONES DE LA ALCALDÍA LOCAL EN LA REALIZACIÓN Y PUBLICACIÓN DE CONTENIDOS DE REDES SOCIALES Y CANALES DE DIVULGACIÓN DIGITAL (SITIO WEB) DE LA ALCALDÍA LOCAL.","Inversión","Un nuevo contrato social y ambiental para la Bogotá del Siglo XXI",57,{"$f":"IF(ISERROR(VLOOKUP(K242,Proposito_programa!$C$2:$E$59,2,FALSE)),\" \",VLOOKUP(K242,Proposito_programa!$C$2:$E$59,2,FALSE))","v":"Gestión pública local"},{"$f":"IF(ISERROR(VLOOKUP(K242,Proposito_programa!$C$2:$E$59,3,FALSE)),\" \",VLOOKUP(K242,Proposito_programa!$C$2:$E$59,3,FALSE))","v":"Propósito 5: Construir Bogotá - Región con gobierno abierto, transparente y ciudadanía consciente"},"O23011605570000001697",1,79391495,"WILLIAM CADENA ACOSTA","Persona Natural",null,null,null,null,32400000,null,1,16200000,48600000,48600000,"2022-01-28","2022-01-28","2022-10-27",180,1,90,null,null,null,null,"Terminado",1]
[232,2022,"FDLRRU-CD-232-2022","https://Community.seCop.gov.Co/PubliC/Tendering/OpportunityDetail/Index?notiCeUID=CO1.NTC.2803772&isFromPubliCArea=True&isModal=False","Contratos de prestación de servicios profesionales y de apoyo a la gestión","Contratación directa","Prestación de servicios profesionales y de apoyo a la gestión, o para la ejecución de trabajos artísticos que sólo puedan encomendarse a determinadas personas naturales","PRESTAR LOS SERVICIOS PROFESIONALES PARA APOYAR LA FORMULACION, EJECUCIÓN Y SEGUIMIENTO DE LOS PROYECTOS DE INVERSIÓN EN EL MARCO DEL CUMPLIMIENTO DEL PLAN DE DESARROLLO LOCAL DE LA ALCALDÍA LOCAL DE RAFAEL URIBE URIBE 2021 2024 Se","Inversión","Un nuevo contrato social y ambiental para la Bogotá del Siglo XXI",57,{"$f":"IF(ISERROR(VLOOKUP(K243,Proposito_programa!$C$2:$E$59,2,FALSE)),\" \",VLOOKUP(K243,Proposito_programa!$C$2:$E$59,2,FALSE))","v":"Gestión pública local"},{"$f":"IF(ISERROR(VLOOKUP(K243,Proposito_programa!$C$2:$E$59,3,FALSE)),\" \",VLOOKUP(K243,Proposito_programa!$C$2:$E$59,3,FALSE))","v":"Propósito 5: Construir Bogotá - Región con gobierno abierto, transparente y ciudadanía consciente"},"O23011605570000001697",1,1014195591,"LEIDY JOHANA MOLANO LOZADA","Persona Natural",null,null,null,null,59400000,null,1,5220000,64620000,54000000,"2022-01-28","2022-02-01","2023-01-30",330,1,29,null,null,null,null,"Terminado",0.83565459610027859]
[233,2022,"FDLRUU-CD-233-2022","https://Community.seCop.gov.Co/PubliC/Tendering/OpportunityDetail/Index?notiCeUID=CO1.NTC.2807403&isFromPubliCArea=True&isModal=False","Contratos de prestación de servicios profesionales y de apoyo a la gestión","Contratación directa","Prestación de servicios profesionales y de apoyo a la gestión, o para la ejecución de trabajos artísticos que sólo puedan encomendarse a determinadas personas naturales","PRESTAR SERVICIOS PROFESIONALES PARA REALIZAR ACUERDOS QUE GENEREN CIRCULOS O ESPACIOS PRODUCTIVOS E INICIATIVAS PARA LA FORMALIZACION DE LOS VENDEDORES INFORMALES EN RAFAEL URIBE URIBE EN EL MARCO DEL PROYECTO DE INVERSIÓN 1681.","Inversión","Un nuevo contrato social y ambiental para la Bogotá del Siglo XXI",45,{"$f":"IF(ISERROR(VLOOKUP(K244,Proposito_programa!$C$2:$E$59,2,FALSE)),\" \",VLOOKUP(K244,Proposito_programa!$C$2:$E$59,2,FALSE))","v":"Espacio público más seguro y construido colectivamente"},{"$f":"IF(ISERROR(VLOOKUP(K244,Proposito_programa!$C$2:$E$59,3,FALSE)),\" \",VLOOKUP(K244,Proposito_programa!$C$2:$E$59,3,FALSE))","v":"Propósito 3: Inspirar confianza y legitimidad para vivir sin miedo y ser epicentro de cultura ciudadana, paz y reconciliación"},"O23011603450000001681",1,1032369925," YURY VIVIANA REYES BENITEZ","Persona Natural",null,null,null,null,57200000,null,1,5026667,62226667,51826667,"2022-01-28","2022-02-02","2023-01-30",330,1,29,null,null,null,null,"Terminado",0.83286908167522455]
[234,2022,"FDLRUU-CD-234-2022","https://Community.seCop.gov.Co/PubliC/Tendering/OpportunityDetail/Index?notiCeUID=CO1.NTC.2787744&isFromPubliCArea=True&isModal=False","Contratos de prestación de servicios profesionales y de apoyo a la gestión","Contratación directa","Prestación de servicios profesionales y de apoyo a la gestión, o para la ejecución de trabajos artísticos que sólo puedan encomendarse a determinadas personas naturales","\tPRESTAR LOS SERVICIOS PROFESIONALES PARA LA OPERACIÓN, SEGUIMIENTO Y CUMPLIMIENTO DE LOS PROCESOS Y PROCEDIMIENTOS DEL SERVICIO APOYO ECONÓMICO TIPO C, REQUERIDOS PARA EL OPORTUNO Y ADECUADO REGISTRO, CRUCE Y REPORTE DE LOS DATOS EN EL SISTEMA MISIONAL SIRBE, QUE CONTRIBUYAN A LA GARANTÍA DE LOS DERECHOS DE LA POBLACIÓN MAYOR EN EL MARCO DE LA POLÍTICA PÚBLICA SOCIAL PARA EL ENVEJECIMIENTO Y LA VEJEZ EN EL DISTRITO CAPITAL A CARGO DE LA ALCALDÍA LOCAL.","Inversión","Un nuevo contrato social y ambiental para la Bogotá del Siglo XXI",1,{"$f":"IF(ISERROR(VLOOKUP(K245,Proposito_programa!$C$2:$E$59,2,FALSE)),\" \",VLOOKUP(K245,Proposito_programa!$C$2:$E$59,2,FALSE))","v":"Subsidios y transferencias para la equidad"},{"$f":"IF(ISERROR(VLOOKUP(K245,Proposito_programa!$C$2:$E$59,3,FALSE)),\" \",VLOOKUP(K245,Proposito_programa!$C$2:$E$59,3,FALSE))","v":"Propósito 1: Hacer un nuevo contrato social para incrementar la inclusión social, productiva y política"},"O23011601010000001636",1,1022408760,"NORMAN DANIEL BLANCO CABRA","Persona Natural",null,null,null,null,59400000,null,1,5400000,64800000,{"$f":"21600000+AL245","v":54000000},"2022-01-28","2022-02-01","2023-01-30",330,1,30,1007885325,"AVINADAD MONTAÑO MORA ","2022-08-01",32400000,"Terminado",0.83333333333333337]
[235,2022,"FDLRUU-CD-235-2022","https://Community.seCop.gov.Co/PubliC/Tendering/OpportunityDetail/Index?notiCeUID=CO1.NTC.2807611&isFromPubliCArea=True&isModal=False","Contratos de prestación de servicios profesionales y de apoyo a la gestión","Contratación directa","Prestación de servicios profesionales y de apoyo a la gestión, o para la ejecución de trabajos artísticos que sólo puedan encomendarse a determinadas personas naturales","\tPRESTAR LOS SERVICIOS PROFESIONALES PARA LA OPERACIÓN, SEGUIMIENTO Y CUMPLIMIENTO E LOS PROCESOS Y PROCEDIMIENTOS DEL SERVICIO APOYO ECONÓMICO TIPO C, REQUERIDOS PARA EL OPORTUNO Y ADECUADO REGISTRO, CRUCE Y REPORTE DE LOS DATOS EN EL SISTEMA MISIONAL SIRBE, QUE CONTRIBUYAN A LA GARANTÍA DE LOS DERECHOS DE LA POBLACIÓN MAYOR EN EL MARCO DE LA POLÍTICA PÚBLICA SOCIAL PARA EL ENVEJECIMIENTO Y LA VEJEZ EN EL DISTRITO CAPITAL A CARGO DE LA ALCALDÍA LOCAL.","Inversión","Un nuevo contrato social y ambiental para la Bogotá del Siglo XXI",1,{"$f":"IF(ISERROR(VLOOKUP(K246,Proposito_programa!$C$2:$E$59,2,FALSE)),\" \",VLOOKUP(K246,Proposito_programa!$C$2:$E$59,2,FALSE))","v":"Subsidios y transferencias para la equidad"},{"$f":"IF(ISERROR(VLOOKUP(K246,Proposito_programa!$C$2:$E$59,3,FALSE)),\" \",VLOOKUP(K246,Proposito_programa!$C$2:$E$59,3,FALSE))","v":"Propósito 1: Hacer un nuevo contrato social para incrementar la inclusión social, productiva y política"},"O23011601010000001636",1,52114709,"LEIDY AGATHA ROSSIASCO VELASQUEZ","Persona Natural",null,null,null,null,59400000,null,1,3960000,63360000,52560000,"2022-01-28","2022-02-09","2023-01-26",330,1,22,null,null,null,null,"Terminacion Anticipada",0.82954545454545459]
[236,2022,"FDLRUU-CD-236-2022","https://Community.seCop.gov.Co/PubliC/Tendering/OpportunityDetail/Index?notiCeUID=CO1.NTC.2768817&isFromPubliCArea=True&isModal=False","Contratos de prestación de servicios profesionales y de apoyo a la gestión","Contratación directa","Prestación de servicios profesionales y de apoyo a la gestión, o para la ejecución de trabajos artísticos que sólo puedan encomendarse a determinadas personas naturales","PRESTAR LOS SERVICIOS PROFESIONALES AL DESPACHO EN EL SEGUIMIENTO E IMPLEMENTACION DE POLITICAS PUBLICAS DISTRITALES EN LA ALCALDÍA LOCAL DE RAFAEL URIBE URIBE","Inversión","Un nuevo contrato social y ambiental para la Bogotá del Siglo XXI",57,{"$f":"IF(ISERROR(VLOOKUP(K247,Proposito_programa!$C$2:$E$59,2,FALSE)),\" \",VLOOKUP(K247,Proposito_programa!$C$2:$E$59,2,FALSE))","v":"Gestión pública local"},{"$f":"IF(ISERROR(VLOOKUP(K247,Proposito_programa!$C$2:$E$59,3,FALSE)),\" \",VLOOKUP(K247,Proposito_programa!$C$2:$E$59,3,FALSE))","v":"Propósito 5: Construir Bogotá - Región con gobierno abierto, transparente y ciudadanía consciente"},"O23011605570000001697",1,1010232623,"RONALD ESTEBAN PAEZ MUÑOZ","Persona Natural",null,null,null,null,42240000,null,1,21120000,63360000,63360000,"2022-01-28","2022-02-01","2022-10-31",180,1,90,null,null,null,null,"Terminado",1]
[237,2022,"FDLRUU-CD-237-2022","https://Community.seCop.gov.Co/PubliC/Tendering/OpportunityDetail/Index?notiCeUID=CO1.NTC.2779959&isFromPubliCArea=True&isModal=False","Contratos de prestación de servicios profesionales y de apoyo a la gestión","Contratación directa","Prestación de servicios profesionales y de apoyo a la gestión, o para la ejecución de trabajos artísticos que sólo puedan encomendarse a determinadas personas naturales","\tAPOYAR TÉCNICAMENTE LAS DISTINTAS ETAPAS DE LOS PROCESOS DE COMPETENCIA DE LASINSPECCIONES DE POLICÍA DE LA LOCALIDAD, SEGÚN REPARTO.","Inversión","Un nuevo contrato social y ambiental para la Bogotá del Siglo XXI",57,{"$f":"IF(ISERROR(VLOOKUP(K248,Proposito_programa!$C$2:$E$59,2,FALSE)),\" \",VLOOKUP(K248,Proposito_programa!$C$2:$E$59,2,FALSE))","v":"Gestión pública local"},{"$f":"IF(ISERROR(VLOOKUP(K248,Proposito_programa!$C$2:$E$59,3,FALSE)),\" \",VLOOKUP(K248,Proposito_programa!$C$2:$E$59,3,FALSE))","v":"Propósito 5: Construir Bogotá - Región con gobierno abierto, transparente y ciudadanía consciente"},"O23011605570000001698",1,80202017,"OSCAR ARBEY ORTIZ","Persona Natural",null,null,null,null,59400000,null,null,null,59400000,54000000,"2022-01-28","2022-02-01","2022-12-31",330,null,null,null,null,null,null,"Terminado",0.90909090909090906]
[238,2022,"FDLRUU-CD-238-2022","https://Community.seCop.gov.Co/PubliC/Tendering/OpportunityDetail/Index?notiCeUID=CO1.NTC.2771075&isFromPubliCArea=True&isModal=False","Contratos de prestación de servicios profesionales y de apoyo a la gestión","Contratación directa","Prestación de servicios profesionales y de apoyo a la gestión, o para la ejecución de trabajos artísticos que sólo puedan encomendarse a determinadas personas naturales","APOYAR AL (LA) ALCALDE (SA) LOCAL EN LA PROMOCIÓN, ARTICULACIÓN, ACOMPAÑAMIENTO Y SEGUIMIENTO PARA LA ATENCIÓN Y PROTECCIÓN DE LOS ANIMALES DOMÉSTICOS Y SILVESTRES DE LA LOCALIDAD.\t","Inversión","Un nuevo contrato social y ambiental para la Bogotá del Siglo XXI",57,{"$f":"IF(ISERROR(VLOOKUP(K249,Proposito_programa!$C$2:$E$59,2,FALSE)),\" \",VLOOKUP(K249,Proposito_programa!$C$2:$E$59,2,FALSE))","v":"Gestión pública local"},{"$f":"IF(ISERROR(VLOOKUP(K249,Proposito_programa!$C$2:$E$59,3,FALSE)),\" \",VLOOKUP(K249,Proposito_programa!$C$2:$E$59,3,FALSE))","v":"Propósito 5: Construir Bogotá - Región con gobierno abierto, transparente y ciudadanía consciente"},"O23011605570000001698",1,1012347024,"Nataly Suarez Barrantes","Persona Natural",null,null,null,null,27600000,null,null,null,27600000,{"$f":"4446667+AL249","v":27600000},"2022-01-28","2022-02-01","2022-07-31",180,null,null,1136882598,"JORGE ALBERTO PATAQUIVA AMARIS","2022-07-01",23153333,"Terminado",1]
[239,2022,"FDLRUU-CD-239-2022","https://Community.seCop.gov.Co/PubliC/Tendering/OpportunityDetail/Index?notiCeUID=CO1.NTC.2777059&isFromPubliCArea=True&isModal=False","Contratos de prestación de servicios profesionales y de apoyo a la gestión","Contratación directa","Prestación de servicios profesionales y de apoyo a la gestión, o para la ejecución de trabajos artísticos que sólo puedan encomendarse a determinadas personas naturales","PRESTAR SERVICIOS PROFESIONALES EN EL ÁREA DE GESTIÓN POLICIVA JURIDICA DE LA ALCALDÍA LOCAL DE RAFAEL URIBE URIBE, PARA VIGILANCIA Y CONTROL DE LAS ZONAS DE PROTECCION AMBIENTAL, REASENTAMIENTOS, RESERVAS AMBIENTALES, HUMEDALES Y ECOSISTEMAS\t","Inversión","Un nuevo contrato social y ambiental para la Bogotá del Siglo XXI",57,{"$f":"IF(ISERROR(VLOOKUP(K250,Proposito_programa!$C$2:$E$59,2,FALSE)),\" \",VLOOKUP(K250,Proposito_programa!$C$2:$E$59,2,FALSE))","v":"Gestión pública local"},{"$f":"IF(ISERROR(VLOOKUP(K250,Proposito_programa!$C$2:$E$59,3,FALSE)),\" \",VLOOKUP(K250,Proposito_programa!$C$2:$E$59,3,FALSE))","v":"Propósito 5: Construir Bogotá - Región con gobierno abierto, transparente y ciudadanía consciente"},"O23011605570000001698",1,1033727527,"KATHERINE SAMANTHA AGUILAR ORJUELA","Persona Natural",null,null,null,null,32400000,null,1,16200000,48600000,48600000,"2022-01-28","2022-02-01","2022-10-31",180,1,90,null,null,null,null,"Terminado",1]
[240,2022,"FDLRUU-CD-240-2022","https://Community.seCop.gov.Co/PubliC/Tendering/OpportunityDetail/Index?notiCeUID=CO1.NTC.2769677&isFromPubliCArea=True&isModal=False","Contratos de prestación de servicios profesionales y de apoyo a la gestión","Contratación directa","Prestación de servicios profesionales y de apoyo a la gestión, o para la ejecución de trabajos artísticos que sólo puedan encomendarse a determinadas personas naturales","\nPRESTAR LOS SERVICIOS PROFESIONALES PARA APOYAR LA FORMULACION, EJECUCIÓN Y SEGUIMIENTO DE LOS PROYECTOS DE INVERSIÓN EN EL MARCO DEL CUMPLIMIENTO DEL PLAN DE DESARROLLO LOCAL DE LA ALCALDÍA LOCAL DE RAFAEL URIBE URIBE 2021 2024","Inversión","Un nuevo contrato social y ambiental para la Bogotá del Siglo XXI",57,{"$f":"IF(ISERROR(VLOOKUP(K251,Proposito_programa!$C$2:$E$59,2,FALSE)),\" \",VLOOKUP(K251,Proposito_programa!$C$2:$E$59,2,FALSE))","v":"Gestión pública local"},{"$f":"IF(ISERROR(VLOOKUP(K251,Proposito_programa!$C$2:$E$59,3,FALSE)),\" \",VLOOKUP(K251,Proposito_programa!$C$2:$E$59,3,FALSE))","v":"Propósito 5: Construir Bogotá - Región con gobierno abierto, transparente y ciudadanía consciente"},"O23011605570000001697",1,1022960915,"Angie Natalia Rodriguez Barajas","Persona Natural",null,null,null,null,59400000,null,1,5400000,64800000,54000000,"2022-01-28","2022-02-01","2023-01-23",330,1,30,52415797,"MAGDA ISABEL NIETO CASTRO","2022-12-30",54000000,"Terminacion Anticipada",0.83333333333333337]
[241,2022,"FDLRUU-CD-241-2022","https://Community.seCop.gov.Co/PubliC/Tendering/OpportunityDetail/Index?notiCeUID=CO1.NTC.2772555&isFromPubliCArea=True&isModal=False","Contratos de prestación de servicios profesionales y de apoyo a la gestión","Contratación directa","Prestación de servicios profesionales y de apoyo a la gestión, o para la ejecución de trabajos artísticos que sólo puedan encomendarse a determinadas personas naturales","\nPRESTAR SERVICIOS DE APOYO A LA GESTIÓN LOCAL EN LOS TEMAS DE MITIGACIÓN DEL RIESGO EN CAMPO, EN LA LOCALIDAD DE RAFAEL URIBE URIBE EN EL MARCO DEL PROYECTO 1665","Inversión","Un nuevo contrato social y ambiental para la Bogotá del Siglo XXI",30,{"$f":"IF(ISERROR(VLOOKUP(K252,Proposito_programa!$C$2:$E$59,2,FALSE)),\" \",VLOOKUP(K252,Proposito_programa!$C$2:$E$59,2,FALSE))","v":"Eficiencia en la atención de emergencias"},{"$f":"IF(ISERROR(VLOOKUP(K252,Proposito_programa!$C$2:$E$59,3,FALSE)),\" \",VLOOKUP(K252,Proposito_programa!$C$2:$E$59,3,FALSE))","v":"Propósito 2 : Cambiar Nuestros Hábitos de Vida para Reverdecer a Bogotá y Adaptarnos y Mitigar la Crisis Climática"},"O23011602300000001665",1,93340755,"WEHIMAR MARTINEZ ARIAS","Persona Natural",null,null,null,null,19800000,null,1,1800000,21600000,18000000,"2022-01-28","2022-02-01","2023-01-30",330,1,30,null,null,null,null,"Terminado",0.83333333333333337]
[242,2022,"FDLRUU-CD-241-2022","https://Community.seCop.gov.Co/PubliC/Tendering/OpportunityDetail/Index?notiCeUID=CO1.NTC.2772555&isFromPubliCArea=True&isModal=False","Contratos de prestación de servicios profesionales y de apoyo a la gestión","Contratación directa","Prestación de servicios profesionales y de apoyo a la gestión, o para la ejecución de trabajos artísticos que sólo puedan encomendarse a determinadas personas naturales","\nPRESTAR SERVICIOS DE APOYO A LA GESTIÓN LOCAL EN LOS TEMAS DE MITIGACIÓN DEL RIESGO EN CAMPO, EN LA LOCALIDAD DE RAFAEL URIBE URIBE EN EL MARCO DEL PROYECTO 1665","Inversión","Un nuevo contrato social y ambiental para la Bogotá del Siglo XXI",30,{"$f":"IF(ISERROR(VLOOKUP(K253,Proposito_programa!$C$2:$E$59,2,FALSE)),\" \",VLOOKUP(K253,Proposito_programa!$C$2:$E$59,2,FALSE))","v":"Eficiencia en la atención de emergencias"},{"$f":"IF(ISERROR(VLOOKUP(K253,Proposito_programa!$C$2:$E$59,3,FALSE)),\" \",VLOOKUP(K253,Proposito_programa!$C$2:$E$59,3,FALSE))","v":"Propósito 2 : Cambiar Nuestros Hábitos de Vida para Reverdecer a Bogotá y Adaptarnos y Mitigar la Crisis Climática"},"O23011602300000001665",1,19474634,"FELIPE ARTURO ALVARADO","Persona Natural",null,null,null,null,19800000,null,1,1800000,21600000,18000000,"2022-01-28","2022-02-01","2023-01-30",330,1,30,null,null,null,null,"Terminado",0.83333333333333337]
[243,2022,"FDLRUU-CD-241-2022","https://Community.seCop.gov.Co/PubliC/Tendering/OpportunityDetail/Index?notiCeUID=CO1.NTC.2772555&isFromPubliCArea=True&isModal=False","Contratos de prestación de servicios profesionales y de apoyo a la gestión","Contratación directa","Prestación de servicios profesionales y de apoyo a la gestión, o para la ejecución de trabajos artísticos que sólo puedan encomendarse a determinadas personas naturales","\nPRESTAR SERVICIOS DE APOYO A LA GESTIÓN LOCAL EN LOS TEMAS DE MITIGACIÓN DEL RIESGO EN CAMPO, EN LA LOCALIDAD DE RAFAEL URIBE URIBE EN EL MARCO DEL PROYECTO 1665","Inversión","Un nuevo contrato social y ambiental para la Bogotá del Siglo XXI",30,{"$f":"IF(ISERROR(VLOOKUP(K254,Proposito_programa!$C$2:$E$59,2,FALSE)),\" \",VLOOKUP(K254,Proposito_programa!$C$2:$E$59,2,FALSE))","v":"Eficiencia en la atención de emergencias"},{"$f":"IF(ISERROR(VLOOKUP(K254,Proposito_programa!$C$2:$E$59,3,FALSE)),\" \",VLOOKUP(K254,Proposito_programa!$C$2:$E$59,3,FALSE))","v":"Propósito 2 : Cambiar Nuestros Hábitos de Vida para Reverdecer a Bogotá y Adaptarnos y Mitigar la Crisis Climática"},"O23011602300000001665",1,1001271463,"JESSICA DAYANNA AVILA DAZA","Persona Natural",null,null,null,null,19800000,null,null,null,19800000,{"$f":"16200000+AL254","v":17640000},"2022-01-28","2022-02-07","2023-01-06",330,null,null,79845506,"LUIS CARLOS NOVOA VARGAS","2022-03-01",1440000,"Terminado",0.89090909090909087]
[244,2022,"FDLRUU-CD-244-2022","https://Community.seCop.gov.Co/PubliC/Tendering/OpportunityDetail/Index?notiCeUID=CO1.NTC.2773897&isFromPubliCArea=True&isModal=False","Contratos de prestación de servicios profesionales y de apoyo a la gestión","Contratación directa","Prestación de servicios profesionales y de apoyo a la gestión, o para la ejecución de trabajos artísticos que sólo puedan encomendarse a determinadas personas naturales","PRESTAR LOS SERVICIOS TECNICOS PARA DESARROLLAR ACTIVIDADES TENDIENTES A GARANTIZAR LA SALUD Y LA ATENCIÓN DE LAS EMERGENCIAS Y DESASTRES QUE SE PRESENTEN EN LA LOCALIDAD RAFAEL URIBE URIBE EN MARCO DEL PROYECTO 1665\t","Inversión","Un nuevo contrato social y ambiental para la Bogotá del Siglo XXI",30,{"$f":"IF(ISERROR(VLOOKUP(K255,Proposito_programa!$C$2:$E$59,2,FALSE)),\" \",VLOOKUP(K255,Proposito_programa!$C$2:$E$59,2,FALSE))","v":"Eficiencia en la atención de emergencias"},{"$f":"IF(ISERROR(VLOOKUP(K255,Proposito_programa!$C$2:$E$59,3,FALSE)),\" \",VLOOKUP(K255,Proposito_programa!$C$2:$E$59,3,FALSE))","v":"Propósito 2 : Cambiar Nuestros Hábitos de Vida para Reverdecer a Bogotá y Adaptarnos y Mitigar la Crisis Climática"},"O23011602300000001665",1,1023895485,"MARTIN ANDRES SANABRIA ESCOBAR","Persona Natural",null,null,null,null,30250000,null,1,2750000,33000000,27500000,"2022-01-28","2022-02-01","2023-01-30",330,1,30,null,null,null,null,"Terminado",0.83333333333333337]
[245,2022,"FDLRUU-CD-245-2022","https://Community.seCop.gov.Co/PubliC/Tendering/OpportunityDetail/Index?notiCeUID=CO1.NTC.2780373&isFromPubliCArea=True&isModal=False","Contratos de prestación de servicios profesionales y de apoyo a la gestión","Contratación directa","Prestación de servicios profesionales y de apoyo a la gestión, o para la ejecución de trabajos artísticos que sólo puedan encomendarse a determinadas personas naturales","PRESTAR SERVICIOS PROFESIONALES PARA EL APOYO Y GESTIÓN INTERINSTUCIONAL CON LAS ENTIDADES DEL DISTRITO ENCARGADAS DE LA RECREACIÓN, DEPORTE Y CULTURA PARA FOCALIZAR LA OFERTA EN USUARIOS DE TRANSPORTE NO MOTORIZADOS Y EL BUEN USO DEL ESPACIO PÚBLICO EN RAFAEL URIBE URIBE.\t","Inversión","Un nuevo contrato social y ambiental para la Bogotá del Siglo XXI",45,{"$f":"IF(ISERROR(VLOOKUP(K256,Proposito_programa!$C$2:$E$59,2,FALSE)),\" \",VLOOKUP(K256,Proposito_programa!$C$2:$E$59,2,FALSE))","v":"Espacio público más seguro y construido colectivamente"},{"$f":"IF(ISERROR(VLOOKUP(K256,Proposito_programa!$C$2:$E$59,3,FALSE)),\" \",VLOOKUP(K256,Proposito_programa!$C$2:$E$59,3,FALSE))","v":"Propósito 3: Inspirar confianza y legitimidad para vivir sin miedo y ser epicentro de cultura ciudadana, paz y reconciliación"},"O23011603450000001681",1,1031134259,"LUIS EDUARDO FORERO GOMEZ","Persona Natural",null,null,null,null,57200000,null,1,5200000,62400000,{"$f":"33626666+AL256","v":49226666},"2022-01-28","2022-02-01","2023-01-30",330,1,30,53106077," DIANA CAROLINA CASTILLO MOSQUERA","2022-05-18",15600000,"Terminado",0.78888887820512821]
[246,2022,"FDLRUU-CD-246-2022","https://Community.seCop.gov.Co/PubliC/Tendering/OpportunityDetail/Index?notiCeUID=CO1.NTC.2807210&isFromPubliCArea=True&isModal=False","Contratos de prestación de servicios profesionales y de apoyo a la gestión","Contratación directa","Prestación de servicios profesionales y de apoyo a la gestión, o para la ejecución de trabajos artísticos que sólo puedan encomendarse a determinadas personas naturales","APOYAR JURÍDICAMENTE LAS ACCIONES REQUERIDAS PARA LA DEPURACIÓN DE LAS ACTUACIONES ADMINISTRATIVAS QUE CURSAN EN LA ALCALDÍA LOCAL DE RAFAEL URIBE URIBE.\t","Inversión","Un nuevo contrato social y ambiental para la Bogotá del Siglo XXI",57,{"$f":"IF(ISERROR(VLOOKUP(K257,Proposito_programa!$C$2:$E$59,2,FALSE)),\" \",VLOOKUP(K257,Proposito_programa!$C$2:$E$59,2,FALSE))","v":"Gestión pública local"},{"$f":"IF(ISERROR(VLOOKUP(K257,Proposito_programa!$C$2:$E$59,3,FALSE)),\" \",VLOOKUP(K257,Proposito_programa!$C$2:$E$59,3,FALSE))","v":"Propósito 5: Construir Bogotá - Región con gobierno abierto, transparente y ciudadanía consciente"},"O23011605570000001698",1,53118438,"DIANA CAROLINA UMAÑA OTALORA","Persona Natural",null,null,null,null,32400000,null,null,null,32400000,30240000,"2022-01-28","2022-02-04","2022-08-03",180,null,null,null,null,null,null,"Terminacion Anticipada",0.93333333333333335]
[247,2022,"FDLRUU-CD-247-2022","https://Community.seCop.gov.Co/PubliC/Tendering/OpportunityDetail/Index?notiCeUID=CO1.NTC.2815611&isFromPubliCArea=True&isModal=False","Contratos de prestación de servicios profesionales y de apoyo a la gestión","Contratación directa","Prestación de servicios profesionales y de apoyo a la gestión, o para la ejecución de trabajos artísticos que sólo puedan encomendarse a determinadas personas naturales","APOYAR AL ALCALDE LOCAL EN LA FORMULACIÓN, SEGUIMIENTO E IMPLEMENTACIÓN DE LA ESTRATEGIA LOCAL PARA LA TERMINACIÓN JURÍDICA DE LAS ACTUACIONES ADMINISTRATIVAS QUE CURSAN EN LA ALCALDÍA LOCAL\t","Inversión","Un nuevo contrato social y ambiental para la Bogotá del Siglo XXI",57,{"$f":"IF(ISERROR(VLOOKUP(K258,Proposito_programa!$C$2:$E$59,2,FALSE)),\" \",VLOOKUP(K258,Proposito_programa!$C$2:$E$59,2,FALSE))","v":"Gestión pública local"},{"$f":"IF(ISERROR(VLOOKUP(K258,Proposito_programa!$C$2:$E$59,3,FALSE)),\" \",VLOOKUP(K258,Proposito_programa!$C$2:$E$59,3,FALSE))","v":"Propósito 5: Construir Bogotá - Región con gobierno abierto, transparente y ciudadanía consciente"},"O23011605570000001698",1,53084681,"JUDY LORENA CIFUENTES SILVA","Persona Natural",null,null,null,null,42600000,null,1,21300000,63900000,63900000,"2022-01-28","2022-02-02","2022-11-01",180,1,90,null,null,null,null,"Terminado",1]
[248,2022,"FDLRUU-CD-248-2022","https://Community.seCop.gov.Co/PubliC/Tendering/OpportunityDetail/Index?notiCeUID=CO1.NTC.2788357&isFromPubliCArea=True&isModal=False","Contratos de prestación de servicios profesionales y de apoyo a la gestión","Contratación directa","Prestación de servicios profesionales y de apoyo a la gestión, o para la ejecución de trabajos artísticos que sólo puedan encomendarse a determinadas personas naturales","APOYAR LA GESTIÓN DOCUMENTAL DE LA ALCALDÍA LOCAL AL EQUIPO JURÍDICO DE DEPURACIÓN EN LAS LABORES OPERATIVAS QUE GENERA EL PROCESO DE IMPULSO DE LAS ACTUACIONES ADMINISTRATIVAS EXISTENTES EN LA ALCALDÍA LOCAL DE RAFAEL URIBE URIBE\t","Inversión","Un nuevo contrato social y ambiental para la Bogotá del Siglo XXI",57,{"$f":"IF(ISERROR(VLOOKUP(K259,Proposito_programa!$C$2:$E$59,2,FALSE)),\" \",VLOOKUP(K259,Proposito_programa!$C$2:$E$59,2,FALSE))","v":"Gestión pública local"},{"$f":"IF(ISERROR(VLOOKUP(K259,Proposito_programa!$C$2:$E$59,3,FALSE)),\" \",VLOOKUP(K259,Proposito_programa!$C$2:$E$59,3,FALSE))","v":"Propósito 5: Construir Bogotá - Región con gobierno abierto, transparente y ciudadanía consciente"},"O23011605570000001698",1,1000217055,"BRIGITTE ALEJANDRA MORALES CASTIBLANCO","Persona Natural",null,null,null,null,11280000,null,null,null,11280000,11280000,"2022-01-28","2022-01-31","2022-07-30",180,null,null,null,null,null,null,"Terminado",1]
[249,2022,"FDLRUU-CD-249-2022","https://Community.seCop.gov.Co/PubliC/Tendering/OpportunityDetail/Index?notiCeUID=CO1.NTC.2807867&isFromPubliCArea=True&isModal=False","Contratos de prestación de servicios profesionales y de apoyo a la gestión","Contratación directa","Prestación de servicios profesionales y de apoyo a la gestión, o para la ejecución de trabajos artísticos que sólo puedan encomendarse a determinadas personas naturales","PRESTAR LOS SERVICIOS PROFESIONALES APOYANDO AL FONDO DE DESARROLLO LOCAL DE RAFAEL URIBE URIBE EN EL SEGUIMIENTO DE PAGOS, ACTUALIZACIÓN, LIQUIDACIÓN Y DEPURACIÓN DE LOS CONTRATOS QUE SE ENCUENTRAN ENEjecucion Y/O OBLIGACIONES POR PAGAR DE VIGENCIAS ANTERIORES QUE SE ENCUENTRAN VIGENTES\t","Inversión","Un nuevo contrato social y ambiental para la Bogotá del Siglo XXI",57,{"$f":"IF(ISERROR(VLOOKUP(K260,Proposito_programa!$C$2:$E$59,2,FALSE)),\" \",VLOOKUP(K260,Proposito_programa!$C$2:$E$59,2,FALSE))","v":"Gestión pública local"},{"$f":"IF(ISERROR(VLOOKUP(K260,Proposito_programa!$C$2:$E$59,3,FALSE)),\" \",VLOOKUP(K260,Proposito_programa!$C$2:$E$59,3,FALSE))","v":"Propósito 5: Construir Bogotá - Región con gobierno abierto, transparente y ciudadanía consciente"},"O23011605570000001697",1,79878658,"JULIO CESAR FLOREZ MORENO","Persona Natural",null,null,null,null,32400000,null,1,16200000,48600000,48420000,"2022-01-28","2022-02-02","2022-11-01",180,1,90,null,null,null,null,"Terminado",0.99629629629629635]
[250,2022,"FDLRUU-CD-250-2022","https://Community.seCop.gov.Co/PubliC/Tendering/OpportunityDetail/Index?notiCeUID=CO1.NTC.2789427&isFromPubliCArea=True&isModal=False","Contratos de prestación de servicios profesionales y de apoyo a la gestión","Contratación directa","Prestación de servicios profesionales y de apoyo a la gestión, o para la ejecución de trabajos artísticos que sólo puedan encomendarse a determinadas personas naturales","PRESTAR LOS SERVICIOS PROFESIONALES EN EL ANÁLISIS, REVISIÓN Y TRÁMITE PARA GESTIONAR EL COBRO PERSUASIVO Y COACTIVO ASI COMO SOLICITUDES DE ENTES DE CONTROL, CORPORACIONES PÚBLICAS QUE SE LE SOLICITEN EN LA ALCALDIA LOCAL DE RAFAEL URIBE URIBE","Inversión","Un nuevo contrato social y ambiental para la Bogotá del Siglo XXI",57,{"$f":"IF(ISERROR(VLOOKUP(K261,Proposito_programa!$C$2:$E$59,2,FALSE)),\" \",VLOOKUP(K261,Proposito_programa!$C$2:$E$59,2,FALSE))","v":"Gestión pública local"},{"$f":"IF(ISERROR(VLOOKUP(K261,Proposito_programa!$C$2:$E$59,3,FALSE)),\" \",VLOOKUP(K261,Proposito_programa!$C$2:$E$59,3,FALSE))","v":"Propósito 5: Construir Bogotá - Región con gobierno abierto, transparente y ciudadanía consciente"},"O23011605570000001698",1,52207882,"PILAR JASBLEIDY CASTELLANOS ROJAS","Persona Natural",null,null,null,null,32400000,null,1,16200000,48600000,48600000,"2022-01-26","2022-02-04","2022-11-03",180,1,90,null,null,null,null,"Terminado",1]
[251,2022,"FDLRUU-CD-251-2022","https://Community.seCop.gov.Co/PubliC/Common/GoogleReCaptCha/Index?previouSURl=https%3a%2f%2fCommunity.seCop.gov.Co%2fPubliC%2fTendering%2fOpportunityDetail%2fIndex%3fnotiCeUID%3dCO1.NTC.2811192%26isFromPubliCArea%3dTrue%26isModal%3dFalse","Contratos de prestación de servicios profesionales y de apoyo a la gestión","Contratación directa","Prestación de servicios profesionales y de apoyo a la gestión, o para la ejecución de trabajos artísticos que sólo puedan encomendarse a determinadas personas naturales","APOYAR TÉCNICAMENTE LAS DISTINTAS ETAPAS DE LOS PROCESOS DE COMPETENCIA DE LASINSPECCIONES DE POLICÍA DE LA LOCALIDAD, SEGÚN REPARTO","Inversión","Un nuevo contrato social y ambiental para la Bogotá del Siglo XXI",57,{"$f":"IF(ISERROR(VLOOKUP(K262,Proposito_programa!$C$2:$E$59,2,FALSE)),\" \",VLOOKUP(K262,Proposito_programa!$C$2:$E$59,2,FALSE))","v":"Gestión pública local"},{"$f":"IF(ISERROR(VLOOKUP(K262,Proposito_programa!$C$2:$E$59,3,FALSE)),\" \",VLOOKUP(K262,Proposito_programa!$C$2:$E$59,3,FALSE))","v":"Propósito 5: Construir Bogotá - Región con gobierno abierto, transparente y ciudadanía consciente"},"O23011605570000001698",1,1000696681,"DIEGO ARMANDO MENDIVELSO MENDIVELSO","Persona Natural",null,null,null,null,32400000,null,null,null,32400000,32400000,"2022-01-28","2022-02-02","2022-08-01",180,null,null,null,null,null,null,"Terminado",1]
[252,2022,"FDLRUU-CD-252-2022","https://Community.seCop.gov.Co/PubliC/Tendering/OpportunityDetail/Index?notiCeUID=CO1.NTC.2804090&isFromPubliCArea=True&isModal=False","Contratos de prestación de servicios profesionales y de apoyo a la gestión","Contratación directa","Prestación de servicios profesionales y de apoyo a la gestión, o para la ejecución de trabajos artísticos que sólo puedan encomendarse a determinadas personas naturales","APOYAR TÉCNICAMENTE LAS DISTINTAS ETAPAS DE LOS PROCESOS DE COMPETENCIA DE LAS INSPECCIONES DE POLICÍA DE LA LOCALIDAD, SEGÚN REPARTO","Inversión","Un nuevo contrato social y ambiental para la Bogotá del Siglo XXI",57,{"$f":"IF(ISERROR(VLOOKUP(K263,Proposito_programa!$C$2:$E$59,2,FALSE)),\" \",VLOOKUP(K263,Proposito_programa!$C$2:$E$59,2,FALSE))","v":"Gestión pública local"},{"$f":"IF(ISERROR(VLOOKUP(K263,Proposito_programa!$C$2:$E$59,3,FALSE)),\" \",VLOOKUP(K263,Proposito_programa!$C$2:$E$59,3,FALSE))","v":"Propósito 5: Construir Bogotá - Región con gobierno abierto, transparente y ciudadanía consciente"},"O23011605570000001698",1,79487850,"CARLOS ALBERTO OLARTE AVILA","Persona Natural",null,null,null,null,32400000,null,1,16200000,48600000,48600000,"2022-01-28","2022-02-09","2022-11-08",180,1,90,null,null,null,null,"Terminado",1]
[253,2022,"FDLRUU-CD-253-2022","https://Community.seCop.gov.Co/PubliC/Tendering/OpportunityDetail/Index?notiCeUID=CO1.NTC.2806653&isFromPubliCArea=True&isModal=False","Contratos de prestación de servicios profesionales y de apoyo a la gestión","Contratación directa","Prestación de servicios profesionales y de apoyo a la gestión, o para la ejecución de trabajos artísticos que sólo puedan encomendarse a determinadas personas naturales","APOYAR AL EQUIPO DE PRENSA Y COMUNICACIONES DE LA ALCALDÍA LOCAL EN LA REALIZACIÓN Y PUBLICACIÓN DE CONTENIDOS DE REDES SOCIALES Y CANALES DE DIVULGACIÓN DIGITAL (SITIO WEB) DE LA ALCALDÍA LOCAL\t","Inversión","Un nuevo contrato social y ambiental para la Bogotá del Siglo XXI",57,{"$f":"IF(ISERROR(VLOOKUP(K264,Proposito_programa!$C$2:$E$59,2,FALSE)),\" \",VLOOKUP(K264,Proposito_programa!$C$2:$E$59,2,FALSE))","v":"Gestión pública local"},{"$f":"IF(ISERROR(VLOOKUP(K264,Proposito_programa!$C$2:$E$59,3,FALSE)),\" \",VLOOKUP(K264,Proposito_programa!$C$2:$E$59,3,FALSE))","v":"Propósito 5: Construir Bogotá - Región con gobierno abierto, transparente y ciudadanía consciente"},"O23011605570000001697",1,1049795509,"LAURA MELISSA GARZON MORALES","Persona Natural",null,null,null,null,32400000,null,null,null,32400000,32400000,"2022-01-28","2022-02-03","2022-08-02",180,null,null,null,null,null,null,"Terminado",1]
[254,2022,"FDLRUU-CD-254-2022","https://Community.seCop.gov.Co/PubliC/Tendering/OpportunityDetail/Index?notiCeUID=CO1.NTC.2786859&isFromPubliCArea=True&isModal=False","Contratos de prestación de servicios profesionales y de apoyo a la gestión","Contratación directa","Prestación de servicios profesionales y de apoyo a la gestión, o para la ejecución de trabajos artísticos que sólo puedan encomendarse a determinadas personas naturales","PRESTAR LOS SERVICIOS PROFESIONALES Y TECNICOS EN EL SEGUIMIENTO DE PAGOS, ACTUALIZACIÓN, LIQUIDACIÓN Y DEPURACIÓN DE LAS OBLIGACIONES POR PAGAR DE CONTRATOS DE OBRA PUBLICA E INFRAESTRUCTURA DE VIGENCIAS ANTERIORES QUE SE ENCUENTRAN VIGENTES EN EL FONDO DE DESARROLLO LOCAL DE RAFAEL URIBE URIBE\t","Inversión","Un nuevo contrato social y ambiental para la Bogotá del Siglo XXI",57,{"$f":"IF(ISERROR(VLOOKUP(K265,Proposito_programa!$C$2:$E$59,2,FALSE)),\" \",VLOOKUP(K265,Proposito_programa!$C$2:$E$59,2,FALSE))","v":"Gestión pública local"},{"$f":"IF(ISERROR(VLOOKUP(K265,Proposito_programa!$C$2:$E$59,3,FALSE)),\" \",VLOOKUP(K265,Proposito_programa!$C$2:$E$59,3,FALSE))","v":"Propósito 5: Construir Bogotá - Región con gobierno abierto, transparente y ciudadanía consciente"},"O23011605570000001697",1,79442951,"HUGO ALEXANDER PERDOMO PRIETO","Persona Natural",null,null,null,null,32400000,null,null,null,32400000,{"$f":"9720000+AL265","v":32400000},"2022-01-28","2022-02-01","2022-07-31",180,null,null,52454854,"ISADORA FERNANDEZ POSADA","2022-06-06",22680000,"Terminado",1]
[255,2022,"FDLRUU-CD-255-2022","https://Community.seCop.gov.Co/PubliC/Tendering/OpportunityDetail/Index?notiCeUID=CO1.NTC.2771646&isFromPubliCArea=True&isModal=False","Contratos de prestación de servicios profesionales y de apoyo a la gestión","Contratación directa","Prestación de servicios profesionales y de apoyo a la gestión, o para la ejecución de trabajos artísticos que sólo puedan encomendarse a determinadas personas naturales","\tAPOYAR LAS LABORES DE ENTREGA Y RECIBO DE LAS COMUNICACIONES EMITIDAS O RECIBIDAS POR LAS INSPECCIONES DE POLICÍA DE LA LOCALIDAD","Inversión","Un nuevo contrato social y ambiental para la Bogotá del Siglo XXI",57,{"$f":"IF(ISERROR(VLOOKUP(K266,Proposito_programa!$C$2:$E$59,2,FALSE)),\" \",VLOOKUP(K266,Proposito_programa!$C$2:$E$59,2,FALSE))","v":"Gestión pública local"},{"$f":"IF(ISERROR(VLOOKUP(K266,Proposito_programa!$C$2:$E$59,3,FALSE)),\" \",VLOOKUP(K266,Proposito_programa!$C$2:$E$59,3,FALSE))","v":"Propósito 5: Construir Bogotá - Región con gobierno abierto, transparente y ciudadanía consciente"},"O23011605570000001698",1,10782015,"WILLIAM ANTONIO CEBALLOS BELTRAN","Persona Natural",null,null,null,null,27500000,null,null,null,27500000,23916667,"2022-01-28","2022-02-14","2023-01-13",330,null,null,null,null,null,null,"Terminado",0.86969698181818178]
[256,2022,"FDLRUU-CD-256-2022","https://Community.seCop.gov.Co/PubliC/Tendering/OpportunityDetail/Index?notiCeUID=CO1.NTC.2811296&isFromPubliCArea=True&isModal=False","Contratos de prestación de servicios profesionales y de apoyo a la gestión","Contratación directa","Prestación de servicios profesionales y de apoyo a la gestión, o para la ejecución de trabajos artísticos que sólo puedan encomendarse a determinadas personas naturales","PRESTAR SERVICIOS TECNICOS EN EL ÁREA DE GESTIÓN DEL DESARROLLO LOCAL, COMO APOYO EN LOS PROCESOS Y PROCEDIMIENTOS ASOCIADOS CON EL PRESUPUESTO Y LA CONTABILIDAD DE LA ALCALDÍA LOCAL DE RAFAEL URIBE URIBE\t","Inversión","Un nuevo contrato social y ambiental para la Bogotá del Siglo XXI",57,{"$f":"IF(ISERROR(VLOOKUP(K267,Proposito_programa!$C$2:$E$59,2,FALSE)),\" \",VLOOKUP(K267,Proposito_programa!$C$2:$E$59,2,FALSE))","v":"Gestión pública local"},{"$f":"IF(ISERROR(VLOOKUP(K267,Proposito_programa!$C$2:$E$59,3,FALSE)),\" \",VLOOKUP(K267,Proposito_programa!$C$2:$E$59,3,FALSE))","v":"Propósito 5: Construir Bogotá - Región con gobierno abierto, transparente y ciudadanía consciente"},"O23011605570000001697",1,52856517,"ALBA MERIDA SEGURA GARCIA ","Persona Natural",null,null,null,null,44000000,null,1,3866667,47866667,39866667,"2022-01-28","2022-02-02","2023-01-30",330,1,29,null,null,null,null,"Terminado",0.8328690819438086]
[257,2022,"FDLRUU-CD-257-2022","https://Community.seCop.gov.Co/PubliC/Tendering/OpportunityDetail/Index?notiCeUID=CO1.NTC.2807414&isFromPubliCArea=True&isModal=False","Contratos de prestación de servicios profesionales y de apoyo a la gestión","Contratación directa","Prestación de servicios profesionales y de apoyo a la gestión, o para la ejecución de trabajos artísticos que sólo puedan encomendarse a determinadas personas naturales","APOYAR ADMINISTRATIVA Y ASISTENCIALMENTE A LAS INSPECCIONES DE POLICÍA DE LA LOCALIDAD DE RAFAEL URIBE URIBE","Inversión","Un nuevo contrato social y ambiental para la Bogotá del Siglo XXI",57,{"$f":"IF(ISERROR(VLOOKUP(K268,Proposito_programa!$C$2:$E$59,2,FALSE)),\" \",VLOOKUP(K268,Proposito_programa!$C$2:$E$59,2,FALSE))","v":"Gestión pública local"},{"$f":"IF(ISERROR(VLOOKUP(K268,Proposito_programa!$C$2:$E$59,3,FALSE)),\" \",VLOOKUP(K268,Proposito_programa!$C$2:$E$59,3,FALSE))","v":"Propósito 5: Construir Bogotá - Región con gobierno abierto, transparente y ciudadanía consciente"},"O23011605570000001698",1,52161937,"YENNY YOLANDA SEPULVEDA SALAZAR","Persona Natural",null,null,null,null,20680000,null,1,1817333,22497333,18737833,"2022-01-28","2022-02-02","2023-01-30",330,1,29,null,null,null,null,"Terminado",0.83289130316024573]
[258,2022,"FDLRUU-MIC-001-2022","https://community.secop.gov.co/Public/Tendering/OpportunityDetail/Index?noticeUID=CO1.NTC.2824805&isFromPublicArea=True&isModal=False","Seguro","Contratación mínima cuantia","No aplica","CONTRATACIÓN DE LA PÓLIZA DE VIDA GRUPO DE LOS EDILES DEL FONDO DE DESARROLLO LOCAL DE RAFAEL URIBE URIBE","Funcionamiento","Un nuevo contrato social y ambiental para la Bogotá del Siglo XXI","No aplica",{"$f":"IF(ISERROR(VLOOKUP(K269,Proposito_programa!$C$2:$E$59,2,FALSE)),\" \",VLOOKUP(K269,Proposito_programa!$C$2:$E$59,2,FALSE))","v":" "},{"$f":"IF(ISERROR(VLOOKUP(K269,Proposito_programa!$C$2:$E$59,3,FALSE)),\" \",VLOOKUP(K269,Proposito_programa!$C$2:$E$59,3,FALSE))","v":" "},"0212020200701030102713\n11.",null,860037013,"COMPAÑIA MUNDIAL DE SEGUROS SA","Persona Jurídica",null,null,null,null,11733821,null,null,null,11733821,11733821,"2022-02-16","2022-02-21","2023-05-07",437,null,null,null,null,null,null,"En ejecución",1]
["259",2022,"FDLRUU-MIC-02-2022","https://community.secop.gov.co/Public/Tendering/OpportunityDetail/Index?noticeUID=CO1.NTC.2908341&isFromPublicArea=True&isModal=False\n","Contratos de prestación de servicios","Contratación mínima cuantia","No aplica","REALIZAR LA RECARGA DE EXTINTORES CONTRA INCENDIO PARA LAS INSTALACIONES DEL FONDO DE DESARROLLO LOCAL DE RAFAEL URIBE","Funcionamiento","Un nuevo contrato social y ambiental para la Bogotá del Siglo XXI","No aplica",{"$f":"IF(ISERROR(VLOOKUP(K270,Proposito_programa!$C$2:$E$59,2,FALSE)),\" \",VLOOKUP(K270,Proposito_programa!$C$2:$E$59,2,FALSE))","v":" "},{"$f":"IF(ISERROR(VLOOKUP(K270,Proposito_programa!$C$2:$E$59,3,FALSE)),\" \",VLOOKUP(K270,Proposito_programa!$C$2:$E$59,3,FALSE))","v":" "},"O2120202008078711099",null,830125738,"Equipo Sermatex ltda.","Persona Jurídica",null,null,null,null,873475,null,null,null,{"$f":"+W270+X270+Z270","v":873475},873475,"2022-05-10","2022-05-27","2022-07-26",60,null,null,null,null,null,null,"Terminado",{"$f":"IF(ISERROR(AB270/AA270),\"-\",(AB270/AA270))","v":1}]
[260,2022,"FDLRUU-LP-001-2022","https://community.secop.gov.co/Public/Tendering/OpportunityDetail/Index?noticeUID=CO1.NTC.2934311&isFromPublicArea=True&isModal=False","Contratos de prestación de servicios","Licitación pública","No aplica","PRESTACION DEL SERVICIO DE VIGILANCIA Y SEGURIDAD PRIVADA INTEGRAL PERMANENTE PARA TODOS LOS BIENES MUEBLES E INMUEBLES DE PROPIEDAD DE LA ENTIDAD, Y DE LOS QUE LEGALMENTE SEA O LLEGARE A SER RESPONSABLE EL FONDO DE DESARROLLO LOCAL DE RAFAEL URIBE URIBE","Funcionamiento","Un nuevo contrato social y ambiental para la Bogotá del Siglo XXI","No aplica",{"$f":"IF(ISERROR(VLOOKUP(K271,Proposito_programa!$C$2:$E$59,2,FALSE)),\" \",VLOOKUP(K271,Proposito_programa!$C$2:$E$59,2,FALSE))","v":" "},{"$f":"IF(ISERROR(VLOOKUP(K271,Proposito_programa!$C$2:$E$59,3,FALSE)),\" \",VLOOKUP(K271,Proposito_programa!$C$2:$E$59,3,FALSE))","v":" "},"O21202020080585250",null,891502104,"COVISUR DE COLOMBIA LTDA","Persona Jurídica",null,null,null,null,675438964,null,1,50527094,725966058,405263370,"2022-06-02","2022-06-07","2023-02-23",240,1,17,null,null,null,null,"En ejecución",0.55824010714286043]
["261",2022,"FDLRUU-SAMC-001-2022","https://community.secop.gov.co/Public/Tendering/OpportunityDetail/Index?noticeUID=CO1.NTC.2943052&isFromPublicArea=True&isModal=False","Seguro","Selección abreviada","Selección abreviada por menor cuantía ","CONTRATAR LOS SEGUROS QUE AMPAREN LOS INTERESES PATRIMONIALES ACTUALES Y FUTUROS, ASÍ COMO LOS BIENES DE PROPIEDAD DEL FONDO DE DESARROLLO LOCAL DE RAFAEL URIBE URIBE, QUE ESTÉN BAJO SU RESPONSABILIDAD Y CUSTODIA Y AQUELLOS QUE SEAN ADQUIRIDOS PARA DESARROLLAR LAS FUNCIONES INHERENTES A SU ACTIVIDAD Y CUALQUIER OTRA PÓLIZA DE SEGUROS QUE REQUIERA LA ENTIDAD EN EL DESARROLLO DE SU ACTIVIDAD","Funcionamiento","Un nuevo contrato social y ambiental para la Bogotá del Siglo XXI","No aplica",{"$f":"IF(ISERROR(VLOOKUP(K272,Proposito_programa!$C$2:$E$59,2,FALSE)),\" \",VLOOKUP(K272,Proposito_programa!$C$2:$E$59,2,FALSE))","v":" "},{"$f":"IF(ISERROR(VLOOKUP(K272,Proposito_programa!$C$2:$E$59,3,FALSE)),\" \",VLOOKUP(K272,Proposito_programa!$C$2:$E$59,3,FALSE))","v":" "},"00-00-00-000-0000-1354",null,860524654,"Aseguradora Solidaria de Colombia Entidad Cooperativa","Persona Jurídica",null,null,null,null,111978863,null,null,null,111978863,108369577,"2022-06-06","2022-06-11","2023-05-29",252,null,null,null,null,null,null,"En ejecución",0.96776814924438015]
["262",2022,"FDLRUU-MIC-003 de 2022","https://community.secop.gov.co/Public/Tendering/OpportunityDetail/Index?noticeUID=CO1.NTC.2964710&isFromPublicArea=True&isModal=False","Seguro","Contratación mínima cuantia","No aplica","ADQUIRIR LOS SEGUROSOBLIGATORIOS DE ACCIDENTES DE TRÁNSITO (SOAT) Y DE AUTOMOVILES PARA LOS VEHÍCULOS QUE CONFORMAN EL PARQUE AUTOMOTOR DEL FONDO DEDESARROLLO LOCAL RAFAEL URIBE URIBE","Funcionamiento","Un nuevo contrato social y ambiental para la Bogotá del Siglo XXI","No aplica",{"$f":"IF(ISERROR(VLOOKUP(K273,Proposito_programa!$C$2:$E$59,2,FALSE)),\" \",VLOOKUP(K273,Proposito_programa!$C$2:$E$59,2,FALSE))","v":" "},{"$f":"IF(ISERROR(VLOOKUP(K273,Proposito_programa!$C$2:$E$59,3,FALSE)),\" \",VLOOKUP(K273,Proposito_programa!$C$2:$E$59,3,FALSE))","v":" "},"02-12-2022-00-7010304-71347",null,860524654,"Aseguradora Solidaria de Colombia Entidad Cooperativa","Persona Jurídica",null,null,null,null,18937351,null,null,null,18937351,18937351,"2022-06-13","2022-06-13","2023-02-18",251,null,null,null,null,null,null,"En ejecución",1]
["263",2022,"FDLRUU-MIC-005 de 2022","https://community.secop.gov.co/Public/Tendering/OpportunityDetail/Index?noticeUID=CO1.NTC.2982047&isFromPublicArea=True&isModal=False","Compraventa de bienes muebles","Contratación mínima cuantia","No aplica","ADQUISICIÓN DE ELEMENTOS DE GESTIÓN DOCUMENTAL A PRECIOS UNITARIOS FIJOS, TALES COMO CAJAS Y CARPETAS PARA LA ORGANIZACIÓN DEL ARCHIVO DEL FONDO LOCAL DE REAFAEL URIBE URIBE","Funcionamiento","Un nuevo contrato social y ambiental para la Bogotá del Siglo XXI","No aplica",{"$f":"IF(ISERROR(VLOOKUP(K274,Proposito_programa!$C$2:$E$59,2,FALSE)),\" \",VLOOKUP(K274,Proposito_programa!$C$2:$E$59,2,FALSE))","v":" "},{"$f":"IF(ISERROR(VLOOKUP(K274,Proposito_programa!$C$2:$E$59,3,FALSE)),\" \",VLOOKUP(K274,Proposito_programa!$C$2:$E$59,3,FALSE))","v":" "},"O2120201003023215307\nO2120201003023219997",1,830085106,"COMERCIALIZADORA VIMEL LTDA","Persona Jurídica",null,null,null,null,6036078,null,null,null,6036078,6031030,"2022-07-11","2022-07-11","2022-10-10",60,1,30,null,null,null,null,"Terminado",0.99916369536642835]
["263",2022,"FDLRUU-MIC-005 de 2022","https://community.secop.gov.co/Public/Tendering/OpportunityDetail/Index?noticeUID=CO1.NTC.2982047&isFromPublicArea=True&isModal=False","Compraventa de bienes muebles","Contratación mínima cuantia","No aplica","ADQUISICIÓN DE ELEMENTOS DE GESTIÓN DOCUMENTAL A PRECIOS UNITARIOS FIJOS, TALES COMO CAJAS Y CARPETAS PARA LA ORGANIZACIÓN DEL ARCHIVO DEL FONDO LOCAL DE REAFAEL URIBE URIBE","Inversión","Un nuevo contrato social y ambiental para la Bogotá del Siglo XXI",1,{"$f":"IF(ISERROR(VLOOKUP(K275,Proposito_programa!$C$2:$E$59,2,FALSE)),\" \",VLOOKUP(K275,Proposito_programa!$C$2:$E$59,2,FALSE))","v":"Subsidios y transferencias para la equidad"},{"$f":"IF(ISERROR(VLOOKUP(K275,Proposito_programa!$C$2:$E$59,3,FALSE)),\" \",VLOOKUP(K275,Proposito_programa!$C$2:$E$59,3,FALSE))","v":"Propósito 1: Hacer un nuevo contrato social para incrementar la inclusión social, productiva y política"},"O23011601010000001636",1,830085106,"COMERCIALIZADORA VIMEL LTDA","Persona Jurídica",null,null,null,null,6865000,null,null,null,6865000,6865000,"2022-07-11","2022-07-11","2022-10-10",60,1,30,null,null,null,null,"Terminado",1]
["264",2022,"FDLRUU-CD-264-2022","https://community.secop.gov.co/Public/Tendering/ContractNoticePhases/View?PPI=CO1.PPI.19418066&isFromPublicArea=True&isModal=False","Contratos de prestación de servicios profesionales y de apoyo a la gestión","Contratación directa","Prestación de servicios profesionales y de apoyo a la gestión, o para la ejecución de trabajos artísticos que sólo puedan encomendarse a determinadas personas naturales","PRESTAR SUS SERVICIOS PROFESIONALES PARA APOYAR LA GESTIÓN CONTRACTUAL EN SUS DIFERENTES ETAPAS AL ÁREA DE GESTIÓN DEL DESARROLLO DE LA ALCALDÍA LOCAL DE RAFAEL URIBE URIBE","Inversión","Un nuevo contrato social y ambiental para la Bogotá del Siglo XXI",57,{"$f":"IF(ISERROR(VLOOKUP(K276,Proposito_programa!$C$2:$E$59,2,FALSE)),\" \",VLOOKUP(K276,Proposito_programa!$C$2:$E$59,2,FALSE))","v":"Gestión pública local"},{"$f":"IF(ISERROR(VLOOKUP(K276,Proposito_programa!$C$2:$E$59,3,FALSE)),\" \",VLOOKUP(K276,Proposito_programa!$C$2:$E$59,3,FALSE))","v":"Propósito 5: Construir Bogotá - Región con gobierno abierto, transparente y ciudadanía consciente"},"O23011605570000001697",1,80020069,"MICHEL ANDRÉS SALAMANCA RAMÍREZ.","Persona Natural",null,null,null,null,32400000,null,null,null,32400000,24660000,"2022-07-12","2022-07-14","2023-01-13",180,null,null,null,null,null,null,"Terminado",0.76111111111111107]
[265,2022,"FDLRUU-SAMC-002-2022","https://community.secop.gov.co/Public/Tendering/OpportunityDetail/Index?noticeUID=CO1.NTC.2998798&isFromPublicArea=True&isModal=False","Suministro","Selección abreviada","Selección abreviada por menor cuantía ","CONTRATAR A MONTO AGOTABLE EL DIAGNÓSTICO, MANTENIMIENTO PREVENTIVO Y CORRECTIVO INCLUYENDO MANO DE OBRA Y/O SUMINISTRO DE REPUESTOS, KITS DE ELEMENTOS, LUBRICANTES, SUMINISTRO DE LLANTAS Y DESPINCHES PARA LA MAQUINARIA AMARILLA DEL FONDO DE DESARROLLO LOCAL RAFAEL URIBE URIBE","Inversión","Un nuevo contrato social y ambiental para la Bogotá del Siglo XXI",49,{"$f":"IF(ISERROR(VLOOKUP(K277,Proposito_programa!$C$2:$E$59,2,FALSE)),\" \",VLOOKUP(K277,Proposito_programa!$C$2:$E$59,2,FALSE))","v":"Movilidad segura, sostenible y accesible"},{"$f":"IF(ISERROR(VLOOKUP(K277,Proposito_programa!$C$2:$E$59,3,FALSE)),\" \",VLOOKUP(K277,Proposito_programa!$C$2:$E$59,3,FALSE))","v":"Propósito 4: Hacer de Bogotá Región un modelo de movilidad multimodal, incluyente y sostenible"},"O23011604490000001685",3,830006596,"AUTOS MONGUI SAS","Persona Jurídica",null,null,null,null,200000000,null,1,100000000,300000000,130148067,"2022-07-22","2022-07-27","2023-06-26",330,null,null,null,null,null,null,"En ejecución",0.43382689000000002]
[266,2022,"FDLRUU-CD-266-2022","https://community.secop.gov.co/Public/Tendering/ContractNoticePhases/View?PPI=CO1.PPI.19652814&isFromPublicArea=True&isModal=False\n","Contratos de prestación de servicios","Contratación directa","Cuando no exista pluralidad de oferentes en el mercado","PRESTAR EL SERVICIO DE MANTENIMIENTO PREVENTIVO Y CORRECTIVO CON BOLSA DE REPUESTOS AL ASCENSOR MARCA SCHINDLER ANDINO DE PROPIEDAD DE LA ALCALDÍA LOCAL DE RAFAEL URIBE URIBE","Funcionamiento","Un nuevo contrato social y ambiental para la Bogotá del Siglo XXI","No aplica",{"$f":"IF(ISERROR(VLOOKUP(K278,Proposito_programa!$C$2:$E$59,2,FALSE)),\" \",VLOOKUP(K278,Proposito_programa!$C$2:$E$59,2,FALSE))","v":" "},{"$f":"IF(ISERROR(VLOOKUP(K278,Proposito_programa!$C$2:$E$59,3,FALSE)),\" \",VLOOKUP(K278,Proposito_programa!$C$2:$E$59,3,FALSE))","v":" "},"O2120202008078715701",1,860005289,"ASCENSORES SCHINDLER DE COLOMBIA SAS","Persona Jurídica",null,null,null,null,8000000,null,null,null,8000000,1457010,"2022-07-29","2022-08-26","2023-08-25",365,null,null,null,null,null,null,"En ejecución",0.18212624999999999]
[267,2022,"FDLRUU-CD-267-2022","https://www.contratos.gov.co/consultas/detalleProceso.do?numConstancia=22-22-39557&g-recaptcha-response=03ANYolqvb4GjUcwUULmr5xSDeJlTmdsMbNSv9-2aPjkZDM1OM-REUNcl84vAWVXoplxyl8_0bkZ9O-UIpMGbl_Ti8ZAeog5xoiIcvk62rm6Zp0vbw7ctJZLx6IsFXU7BFM4zle7J7vn4p-naJdu-iVmGKBi3Z1YTDsH005OpGvnGqu2McrORcmPK-Oo832JBik_kFIlnjkp7sqK5DVVRWd7aU8d_iB9i5uMwCeeYAI_qJtCLWQJyulzcqhxfBkMaRdDdIhEuO6FcdJSb6ubGGlupZnvhdsp55wIgQAXK9bzv9CaIFzmqIs8ufd7XTvFGbQa-FgZOYta2Z-A-D0mYczKB6o5KDBisu77gdyjs5QnFkoxLhB5TNWoy9T7gw7yoxZ-ADePNlADAf2gHt7zpIqjoUmJShRyzbMYkENoYjMLb9C8XiLxzGHI84YnsQkI-0hjwSYKwEls78toixNYVvSVkl1KKREz8q8dYScrm4w6p4KX1BHZpr_NYCqdCjR8G4AeZYNEvUcayQy6EymQDXHfa9nTy5Zc3y1A","Convenios/Contratos interadministrativos","Contratación directa","Contratos interadministrativos","Aunar esfuerzos técnicos, administrativos y financieros con el fin de desarrollar acciones articuladas entre la SCRD, el IDARTES y los Fondos de Desarrollo Local, orientadas a fomentar procesos de formación, cualificación, fortalecimiento de los agentes culturales territoriales del Distrito Capital, en el marco de la generación y circulación de bienes y servicios culturales, artísticos y patrimoniales, de conformidad con las iniciativas priorizadas y concertadas en la estrategia Distrital \"Presupuestos Participativos\" y/o de las concertaciones con los grupos de interés de las localidades y a las acciones adelantadas en el “Proceso Misional de Fomento”, de acuerdo con los proyectos a ejecutar asociados a las metas de cada localidad en el programa \"Es Cultura Local 2022\".","Inversión","Un nuevo contrato social y ambiental para la Bogotá del Siglo XXI",21,{"$f":"IF(ISERROR(VLOOKUP(K279,Proposito_programa!$C$2:$E$59,2,FALSE)),\" \",VLOOKUP(K279,Proposito_programa!$C$2:$E$59,2,FALSE))","v":"Creación y vida cotidiana: Apropiación ciudadana del arte, la cultura y el patrimonio, para la democracia cultural"},{"$f":"IF(ISERROR(VLOOKUP(K279,Proposito_programa!$C$2:$E$59,3,FALSE)),\" \",VLOOKUP(K279,Proposito_programa!$C$2:$E$59,3,FALSE))","v":"Propósito 1: Hacer un nuevo contrato social para incrementar la inclusión social, productiva y política"},"O23011601210000001647",1,900662323,"SECRETARIA DISTRITAL DE CULTURA, RECREACION Y DEPORTE SCRD ; IDARTES; LOS FDL","Persona Jurídica",null,null,null,null,1401588000,null,null,null,1401588000,1269470414,"2022-07-08","2022-07-19","2023-08-31",390,null,null,null,null,null,null,"En ejecución",0.90573721664283657]
["268",2022,"FDLRUU-CD-268-2022","https://community.secop.gov.co/Public/Tendering/ContractNoticePhases/View?PPI=CO1.PPI.19733303&isFromPublicArea=True&isModal=False\n","Contratos de prestación de servicios profesionales y de apoyo a la gestión","Contratación directa","Prestación de servicios profesionales y de apoyo a la gestión, o para la ejecución de trabajos artísticos que sólo puedan encomendarse a determinadas personas naturales","PRESTAR LOS SERVICIOS PROFESIONALES DE APOYO JURIDICO AL AREA DE GESTION POLICIVA JURIDICA DE LA ALCALDIA LOCAL DE RAFAEL URIBE URIBE EN EL DESEMPEÑO DE LAS FUNCIONES ASIGNADAS","Inversión","Un nuevo contrato social y ambiental para la Bogotá del Siglo XXI",57,{"$f":"IF(ISERROR(VLOOKUP(K280,Proposito_programa!$C$2:$E$59,2,FALSE)),\" \",VLOOKUP(K280,Proposito_programa!$C$2:$E$59,2,FALSE))","v":"Gestión pública local"},{"$f":"IF(ISERROR(VLOOKUP(K280,Proposito_programa!$C$2:$E$59,3,FALSE)),\" \",VLOOKUP(K280,Proposito_programa!$C$2:$E$59,3,FALSE))","v":"Propósito 5: Construir Bogotá - Región con gobierno abierto, transparente y ciudadanía consciente"},"O23011605570000001698",1,1020797013,"NATALIA CALDERON DIAZ","Persona Natural",null,null,null,null,38400000,null,null,null,38400000,25173333,"2022-08-01","2022-08-03","2023-02-02",180,null,null,null,null,null,null,"Terminado",0.65555554687499995]
["269",2022,"FDLRUU-CD-269-2022","https://community.secop.gov.co/Public/Tendering/ContractNoticePhases/View?PPI=CO1.PPI.19737503&isFromPublicArea=True&isModal=False\n","Contratos de prestación de servicios profesionales y de apoyo a la gestión","Contratación directa","Prestación de servicios profesionales y de apoyo a la gestión, o para la ejecución de trabajos artísticos que sólo puedan encomendarse a determinadas personas naturales","PRESTAR LOS SERVICIOS PROFESIONALES PARA LA OPERACIÓN, SEGUIMIENTO Y CUMPLIMIENTO DE LOS PROCEDIMIENTOS ADMINISTRATIVOS, OPERATIVOS Y TÉCNICOS DEL PROYECTO ¿RETO LOCAL¿ Y LOS ASOCIADOS A LA INCLUSIÓN SOCIAL Y SEGURIDAD ECONÓMICA EN LA LOCALIDAD DE RAFAEL URIBE URIBE","Inversión","Un nuevo contrato social y ambiental para la Bogotá del Siglo XXI",1,{"$f":"IF(ISERROR(VLOOKUP(K281,Proposito_programa!$C$2:$E$59,2,FALSE)),\" \",VLOOKUP(K281,Proposito_programa!$C$2:$E$59,2,FALSE))","v":"Subsidios y transferencias para la equidad"},{"$f":"IF(ISERROR(VLOOKUP(K281,Proposito_programa!$C$2:$E$59,3,FALSE)),\" \",VLOOKUP(K281,Proposito_programa!$C$2:$E$59,3,FALSE))","v":"Propósito 1: Hacer un nuevo contrato social para incrementar la inclusión social, productiva y política"},"O23011601010000002213",1,52848590,"JULY ANGELICA MELO QUINTERO","Persona Natural",null,null,null,null,28800000,null,null,null,28800000,18560000,"2022-08-02","2022-08-05","2023-02-04",180,null,null,null,null,null,null,"Terminado",0.64444444444444449]
[270,2022,"FDLRUU-CD-270-2022","https://community.secop.gov.co/Public/Tendering/ContractNoticePhases/View?PPI=CO1.PPI.19738082&isFromPublicArea=True&isModal=False\n","Contratos de prestación de servicios profesionales y de apoyo a la gestión","Contratación directa","Prestación de servicios profesionales y de apoyo a la gestión, o para la ejecución de trabajos artísticos que sólo puedan encomendarse a determinadas personas naturales","PRESTAR LOS SERVICIOS DE APOYO TECNICO EN LA DEPURACION DE LAS OBLIGACIONES POR PAGAR DE VIGENCIAS ANTERIORES VIGENTES EN EL FONDO DE DESARROLLO LOCAL DE RAFAEL URIBE URIBE EN EL AREA DE GESTION DE DESARROLLO LOCAL MEDIANTE EL SEGUIMIENTO A PAGOS, LA ACTUALIZACION Y DEPURACION DE LOS CONTRATOS QUE SE ENCUENTRAN EN EJECUCION.","Inversión","Un nuevo contrato social y ambiental para la Bogotá del Siglo XXI",57,{"$f":"IF(ISERROR(VLOOKUP(K282,Proposito_programa!$C$2:$E$59,2,FALSE)),\" \",VLOOKUP(K282,Proposito_programa!$C$2:$E$59,2,FALSE))","v":"Gestión pública local"},{"$f":"IF(ISERROR(VLOOKUP(K282,Proposito_programa!$C$2:$E$59,3,FALSE)),\" \",VLOOKUP(K282,Proposito_programa!$C$2:$E$59,3,FALSE))","v":"Propósito 5: Construir Bogotá - Región con gobierno abierto, transparente y ciudadanía consciente"},"O23011605570000001697",1,1018483088," JULIETH VANESSA GARCIA CARDENAS","Persona Natural",null,null,null,null,19800000,null,null,null,19800000,12980000,"2022-08-01","2022-08-03","2023-02-02",180,null,null,null,null,null,null,"Terminado",0.65555555555555556]
[271,2022,"FDLRUU-CD-271-2022","https://community.secop.gov.co/Public/Tendering/ContractNoticePhases/View?PPI=CO1.PPI.19739991&isFromPublicArea=True&isModal=False\n","Contratos de prestación de servicios profesionales y de apoyo a la gestión","Contratación directa","Prestación de servicios profesionales y de apoyo a la gestión, o para la ejecución de trabajos artísticos que sólo puedan encomendarse a determinadas personas naturales","PRESTAR SUS SERVICIOS DE APOYO ADMINISTRATIVO ASISTENCIAL AL DESPACHO DE LA ALCALDÍA LOCAL DE RAFAEL URIBE","Inversión","Un nuevo contrato social y ambiental para la Bogotá del Siglo XXI",57,{"$f":"IF(ISERROR(VLOOKUP(K283,Proposito_programa!$C$2:$E$59,2,FALSE)),\" \",VLOOKUP(K283,Proposito_programa!$C$2:$E$59,2,FALSE))","v":"Gestión pública local"},{"$f":"IF(ISERROR(VLOOKUP(K283,Proposito_programa!$C$2:$E$59,3,FALSE)),\" \",VLOOKUP(K283,Proposito_programa!$C$2:$E$59,3,FALSE))","v":"Propósito 5: Construir Bogotá - Región con gobierno abierto, transparente y ciudadanía consciente"},"O23011605570000001697",1,1014266791,"ALEJANDRA RODRIGEZ BERNAL","Persona Natural",null,null,null,null,16200000,null,null,null,16200000,10620000,"2022-08-01","2022-08-03","2023-02-02",180,null,null,null,null,null,null,"Terminado",0.65555555555555556]
[272,2022,"FDLRUU-CD-272-2022","https://community.secop.gov.co/Public/Tendering/ContractNoticePhases/View?PPI=CO1.PPI.19740490&isFromPublicArea=True&isModal=False\n","Contratos de prestación de servicios profesionales y de apoyo a la gestión","Contratación directa","Prestación de servicios profesionales y de apoyo a la gestión, o para la ejecución de trabajos artísticos que sólo puedan encomendarse a determinadas personas naturales","PRESTAR LOS SERVICIOS PROFESIONALES AL DESPACHO EN EL SEGUIMIENTO E IMPLEMENTACION DE POLITICAS PUBLICAS DISTRITALES EN LA ALCALDÍA LOCAL DE RAFAEL URIBE URIBE","Inversión","Un nuevo contrato social y ambiental para la Bogotá del Siglo XXI",57,{"$f":"IF(ISERROR(VLOOKUP(K284,Proposito_programa!$C$2:$E$59,2,FALSE)),\" \",VLOOKUP(K284,Proposito_programa!$C$2:$E$59,2,FALSE))","v":"Gestión pública local"},{"$f":"IF(ISERROR(VLOOKUP(K284,Proposito_programa!$C$2:$E$59,3,FALSE)),\" \",VLOOKUP(K284,Proposito_programa!$C$2:$E$59,3,FALSE))","v":"Propósito 5: Construir Bogotá - Región con gobierno abierto, transparente y ciudadanía consciente"},"O23011605570000001697",1,80442207,"LEONARDO GUERRA RAMIREZ","Persona Natural",null,null,null,null,35200000,null,1,6805333,42005333,27925333,"2022-08-01","2022-08-02","2023-01-05",150,1,29,null,null,null,null,"Terminacion Anticipada",0.66480446661379877]
[273,2022,"FDLRUU-CD-273-2022","https://community.secop.gov.co/Public/Tendering/ContractNoticePhases/View?PPI=CO1.PPI.19757161&isFromPublicArea=True&isModal=False\n","Contratos de prestación de servicios profesionales y de apoyo a la gestión","Contratación directa","Prestación de servicios profesionales y de apoyo a la gestión, o para la ejecución de trabajos artísticos que sólo puedan encomendarse a determinadas personas naturales","PRESTAR SERVICIOS PROFESIONALES ESPECIALIZADOS EN EL ÁREA DE GESTIÓN DEL DESARROLLO LOCAL PARA EL APOYO AL SEGUIMIENTO DE LA EJECUCIÓN DE LOS PROYECTOS DE INVERSIÓN DESTINADOS A LA INTERVENCIÓN DE INFRAESTRUCTURA DE LA LOCALIDAD DE RAFAEL URIBE URIBE.","Inversión","Un nuevo contrato social y ambiental para la Bogotá del Siglo XXI",57,{"$f":"IF(ISERROR(VLOOKUP(K285,Proposito_programa!$C$2:$E$59,2,FALSE)),\" \",VLOOKUP(K285,Proposito_programa!$C$2:$E$59,2,FALSE))","v":"Gestión pública local"},{"$f":"IF(ISERROR(VLOOKUP(K285,Proposito_programa!$C$2:$E$59,3,FALSE)),\" \",VLOOKUP(K285,Proposito_programa!$C$2:$E$59,3,FALSE))","v":"Propósito 5: Construir Bogotá - Región con gobierno abierto, transparente y ciudadanía consciente"},"O23011605570000001697",1,79594955,"HECTOR ENRIQUE ERIRA MORENO","Persona Natural",null,null,null,null,35500000,null,null,null,35500000,26270000,"2022-08-02","2022-08-03","2023-01-08",150,null,null,null,null,null,null,"Terminado",0.74]
[274,2022,"FDLRUU-CD-274-2022","https://community.secop.gov.co/Public/Tendering/ContractNoticePhases/View?PPI=CO1.PPI.19758096&isFromPublicArea=True&isModal=False\n","Contratos de prestación de servicios profesionales y de apoyo a la gestión","Contratación directa","Prestación de servicios profesionales y de apoyo a la gestión, o para la ejecución de trabajos artísticos que sólo puedan encomendarse a determinadas personas naturales","“PRESTAR SUS SERVICIOS PROFESIONALES PARA APOYAR LAS ACTIVIDADES JURÍDICAS DE LA GESTIÓN CONTRACTUAL EN TODAS LAS MODALIDADES Y ETAPAS PRECONTRACTUAL, CONTRACTUAL Y POSTCONTRACTUAL DEL ÁREA GESTIÓN DEL DESARROLLO LOCAL DE LA ALCALDÍA LOCAL DE RAFAEL URIBE URIBE.” ","Inversión","Un nuevo contrato social y ambiental para la Bogotá del Siglo XXI",57,{"$f":"IF(ISERROR(VLOOKUP(K286,Proposito_programa!$C$2:$E$59,2,FALSE)),\" \",VLOOKUP(K286,Proposito_programa!$C$2:$E$59,2,FALSE))","v":"Gestión pública local"},{"$f":"IF(ISERROR(VLOOKUP(K286,Proposito_programa!$C$2:$E$59,3,FALSE)),\" \",VLOOKUP(K286,Proposito_programa!$C$2:$E$59,3,FALSE))","v":"Propósito 5: Construir Bogotá - Región con gobierno abierto, transparente y ciudadanía consciente"},"O23011605570000001697",1,1014223339,"LUISA FERNANDA MARTINEZ CORONADO","Persona Natural",null,null,null,null,41400000,null,null,null,41400000,27140000,"2022-08-02","2022-08-03","2023-01-22",180,null,null,null,null,null,null,"terminacion anticipada",0.65555555555555556]
[275,2022,"FDLRUU-CD-275-2022","https://community.secop.gov.co/Public/Tendering/ContractNoticePhases/View?PPI=CO1.PPI.19781036&isFromPublicArea=True&isModal=False\n","Contratos de prestación de servicios profesionales y de apoyo a la gestión","Contratación directa","Prestación de servicios profesionales y de apoyo a la gestión, o para la ejecución de trabajos artísticos que sólo puedan encomendarse a determinadas personas naturales","“PRESTAR LOS SERVICIOS PROFESIONALES PARA\nAPOYAR LA FORMULACION, EJECUCIÓN Y SEGUIMIENTO DE LOS PROYECTOS DE INVERSIÓN\nEN EL MARCO DEL CUMPLIMIENTO DEL PLAN DE DESARROLLO LOCAL DE LA ALCALDÍA\nLOCAL DE RAFAEL URIBE URIBE 2021-2024”.","Inversión","Un nuevo contrato social y ambiental para la Bogotá del Siglo XXI",57,{"$f":"IF(ISERROR(VLOOKUP(K287,Proposito_programa!$C$2:$E$59,2,FALSE)),\" \",VLOOKUP(K287,Proposito_programa!$C$2:$E$59,2,FALSE))","v":"Gestión pública local"},{"$f":"IF(ISERROR(VLOOKUP(K287,Proposito_programa!$C$2:$E$59,3,FALSE)),\" \",VLOOKUP(K287,Proposito_programa!$C$2:$E$59,3,FALSE))","v":"Propósito 5: Construir Bogotá - Región con gobierno abierto, transparente y ciudadanía consciente"},"O23011605570000001697",1,1031148147,"SINDY LORENA RODRIGUEZ PERALTA ","Persona Natural",null,null,null,null,32400000,null,null,null,32400000,20340000,"2022-08-04","2022-08-08","2023-01-23",180,null,null,null,null,null,null,"terminacion anticipada",0.62777777777777777]
[276,2022,"FDLRUU-CD-276-2022","https://community.secop.gov.co/Public/Tendering/ContractNoticePhases/View?PPI=CO1.PPI.19822436&isFromPublicArea=True&isModal=False\n","Contratos de prestación de servicios profesionales y de apoyo a la gestión","Contratación directa","Prestación de servicios profesionales y de apoyo a la gestión, o para la ejecución de trabajos artísticos que sólo puedan encomendarse a determinadas personas naturales","“PRESTAR SUS SERVICIOS PROFESIONALES EN EL APOYO, SEGUIMIENTO Y CONTROL A LOS PROCEDIMIENTOS DE LA LEY 1801 DE 2016 COMO DE LOS SISTEMAS DE INFORMACIÓN VIGENTES DISPUESTOS PARA LAS\nACTUACIONES DE POLICÍA”.","Inversión","Un nuevo contrato social y ambiental para la Bogotá del Siglo XXI",57,{"$f":"IF(ISERROR(VLOOKUP(K288,Proposito_programa!$C$2:$E$59,2,FALSE)),\" \",VLOOKUP(K288,Proposito_programa!$C$2:$E$59,2,FALSE))","v":"Gestión pública local"},{"$f":"IF(ISERROR(VLOOKUP(K288,Proposito_programa!$C$2:$E$59,3,FALSE)),\" \",VLOOKUP(K288,Proposito_programa!$C$2:$E$59,3,FALSE))","v":"Propósito 5: Construir Bogotá - Región con gobierno abierto, transparente y ciudadanía consciente"},"O23011605570000001698",1,79468775,"CARLOS FERNANDO RICO AREVALO","Persona Natural",null,null,null,null,27000000,null,null,null,27000000,20340000,"2022-08-05","2022-08-08","2023-01-07",150,null,null,null,null,null,null,"Terminado",0.7533333333333333]
[277,2022,"FDLRUU-CD-277-2022","https://community.secop.gov.co/Public/Tendering/ContractNoticePhases/View?PPI=CO1.PPI.19785970&isFromPublicArea=True&isModal=False\n","Contratos de prestación de servicios profesionales y de apoyo a la gestión","Contratación directa","Prestación de servicios profesionales y de apoyo a la gestión, o para la ejecución de trabajos artísticos que sólo puedan encomendarse a determinadas personas naturales","“PRESTAR LOS SERVICIOS PROFESIONALES A LA ALCALDÍA LOCAL DE RAFAEL URIBE URIBE, PARA LA EJECUCIÓN Y DIVULGACION DE LAS ACTIVIDADES COMUNITARIAS Y DE APOYO A LOS PROCESOS DE PARTICIPACIÓN EN EL MARCO DEL SISTEMA LOCAL Y DISTRITAL DE PARTICIPACIÓN, LAS RELACIONES INTERINSTITUCIONALES Y LA\nEJECUCIÓN DE LOS PROYECTOS QUE HACEN PARTE DEL PLAN DE DESARROLLO”","Inversión","Un nuevo contrato social y ambiental para la Bogotá del Siglo XXI",57,{"$f":"IF(ISERROR(VLOOKUP(K289,Proposito_programa!$C$2:$E$59,2,FALSE)),\" \",VLOOKUP(K289,Proposito_programa!$C$2:$E$59,2,FALSE))","v":"Gestión pública local"},{"$f":"IF(ISERROR(VLOOKUP(K289,Proposito_programa!$C$2:$E$59,3,FALSE)),\" \",VLOOKUP(K289,Proposito_programa!$C$2:$E$59,3,FALSE))","v":"Propósito 5: Construir Bogotá - Región con gobierno abierto, transparente y ciudadanía consciente"},"O23011605570000001697",1,1007885325,"AVINADAD MONTAÑO MORA ","Persona Natural",null,null,null,null,27000000,null,1,5040000,32040000,21240000,"2022-08-03","2022-08-03","2023-01-22",150,1,28,null,null,null,null,"terminacion anticipada",0.6629213483146067]
[278,2022,"FDLRUU-CD-278-2022","https://community.secop.gov.co/Public/Tendering/ContractNoticePhases/View?PPI=CO1.PPI.19791440&isFromPublicArea=True&isModal=False\n","Contratos de prestación de servicios profesionales y de apoyo a la gestión","Contratación directa","Prestación de servicios profesionales y de apoyo a la gestión, o para la ejecución de trabajos artísticos que sólo puedan encomendarse a determinadas personas naturales","COORDINAR LA ARTICULACIÓN, ASISTENCIA Y\nACOMPAÑAMIENTO DE LOS PROCESOS DE PLANEACIÓN LOCAL, PARA LA PROMOCIÓN DE\nLA PARTICIPACIÓN DE LAS MUJERES Y DE LA EQUIDAD DE GÉNERO, PARA MATERIALIZAR\nEN LA LOCALIDAD LAS ESTRATEGIAS DE TERRITORIALIZACIÓN Y TRANSVERSALIZACIÓN\nDE LA POLÍTICA PUBLICA DE MUJERES Y EQUIDAD DE GÉNERO, PPMYEG.","Inversión","Un nuevo contrato social y ambiental para la Bogotá del Siglo XXI",57,{"$f":"IF(ISERROR(VLOOKUP(K290,Proposito_programa!$C$2:$E$59,2,FALSE)),\" \",VLOOKUP(K290,Proposito_programa!$C$2:$E$59,2,FALSE))","v":"Gestión pública local"},{"$f":"IF(ISERROR(VLOOKUP(K290,Proposito_programa!$C$2:$E$59,3,FALSE)),\" \",VLOOKUP(K290,Proposito_programa!$C$2:$E$59,3,FALSE))","v":"Propósito 5: Construir Bogotá - Región con gobierno abierto, transparente y ciudadanía consciente"},"O23011605570000001697",1,52845870,"JENIFFER PAOLA GUIO VELOZA","Persona Natural",null,null,null,null,32400000,null,null,null,32400000,20880000,"2022-08-04","2022-08-05","2023-02-04",180,null,null,null,null,null,null,"Terminado",0.64444444444444449]
[279,2022,"FDLRUU-CD-279-2022","https://community.secop.gov.co/Public/Tendering/ContractNoticePhases/View?PPI=CO1.PPI.19790432&isFromPublicArea=True&isModal=False","Contratos de prestación de servicios profesionales y de apoyo a la gestión","Contratación directa","Prestación de servicios profesionales y de apoyo a la gestión, o para la ejecución de trabajos artísticos que sólo puedan encomendarse a determinadas personas naturales","PRESTAR LOS SERVICIOS PROFESIONALES PARA EL APOYO A LA EJECUCIÓN INTEGRAL DE LOS PROCESOS DE FORMULACIÓN, EVALUACIÓN Y SEGUIMIENTO DE LOS PROYECTOS DE INFRAESTRUCTURA, MALLA VIAL, ESPACIO PÚBLICO, CICLO INFRAESTRUCTURA, PUENTES, SALONES COMUNALES, MITIGACIÓN Y PARQUES DE LA LOCALIDAD DE RAFAEL URIBE URIBE","Inversión","Un nuevo contrato social y ambiental para la Bogotá del Siglo XXI",57,{"$f":"IF(ISERROR(VLOOKUP(K291,Proposito_programa!$C$2:$E$59,2,FALSE)),\" \",VLOOKUP(K291,Proposito_programa!$C$2:$E$59,2,FALSE))","v":"Gestión pública local"},{"$f":"IF(ISERROR(VLOOKUP(K291,Proposito_programa!$C$2:$E$59,3,FALSE)),\" \",VLOOKUP(K291,Proposito_programa!$C$2:$E$59,3,FALSE))","v":"Propósito 5: Construir Bogotá - Región con gobierno abierto, transparente y ciudadanía consciente"},"O23011605570000001697",1,79725057,"EDSON ROSAS ALFONSO","Persona Natural",null,null,null,null,29500000,null,1,5310000,34810000,23010000,"2022-08-03","2022-08-04","2023-01-25",150,1,27,null,null,null,null,"terminacion anticipada",0.66101694915254239]
[280,2022,"FDLRUU-CD-280-2022","https://community.secop.gov.co/Public/Tendering/ContractNoticePhases/View?PPI=CO1.PPI.19806224&isFromPublicArea=True&isModal=False","Contratos de prestación de servicios profesionales y de apoyo a la gestión","Contratación directa","Prestación de servicios profesionales y de apoyo a la gestión, o para la ejecución de trabajos artísticos que sólo puedan encomendarse a determinadas personas naturales","PRESTAR LOS SERVICIOS PROFESIONALES PARA APOYAR AL DESPACHO DEL ALCALDE LOCAL EN EL ANÁLISIS REVISIÓN, TRÁMITE Y SUSCRIPCION DE LOS ACTOS ADMINISTRATIVOS, DESPACHOS COMISORIOS TUTELAS SOLICITUDES DE ENTES DE CONTROL Y LOS CONCEPTOS JURÍDICOS QUE SE LE SOLICITEN POR PARTE DE LA ALCALDÍA LOCAL DE RAFAEL URIBE URIBE\"","Inversión","Un nuevo contrato social y ambiental para la Bogotá del Siglo XXI",57,{"$f":"IF(ISERROR(VLOOKUP(K292,Proposito_programa!$C$2:$E$59,2,FALSE)),\" \",VLOOKUP(K292,Proposito_programa!$C$2:$E$59,2,FALSE))","v":"Gestión pública local"},{"$f":"IF(ISERROR(VLOOKUP(K292,Proposito_programa!$C$2:$E$59,3,FALSE)),\" \",VLOOKUP(K292,Proposito_programa!$C$2:$E$59,3,FALSE))","v":"Propósito 5: Construir Bogotá - Región con gobierno abierto, transparente y ciudadanía consciente"},"O23011605570000001697",1,1111791373,"FELIX EDUARDO MURILLO PLATA","Persona Natural",null,null,null,null,32000000,null,null,null,32000000,23893333,"2022-08-04","2022-08-09","2023-01-08",150,null,null,null,null,null,null,"Terminado",0.74666665624999995]
[281,2022,"FDLRUU-CD-281-2022","https://community.secop.gov.co/Public/Tendering/ContractNoticePhases/View?PPI=CO1.PPI.19795764&isFromPublicArea=True&isModal=False","Contratos de prestación de servicios profesionales y de apoyo a la gestión","Contratación directa","Prestación de servicios profesionales y de apoyo a la gestión, o para la ejecución de trabajos artísticos que sólo puedan encomendarse a determinadas personas naturales","APOYAR TÉCNICAMENTE A LA ALCALDÍA LOCAL EN EL ADECUADO MANEJO DE LOS DOCUMENTOS OFICIALES, MEDIANTE LA SOCIALIZACIÓN, IMPLEMENTACIÓN, MONITOREO Y SEGUIMIENTO AL APLICATIVO ORFEO, EN LAS DIFERENTES DEPENDENCIAS, CON ÉNFASIS EN EL CDI DEL AREA DE GESTION DE DESARROLLO LOCAL.","Inversión","Un nuevo contrato social y ambiental para la Bogotá del Siglo XXI",57,{"$f":"IF(ISERROR(VLOOKUP(K293,Proposito_programa!$C$2:$E$59,2,FALSE)),\" \",VLOOKUP(K293,Proposito_programa!$C$2:$E$59,2,FALSE))","v":"Gestión pública local"},{"$f":"IF(ISERROR(VLOOKUP(K293,Proposito_programa!$C$2:$E$59,3,FALSE)),\" \",VLOOKUP(K293,Proposito_programa!$C$2:$E$59,3,FALSE))","v":"Propósito 5: Construir Bogotá - Región con gobierno abierto, transparente y ciudadanía consciente"},"O23011605570000001697",1,52832043,"NANCY BRIGITTE RUIZ BUITRAGO","Persona Natural",null,null,null,null,20400000,null,null,null,20400000,13146667,"2022-08-04","2022-08-05","2023-02-04",180,null,null,null,null,null,null,"Terminado",0.64444446078431372]
[282,2022,"FDLRUU-CD-282-2022","https://community.secop.gov.co/Public/Tendering/ContractNoticePhases/View?PPI=CO1.PPI.19815485&isFromPublicArea=True&isModal=False\n","Contratos de prestación de servicios profesionales y de apoyo a la gestión","Contratación directa","Prestación de servicios profesionales y de apoyo a la gestión, o para la ejecución de trabajos artísticos que sólo puedan encomendarse a determinadas personas naturales","PRESTAR SERVICIOS DE APOYO TECNICO AL AREA DE GESTION DE DESARROLLO LOCAL EN LA FORMULACION, EJECUCION Y SEGUIMIENTO DE LOS PROYECTOS DE INVERSION QUE FORMAN PARTE DEL PLAN DE DESARROLLO LOCAL 2021-2024 DE LA LOCALIDAD DE RAFAEL URIBE URIBE","Inversión","Un nuevo contrato social y ambiental para la Bogotá del Siglo XXI",57,{"$f":"IF(ISERROR(VLOOKUP(K294,Proposito_programa!$C$2:$E$59,2,FALSE)),\" \",VLOOKUP(K294,Proposito_programa!$C$2:$E$59,2,FALSE))","v":"Gestión pública local"},{"$f":"IF(ISERROR(VLOOKUP(K294,Proposito_programa!$C$2:$E$59,3,FALSE)),\" \",VLOOKUP(K294,Proposito_programa!$C$2:$E$59,3,FALSE))","v":"Propósito 5: Construir Bogotá - Región con gobierno abierto, transparente y ciudadanía consciente"},"O23011605570000001697",1,1019054181,"JENNY ELVIRA PRIETO OLARTE","Persona Natural",null,null,null,null,20000000,null,1,3466667,23466667,15466667,"2022-08-04","2022-08-05","2023-01-22",150,1,26,null,null,null,null,"terminacion anticipada",0.65909091393336772]
[283,2022,"FDLRUU-CD-283-2022","https://community.secop.gov.co/Public/Tendering/ContractNoticePhases/View?PPI=CO1.PPI.19816528&isFromPublicArea=True&isModal=False\n","Contratos de prestación de servicios profesionales y de apoyo a la gestión","Contratación directa","Prestación de servicios profesionales y de apoyo a la gestión, o para la ejecución de trabajos artísticos que sólo puedan encomendarse a determinadas personas naturales","PRESTAR SERVICIOS DE APOYO TECNICO AL AREA DE GESTION DE DESARROLLO LOCAL EN LA FORMULACION, EJECUCION Y SEGUIMIENTO DE LOS PROYECTOS DE INVERSION QUE FORMAN PARTE DEL PLAN DE DESARROLLO LOCAL 2021-2024 DE LA LOCALIDAD DE RAFAEL URIBE URIBE","Inversión","Un nuevo contrato social y ambiental para la Bogotá del Siglo XXI",57,{"$f":"IF(ISERROR(VLOOKUP(K295,Proposito_programa!$C$2:$E$59,2,FALSE)),\" \",VLOOKUP(K295,Proposito_programa!$C$2:$E$59,2,FALSE))","v":"Gestión pública local"},{"$f":"IF(ISERROR(VLOOKUP(K295,Proposito_programa!$C$2:$E$59,3,FALSE)),\" \",VLOOKUP(K295,Proposito_programa!$C$2:$E$59,3,FALSE))","v":"Propósito 5: Construir Bogotá - Región con gobierno abierto, transparente y ciudadanía consciente"},"O23011605570000001697",1,1033750473,"BRAYAN ANDRES MORALES CASTIBLANCO","Persona Natural",null,null,null,null,20000000,null,null,null,20000000,15066667,"2022-08-04","2022-08-08","2023-01-07",150,null,null,null,null,null,null,"Terminado",0.75333335000000001]
[284,2022,"FDLRUU-CD-284-2022","https://community.secop.gov.co/Public/Tendering/ContractNoticePhases/View?PPI=CO1.PPI.19816643&isFromPublicArea=True&isModal=False\n","Contratos de prestación de servicios profesionales y de apoyo a la gestión","Contratación directa","Prestación de servicios profesionales y de apoyo a la gestión, o para la ejecución de trabajos artísticos que sólo puedan encomendarse a determinadas personas naturales","PRESTAR LOS SERVICIOS PROFESIONALES EN EL ÁREA DE GESTIÓN DE DESARROLLO LOCAL EN EL APOYO A LA SUPERVISIÓN DE LOS CONTRATOS Y/O CONVENIOS QUE LE SEAN DESIGNADOS EN SU IMPLEMENTACIÓN Y SEGUIMIENTO EN LA LOCALIDAD DE RAFAEL URIBE URIBE.","Inversión","Un nuevo contrato social y ambiental para la Bogotá del Siglo XXI",57,{"$f":"IF(ISERROR(VLOOKUP(K296,Proposito_programa!$C$2:$E$59,2,FALSE)),\" \",VLOOKUP(K296,Proposito_programa!$C$2:$E$59,2,FALSE))","v":"Gestión pública local"},{"$f":"IF(ISERROR(VLOOKUP(K296,Proposito_programa!$C$2:$E$59,3,FALSE)),\" \",VLOOKUP(K296,Proposito_programa!$C$2:$E$59,3,FALSE))","v":"Propósito 5: Construir Bogotá - Región con gobierno abierto, transparente y ciudadanía consciente"},"O23011605570000001697",1,80372860,"EDISON ANGULO ARIAS","Persona Natural",null,null,null,null,31000000,null,1,5373333,36373333,23973333,"2022-08-04","2022-08-05","2023-01-22",150,1,26,null,null,null,null,"terminacion anticipada",0.65909090596674214]
[285,2022,"FDLRUU-CD-285-2022","https://community.secop.gov.co/Public/Tendering/ContractNoticePhases/View?PPI=CO1.PPI.19816670&isFromPublicArea=True&isModal=False\n","Contratos de prestación de servicios profesionales y de apoyo a la gestión","Contratación directa","Prestación de servicios profesionales y de apoyo a la gestión, o para la ejecución de trabajos artísticos que sólo puedan encomendarse a determinadas personas naturales","PRESTAR LOS SERVICIOS PROFESIONALES E N EL ÁREA DE GESTIÓN DE DESARROLLO LOCAL APOYANDO LA GESTIÓN, ANÁLISIS Y SEGUIMIENTO DE LA INFORMACIÓN FINANCIERA Y CONTABLE EN CUMPLIMIENTO AL MARCO NORMATIVO CONTABLE.","Inversión","Un nuevo contrato social y ambiental para la Bogotá del Siglo XXI",57,{"$f":"IF(ISERROR(VLOOKUP(K297,Proposito_programa!$C$2:$E$59,2,FALSE)),\" \",VLOOKUP(K297,Proposito_programa!$C$2:$E$59,2,FALSE))","v":"Gestión pública local"},{"$f":"IF(ISERROR(VLOOKUP(K297,Proposito_programa!$C$2:$E$59,3,FALSE)),\" \",VLOOKUP(K297,Proposito_programa!$C$2:$E$59,3,FALSE))","v":"Propósito 5: Construir Bogotá - Región con gobierno abierto, transparente y ciudadanía consciente"},"O23011605570000001697",1,1023016773,"NICOLAS MORENO SANCHEZ","Persona Natural",null,null,null,null,23000000,null,1,4140000,27140000,17326667,"2022-08-04","2022-08-08","2023-01-22",150,1,23,null,null,null,null,"terminacion anticipada",0.63841809137803984]
[286,2022,"FDLRUU-CD-286-2022","https://community.secop.gov.co/Public/Tendering/ContractNoticePhases/View?PPI=CO1.PPI.19817241&isFromPublicArea=True&isModal=False\n","Contratos de prestación de servicios profesionales y de apoyo a la gestión","Contratación directa","Prestación de servicios profesionales y de apoyo a la gestión, o para la ejecución de trabajos artísticos que sólo puedan encomendarse a determinadas personas naturales","APOYAR LA GESTIÓN DOCUMENTAL DE LA ALCALDÍA LOCAL DE RAEL URIBE URIBE PARA LA IMPLEMENTACIÓN DEL PROCESO DE VERIFICACIÓN, SOPORTE Y ACOMPAÑAMIENTO, EN EL DESARROLLO DE LAS ACTIVIDADES PROPIAS DE LOS PROCESOS Y ACTUACIONES ADMINISTRATIVAS EXISTENTES EN EL AREA DE GESTION POLICIVA Y JURIDICA.","Inversión","Un nuevo contrato social y ambiental para la Bogotá del Siglo XXI",57,{"$f":"IF(ISERROR(VLOOKUP(K298,Proposito_programa!$C$2:$E$59,2,FALSE)),\" \",VLOOKUP(K298,Proposito_programa!$C$2:$E$59,2,FALSE))","v":"Gestión pública local"},{"$f":"IF(ISERROR(VLOOKUP(K298,Proposito_programa!$C$2:$E$59,3,FALSE)),\" \",VLOOKUP(K298,Proposito_programa!$C$2:$E$59,3,FALSE))","v":"Propósito 5: Construir Bogotá - Región con gobierno abierto, transparente y ciudadanía consciente"},"O23011605570000001698",1,52828741,"NINI JOHANA VALENZUELA ROMERO","Persona Natural",null,null,null,null,17000000,null,1,2946667,19946667,13146667,"2022-08-04","2022-08-05","2023-01-30",150,1,26,null,null,null,null,"Terminado",0.65909091478791926]
[287,2022,"FDLRUU-CD-287-2022","https://community.secop.gov.co/Public/Tendering/ContractNoticePhases/View?PPI=CO1.PPI.19817760&isFromPublicArea=True&isModal=False\n","Contratos de prestación de servicios profesionales y de apoyo a la gestión","Contratación directa","Prestación de servicios profesionales y de apoyo a la gestión, o para la ejecución de trabajos artísticos que sólo puedan encomendarse a determinadas personas naturales","APOYAR LA GESTIÓN DOCUMENTAL DE LA ALCALDÍA LOCAL AL EQUIPO JURÍDICO DE DEPURACIÓN EN LAS LABORES OPERATIVAS QUE GENERA EL PROCESO DE IMPULSO DE LAS ACTUACIONES ADMINISTRATIVAS EXISTENTES EN LA ALCALDÍA LOCAL DE RAFAEL URIBE URIBE","Inversión","Un nuevo contrato social y ambiental para la Bogotá del Siglo XXI",57,{"$f":"IF(ISERROR(VLOOKUP(K299,Proposito_programa!$C$2:$E$59,2,FALSE)),\" \",VLOOKUP(K299,Proposito_programa!$C$2:$E$59,2,FALSE))","v":"Gestión pública local"},{"$f":"IF(ISERROR(VLOOKUP(K299,Proposito_programa!$C$2:$E$59,3,FALSE)),\" \",VLOOKUP(K299,Proposito_programa!$C$2:$E$59,3,FALSE))","v":"Propósito 5: Construir Bogotá - Región con gobierno abierto, transparente y ciudadanía consciente"},"O23011605570000001698",1,52959280,"ELIZABETH GARAY QUEVEDO","Persona Natural",null,null,null,null,9400000,null,null,null,9400000,{"$f":"3196000+AL299","v":7081333},"2022-08-04","2022-08-08","2023-01-07",150,null,null,1000217055,"BRIGITTE ALEJANDRA MORALES CASTIBLANCO","2022-10-10",3885333,"Terminado",0.75333329787234038]
[288,2021,"FDLRUU-SAMC-252-2021","https://community.secop.gov.co/Public/Tendering/OpportunityDetail/Index?noticeUID=CO1.NTC.2179356&isFromPublicArea=True&isModal=False\n","Suministro","Selección abreviada","Selección abreviada por menor cuantía ","CONTRATAR A MONTO AGOTABLE EL SUMINISTRO DE ELEMENTOS DE MERCHANDISING Y DEMÁS SERVICIOS REQUERIDOS PARA EL DESARROLLO LOGÍSTICO Y OPERATIVO DEL PROGRAMA RETO LOCAL JÓVENES Y ENTORNOS SEGUROS EN LA LOCALIDAD RAFAEL URIBE URIBE","Inversión","Un Nuevo Contrato Social y Ambiental para la Bogotá del Siglo XXI",1,{"$f":"IF(ISERROR(VLOOKUP(K300,Proposito_programa!$C$2:$E$59,2,FALSE)),\" \",VLOOKUP(K300,Proposito_programa!$C$2:$E$59,2,FALSE))","v":"Subsidios y transferencias para la equidad"},{"$f":"IF(ISERROR(VLOOKUP(K300,Proposito_programa!$C$2:$E$59,3,FALSE)),\" \",VLOOKUP(K300,Proposito_programa!$C$2:$E$59,3,FALSE))","v":"Propósito 1: Hacer un nuevo contrato social para incrementar la inclusión social, productiva y política"},"O23011601010000002213",20,900572437,"FUNDACION PAIS HUMANO","Persona Jurídica",null,null,null,null,0,null,null,107254653,107254653,75078257,"2021-09-13","2021-09-15","2022-10-31",360,1,47,null,null,null,null,"Terminado",0.69999999906763954]
[288,2022,"FDLRUU-CD-288-2022","https://community.secop.gov.co/Public/Tendering/ContractNoticePhases/View?PPI=CO1.PPI.19818061&isFromPublicArea=True&isModal=False\n","Contratos de prestación de servicios profesionales y de apoyo a la gestión","Contratación directa","Prestación de servicios profesionales y de apoyo a la gestión, o para la ejecución de trabajos artísticos que sólo puedan encomendarse a determinadas personas naturales","PRESTAR LOS SERVICIOS PROFESIONALES PARA EL APOYO A LA EJECUCIÓN INTEGRAL DE LOS PROCESOS DE FORMULACIÓN, EVALUACIÓN Y SEGUIMIENTO DE LOS PROYECTOS DE INFRAESTRUCTURA, MALLA VIAL, ESPACIO PÚBLICO, CICLO INFRAESTRUCTURA, PUENTES, SALONES COMUNALES, MITIGACIÓN Y PARQUES DE LA LOCALIDAD DE RAFAEL URIBE URIBE.","Inversión","Un nuevo contrato social y ambiental para la Bogotá del Siglo XXI",57,{"$f":"IF(ISERROR(VLOOKUP(K301,Proposito_programa!$C$2:$E$59,2,FALSE)),\" \",VLOOKUP(K301,Proposito_programa!$C$2:$E$59,2,FALSE))","v":"Gestión pública local"},{"$f":"IF(ISERROR(VLOOKUP(K301,Proposito_programa!$C$2:$E$59,3,FALSE)),\" \",VLOOKUP(K301,Proposito_programa!$C$2:$E$59,3,FALSE))","v":"Propósito 5: Construir Bogotá - Región con gobierno abierto, transparente y ciudadanía consciente"},"O23011605570000001697",1,52381414,"ANGELICA MARIA SANCHEZ RODRIGUEZ","Persona Natural",null,null,null,null,29500000,null,1,5113333,{"$f":"+W301+X301+Z301","v":34613333},22813333,"2022-08-04","2022-08-05","2023-01-23",150,1,26,null,null,null,null,"terminacion anticipada",0.65909090580788621]
[289,2022,"FDLRUU-CD-289-2022","https://community.secop.gov.co/Public/Tendering/ContractNoticePhases/View?PPI=CO1.PPI.19826407&isFromPublicArea=True&isModal=False\n","Contratos de prestación de servicios profesionales y de apoyo a la gestión","Contratación directa","Prestación de servicios profesionales y de apoyo a la gestión, o para la ejecución de trabajos artísticos que sólo puedan encomendarse a determinadas personas naturales","APOYAR AL (LA) ALCALDE (SA) LOCAL EN LA PROMOCIÓN, ARTICULACIÓN, ACOMPAÑAMIENTO Y SEGUIMIENTO PARA LA ATENCIÓN Y PROTECCIÓN DE LOS ANIMALES DOMÉSTICOS Y SILVESTRES DE LA LOCALIDAD","Inversión","Un nuevo contrato social y ambiental para la Bogotá del Siglo XXI",57,{"$f":"IF(ISERROR(VLOOKUP(K302,Proposito_programa!$C$2:$E$59,2,FALSE)),\" \",VLOOKUP(K302,Proposito_programa!$C$2:$E$59,2,FALSE))","v":"Gestión pública local"},{"$f":"IF(ISERROR(VLOOKUP(K302,Proposito_programa!$C$2:$E$59,3,FALSE)),\" \",VLOOKUP(K302,Proposito_programa!$C$2:$E$59,3,FALSE))","v":"Propósito 5: Construir Bogotá - Región con gobierno abierto, transparente y ciudadanía consciente"},"O23011605570000001697",1,1012347024,"NATALY SUAREZ BARRANTES","Persona Natural",null,null,null,null,24000000,null,1,4160000,28160000,17760000,"2022-08-05","2022-08-05","2023-02-04",150,1,26,null,null,null,null,"Terminado",0.63068181818181823]
[290,2022,"FDLRUU-CD-290-2022","https://community.secop.gov.co/Public/Tendering/ContractNoticePhases/View?PPI=CO1.PPI.19834203&isFromPublicArea=True&isModal=False\n","Contratos de prestación de servicios profesionales y de apoyo a la gestión","Contratación directa","Prestación de servicios profesionales y de apoyo a la gestión, o para la ejecución de trabajos artísticos que sólo puedan encomendarse a determinadas personas naturales","PRESTAR LOS SERVICIOS PROFESIONALES PARA APOYAR JURIDICAMENTE LA FORMULACION, EJECUCIÓN Y SEGUIMIENTO DE LOS PROCESOS ASOCIADOS CON LOS PROYECTOS DE INVERSIÓN DEL PLAN DE DESARROLLO LOCAL VIGENCIA 2021 - 2024.","Inversión","Un nuevo contrato social y ambiental para la Bogotá del Siglo XXI",57,{"$f":"IF(ISERROR(VLOOKUP(K303,Proposito_programa!$C$2:$E$59,2,FALSE)),\" \",VLOOKUP(K303,Proposito_programa!$C$2:$E$59,2,FALSE))","v":"Gestión pública local"},{"$f":"IF(ISERROR(VLOOKUP(K303,Proposito_programa!$C$2:$E$59,3,FALSE)),\" \",VLOOKUP(K303,Proposito_programa!$C$2:$E$59,3,FALSE))","v":"Propósito 5: Construir Bogotá - Región con gobierno abierto, transparente y ciudadanía consciente"},"O23011605570000001697",1,1010169789,"VANESSA DOMINGUEZ PALOMINO","Persona Natural",null,null,null,null,32500000,null,null,null,32500000,24483333,"2022-08-05","2022-08-08","2023-01-07",150,null,null,null,null,null,null,"Terminado",0.75333332307692302]
[291,2022,"FDLRUU-CD-291-2022","https://community.secop.gov.co/Public/Tendering/ContractNoticePhases/View?PPI=CO1.PPI.19832963&isFromPublicArea=True&isModal=False\n","Contratos de prestación de servicios profesionales y de apoyo a la gestión","Contratación directa","Prestación de servicios profesionales y de apoyo a la gestión, o para la ejecución de trabajos artísticos que sólo puedan encomendarse a determinadas personas naturales","APOYAR TÉCNICAMENTE LAS DISTINTAS ETAPAS DE LOS\nPROCESOS DE COMPETENCIA DE LA ALCALDÍA LOCAL PARA LA DEPURACIÓN DE LAS\nACTUACIONES ADMINISTRATIVAS.","Inversión","Un nuevo contrato social y ambiental para la Bogotá del Siglo XXI",57,{"$f":"IF(ISERROR(VLOOKUP(K304,Proposito_programa!$C$2:$E$59,2,FALSE)),\" \",VLOOKUP(K304,Proposito_programa!$C$2:$E$59,2,FALSE))","v":"Gestión pública local"},{"$f":"IF(ISERROR(VLOOKUP(K304,Proposito_programa!$C$2:$E$59,3,FALSE)),\" \",VLOOKUP(K304,Proposito_programa!$C$2:$E$59,3,FALSE))","v":"Propósito 5: Construir Bogotá - Región con gobierno abierto, transparente y ciudadanía consciente"},"O23011605570000001698",1,79743591,"CAMILO ANDRES ALVAREZ GACHARNA","Persona Natural",null,null,null,null,27000000,null,null,null,27000000,20160000,"2022-08-05","2022-08-09","2023-01-08",150,null,null,null,null,null,null,"Terminado",0.7466666666666667]
[292,2022,"FDLRUU-CD-292-2022","https://community.secop.gov.co/Public/Tendering/ContractNoticePhases/View?PPI=CO1.PPI.19818548&isFromPublicArea=True&isModal=False","Contratos de prestación de servicios profesionales y de apoyo a la gestión","Contratación directa","Prestación de servicios profesionales y de apoyo a la gestión, o para la ejecución de trabajos artísticos que sólo puedan encomendarse a determinadas personas naturales","“APOYAR LA FORMULACIÓN, GESTIÓN Y SEGUIMIENTO\nDE ACTIVIDADES ENFOCADAS A LA GESTIÓN AMBIENTAL EXTERNA, ENCAMINADAS A LA\nMITIGACIÓN DE LOS DIFERENTES IMPACTOS AMBIENTALES Y LA CONSERVACIÓN DE LOS\nRECURSOS NATURALES DE LA LOCALIDAD.","Inversión","Un nuevo contrato social y ambiental para la Bogotá del Siglo XXI",57,{"$f":"IF(ISERROR(VLOOKUP(K305,Proposito_programa!$C$2:$E$59,2,FALSE)),\" \",VLOOKUP(K305,Proposito_programa!$C$2:$E$59,2,FALSE))","v":"Gestión pública local"},{"$f":"IF(ISERROR(VLOOKUP(K305,Proposito_programa!$C$2:$E$59,3,FALSE)),\" \",VLOOKUP(K305,Proposito_programa!$C$2:$E$59,3,FALSE))","v":"Propósito 5: Construir Bogotá - Región con gobierno abierto, transparente y ciudadanía consciente"},"O23011605570000001697",1,52538287,"MARIBEL PEÑA PRIETO","Persona Natural",null,null,null,null,27000000,null,1,4680000,31680000,20880000,"2022-08-04","2022-08-05","2023-01-25",150,1,26,null,null,null,null,"terminacion anticipada",0.65909090909090906]
[293,2022,"FDLRUU-CD-293-2022","https://community.secop.gov.co/Public/Tendering/ContractNoticePhases/View?PPI=CO1.PPI.19840384&isFromPublicArea=True&isModal=False\n","Contratos de prestación de servicios profesionales y de apoyo a la gestión","Contratación directa","Prestación de servicios profesionales y de apoyo a la gestión, o para la ejecución de trabajos artísticos que sólo puedan encomendarse a determinadas personas naturales","PRESTAR SERVICIOS DE APOYO A LA GESTIÓN PARA EL SEGUIMIENTO DEL CUMPLIMIENTO DE LOS PROCEDIMIENTOS ADMINISTRATIVOS, OPERATIVOS Y TÉCNICOS DEL PROYECTO ¿RETO LOCAL¿ Y LOS ASOCIADOS A LA INCLUSIÓN SOCIAL Y SEGURIDAD ECONÓMICA EN LA LOCALIDAD DE RAFAEL URIBE URIBE","Inversión","Un nuevo contrato social y ambiental para la Bogotá del Siglo XXI",1,{"$f":"IF(ISERROR(VLOOKUP(K306,Proposito_programa!$C$2:$E$59,2,FALSE)),\" \",VLOOKUP(K306,Proposito_programa!$C$2:$E$59,2,FALSE))","v":"Subsidios y transferencias para la equidad"},{"$f":"IF(ISERROR(VLOOKUP(K306,Proposito_programa!$C$2:$E$59,3,FALSE)),\" \",VLOOKUP(K306,Proposito_programa!$C$2:$E$59,3,FALSE))","v":"Propósito 1: Hacer un nuevo contrato social para incrementar la inclusión social, productiva y política"},"O23011601010000002213",1,80440659,"ENRIQUE GUZMAN AYALA","Persona Natural",null,null,null,null,16800000,null,null,null,16800000,10453333,"2022-08-05","2022-08-09","2023-01-08",160,null,null,null,null,null,null,"Terminado",0.62222220238095238]
[294,2022,"FDLRUU-CD-294-2022","https://community.secop.gov.co/Public/Tendering/OpportunityDetail/Index?noticeUID=CO1.NTC.3115991&isFromPublicArea=True&isModal=False","Contratos de prestación de servicios profesionales y de apoyo a la gestión","Contratación directa","Prestación de servicios profesionales y de apoyo a la gestión, o para la ejecución de trabajos artísticos que sólo puedan encomendarse a determinadas personas naturales","PRESTAR SERVICIOS DE APOYO A LA GESTIÓN PARA EL SEGUIMIENTO DEL CUMPLIMIENTO DE LOS PROCEDIMIENTOS ADMINISTRATIVOS, OPERATIVOS Y TÉCNICOS DEL PROYECTO ¿RETO LOCAL¿ Y LOS ASOCIADOS A LA INCLUSIÓN SOCIAL Y SEGURIDAD ECONÓMICA EN LA LOCALIDAD DE RAFAEL URIBE URIBE","Inversión","Un nuevo contrato social y ambiental para la Bogotá del Siglo XXI",1,{"$f":"IF(ISERROR(VLOOKUP(K307,Proposito_programa!$C$2:$E$59,2,FALSE)),\" \",VLOOKUP(K307,Proposito_programa!$C$2:$E$59,2,FALSE))","v":"Subsidios y transferencias para la equidad"},{"$f":"IF(ISERROR(VLOOKUP(K307,Proposito_programa!$C$2:$E$59,3,FALSE)),\" \",VLOOKUP(K307,Proposito_programa!$C$2:$E$59,3,FALSE))","v":"Propósito 1: Hacer un nuevo contrato social para incrementar la inclusión social, productiva y política"},"O23011601010000002213",1,52447515,"FABIOLA ROCIO CAÑON VALASQUEZ","Persona Natural",null,null,null,null,16800000,null,null,null,16800000,10546667,"2022-08-05","2022-08-08","2023-01-07",160,null,null,null,null,null,null,"Terminado",0.62777779761904762]
[295,2022,"FDLRUU-CD-295-2022","https://community.secop.gov.co/Public/Tendering/ContractNoticePhases/View?PPI=CO1.PPI.19836687&isFromPublicArea=True&isModal=False\n","Contratos de prestación de servicios profesionales y de apoyo a la gestión","Contratación directa","Prestación de servicios profesionales y de apoyo a la gestión, o para la ejecución de trabajos artísticos que sólo puedan encomendarse a determinadas personas naturales","PRESTAR SUS SERVICIOS PROFESIONALES PARA APOYAR LAS\nACTIVIDADES JURÍDICAS DE LA GESTIÓN CONTRACTUAL EN TODAS LAS MODALIDADES Y\nETAPAS PRECONTRACTUAL, CONTRACTUAL Y POSTCONTRACTUAL DEL ÁREA GESTIÓN\nDEL DESARROLLO LOCAL DE LA ALCALDÍA LOCAL DE RAFAEL URIBE URIBE","Inversión","Un nuevo contrato social y ambiental para la Bogotá del Siglo XXI",57,{"$f":"IF(ISERROR(VLOOKUP(K308,Proposito_programa!$C$2:$E$59,2,FALSE)),\" \",VLOOKUP(K308,Proposito_programa!$C$2:$E$59,2,FALSE))","v":"Gestión pública local"},{"$f":"IF(ISERROR(VLOOKUP(K308,Proposito_programa!$C$2:$E$59,3,FALSE)),\" \",VLOOKUP(K308,Proposito_programa!$C$2:$E$59,3,FALSE))","v":"Propósito 5: Construir Bogotá - Región con gobierno abierto, transparente y ciudadanía consciente"},"O23011605570000001697",1,11225900,"JORGE ALBERTO MUÑOZ ALFONSO","Persona Natural",null,null,null,null,41400000,null,null,null,41400000,26680000,"2022-08-05","2022-08-05","2023-01-23",160,null,null,null,null,null,null,"Terminacion Anticipada",0.64444444444444449]
[296,2022,"FDLRUU-CD-296-2022","https://community.secop.gov.co/Public/Tendering/ContractNoticePhases/View?PPI=CO1.PPI.19832688&isFromPublicArea=True&isModal=False","Contratos de prestación de servicios profesionales y de apoyo a la gestión","Contratación directa","Prestación de servicios profesionales y de apoyo a la gestión, o para la ejecución de trabajos artísticos que sólo puedan encomendarse a determinadas personas naturales","PRESTAR SERVICIOS PROFESIONALES EN EL ÁREA DE GESTIÓN POLICIVA JURIDICA DE LA ALCALDÍA LOCAL DE RAFAEL URIBE URIBE, PARA VIGILANCIA Y CONTROL DE LAS ZONAS DE PROTECCION AMBIENTAL, REASENTAMIENTOS, RESERVAS AMBIENTALES, HUMEDALES Y ECOSISTEMAS.","Inversión","Un nuevo contrato social y ambiental para la Bogotá del Siglo XXI",57,{"$f":"IF(ISERROR(VLOOKUP(K309,Proposito_programa!$C$2:$E$59,2,FALSE)),\" \",VLOOKUP(K309,Proposito_programa!$C$2:$E$59,2,FALSE))","v":"Gestión pública local"},{"$f":"IF(ISERROR(VLOOKUP(K309,Proposito_programa!$C$2:$E$59,3,FALSE)),\" \",VLOOKUP(K309,Proposito_programa!$C$2:$E$59,3,FALSE))","v":"Propósito 5: Construir Bogotá - Región con gobierno abierto, transparente y ciudadanía consciente"},"O23011605570000001697",1,80283272,"JAVIER HERNANDO RIAÑO SANCHEZ","Persona Natural",null,null,null,null,27000000,null,null,null,27000000,19980000,"2022-08-05","2022-08-10","2023-01-09",150,null,null,null,null,null,null,"Terminado",0.74]
[297,2022,"FDLRUU-CD-297-2022","https://community.secop.gov.co/Public/Tendering/ContractNoticePhases/View?PPI=CO1.PPI.19836327&isFromPublicArea=True&isModal=False","Contratos de prestación de servicios profesionales y de apoyo a la gestión","Contratación directa","Prestación de servicios profesionales y de apoyo a la gestión, o para la ejecución de trabajos artísticos que sólo puedan encomendarse a determinadas personas naturales","PRESTAR LOS SERVICIOS TECNICOS COMO GESTOR COMUNITARIO EN LOS ESPACIOS DE PARTICIPACIÓN DE RAFAEL URIBE URIBE CON ENFOQUE EN LA COMUNIDAD.","Inversión","Un nuevo contrato social y ambiental para la Bogotá del Siglo XXI",57,{"$f":"IF(ISERROR(VLOOKUP(K310,Proposito_programa!$C$2:$E$59,2,FALSE)),\" \",VLOOKUP(K310,Proposito_programa!$C$2:$E$59,2,FALSE))","v":"Gestión pública local"},{"$f":"IF(ISERROR(VLOOKUP(K310,Proposito_programa!$C$2:$E$59,3,FALSE)),\" \",VLOOKUP(K310,Proposito_programa!$C$2:$E$59,3,FALSE))","v":"Propósito 5: Construir Bogotá - Región con gobierno abierto, transparente y ciudadanía consciente"},"O23011605570000001697",1,1030580846,"Kelly Johana Giraldo Marín","Persona Natural",null,null,null,null,15500000,null,null,null,15500000,{"$f":"7336667+AL310","v":11470000},"2022-08-05","2022-08-10","2023-01-09",150,null,null,1026568078,"MONICA TATIANA ARIZA ARDILA","2022-09-28",4133333,"Terminado",0.74]
[298,2022,"FDLRUU-CD-298-2022","https://community.secop.gov.co/Public/Tendering/ContractNoticePhases/View?PPI=CO1.PPI.19842883&isFromPublicArea=True&isModal=False\n","Contratos de prestación de servicios profesionales y de apoyo a la gestión","Contratación directa","Prestación de servicios profesionales y de apoyo a la gestión, o para la ejecución de trabajos artísticos que sólo puedan encomendarse a determinadas personas naturales","“APOYAR AL ÁREA DE DESARROLLO LOCAL EN EL CENTRO DE\nDOCUMENTACIÓN E INFORMACIÓN (CDI) EN EL MANEJO DE LAS COMUNICACIONES DE\nENTRADA, INTERNAS Y EXTERNAS Y EN LA ATENCIÓN A LOS CIUDADANOS EN LOS\nDIFERENTES CANALES ESTABLECIDOS POR LA ENTIDAD.”","Inversión","Un nuevo contrato social y ambiental para la Bogotá del Siglo XXI",57,{"$f":"IF(ISERROR(VLOOKUP(K311,Proposito_programa!$C$2:$E$59,2,FALSE)),\" \",VLOOKUP(K311,Proposito_programa!$C$2:$E$59,2,FALSE))","v":"Gestión pública local"},{"$f":"IF(ISERROR(VLOOKUP(K311,Proposito_programa!$C$2:$E$59,3,FALSE)),\" \",VLOOKUP(K311,Proposito_programa!$C$2:$E$59,3,FALSE))","v":"Propósito 5: Construir Bogotá - Región con gobierno abierto, transparente y ciudadanía consciente"},"O23011605570000001697",1,52458154," NIDIA CONSUELO MARROQUIN RODRIGUEZ","Persona Natural",null,null,null,null,13500000,null,null,null,13500000,10080000,"2022-08-05","2022-08-09","2023-01-08",150,null,null,null,null,null,null,"Terminado",0.7466666666666667]
[299,2022,"FDLRUU-CD-299-2022","https://community.secop.gov.co/Public/Tendering/ContractNoticePhases/View?PPI=CO1.PPI.19834697&isFromPublicArea=True&isModal=False\n","Contratos de prestación de servicios profesionales y de apoyo a la gestión","Contratación directa","Prestación de servicios profesionales y de apoyo a la gestión, o para la ejecución de trabajos artísticos que sólo puedan encomendarse a determinadas personas naturales","APOYAR AL EQUIPO DE PRENSA Y COMUNICACIONES DE LA ALCALDÍA LOCAL EN LA REALIZACIÓN Y PUBLICACIÓN DE\nCONTENIDOS DE REDES SOCIALES Y CANALES DE DIVULGACIÓN DIGITAL (SITIO WEB) DE LA ALCALDÍA LOCAL","Inversión","Un nuevo contrato social y ambiental para la Bogotá del Siglo XXI",57,{"$f":"IF(ISERROR(VLOOKUP(K312,Proposito_programa!$C$2:$E$59,2,FALSE)),\" \",VLOOKUP(K312,Proposito_programa!$C$2:$E$59,2,FALSE))","v":"Gestión pública local"},{"$f":"IF(ISERROR(VLOOKUP(K312,Proposito_programa!$C$2:$E$59,3,FALSE)),\" \",VLOOKUP(K312,Proposito_programa!$C$2:$E$59,3,FALSE))","v":"Propósito 5: Construir Bogotá - Región con gobierno abierto, transparente y ciudadanía consciente"},"O23011605570000001697",1,1049795509,"LAURA MELISSA GARZON MORALES","Persona Natural",null,null,null,null,27000000,null,1,4140000,31140000,20340000,"2022-08-05","2022-08-08","2023-01-22",150,1,23,null,null,null,null,"Terminacion Anticipada",0.65317919075144504]
[300,2021,"FDLRUU-CD-300-2021 ","https://community.secop.gov.co/Public/Tendering/OpportunityDetail/Index?noticeUID=CO1.NTC.2305010&isFromPublicArea=True&isModal=False","Contratos de prestación de servicios","Contratación directa","Cuando no exista pluralidad de oferentes en el mercado","FORMAR A LOS DIGNATARIOS Y/O CIUDADANÍA DE LAS JUNTAS DE ACCIÓN COMUNAL EN TEMAS BÁSICOS DE MANEJO DE ACCIONES COMUNALES. (DECRETO 2350 DEL 2003, ART. 32 Y LA LEY 1757 DE 2015) PARA LA MATERIALIZACIÓN DE LA INICIATIVA RUU 131 EN EL MARCO DEL PROYECTO DE INVERSIÓN 1689 PARTICIPACIÓN CIUDADANA ORGANIZADA Y SOLIDARIA EN RAFAEL URIBE URIBE.","Inversión","Un nuevo contrato social y ambiental para la Bogotá del Siglo XXI",55,{"$f":"IF(ISERROR(VLOOKUP(K313,Proposito_programa!$C$2:$E$59,2,FALSE)),\" \",VLOOKUP(K313,Proposito_programa!$C$2:$E$59,2,FALSE))","v":"Fortalecimiento de cultura ciudadana y su institucionalidad"},{"$f":"IF(ISERROR(VLOOKUP(K313,Proposito_programa!$C$2:$E$59,3,FALSE)),\" \",VLOOKUP(K313,Proposito_programa!$C$2:$E$59,3,FALSE))","v":"Propósito 5: Construir Bogotá - Región con gobierno abierto, transparente y ciudadanía consciente"},"O23011605550000001689",1,830058756,"ASOJUNTAS LRUU.","Persona Jurídica",null,null,null,null,0,null,1,51265224,51265224,0,"2021-10-12","2021-10-19","2022-03-18",150,null,null,null,null,null,null,"Terminado",0]
[300,2022,"FDLRUU-CD-300-2022","https://community.secop.gov.co/Public/Tendering/ContractNoticePhases/View?PPI=CO1.PPI.19836705&isFromPublicArea=True&isModal=False","Contratos de prestación de servicios profesionales y de apoyo a la gestión","Contratación directa","Prestación de servicios profesionales y de apoyo a la gestión, o para la ejecución de trabajos artísticos que sólo puedan encomendarse a determinadas personas naturales","APOYAR JURÍDICAMENTE LAS ACCIONES REQUERIDAS PARA LA DEPURACIÓN DE LAS ACTUACIONES ADMINISTRATIVAS QUE CURSAN EN LA ALCALDÍA LOCAL DE RAFAEL URIBE URIBE","Inversión","Un nuevo contrato social y ambiental para la Bogotá del Siglo XXI",57,{"$f":"IF(ISERROR(VLOOKUP(K314,Proposito_programa!$C$2:$E$59,2,FALSE)),\" \",VLOOKUP(K314,Proposito_programa!$C$2:$E$59,2,FALSE))","v":"Gestión pública local"},{"$f":"IF(ISERROR(VLOOKUP(K314,Proposito_programa!$C$2:$E$59,3,FALSE)),\" \",VLOOKUP(K314,Proposito_programa!$C$2:$E$59,3,FALSE))","v":"Propósito 5: Construir Bogotá - Región con gobierno abierto, transparente y ciudadanía consciente"},"O23011605570000001698",1,80881761,"arnold Ferney vasquez viracacha","Persona Natural",null,null,null,null,21600000,null,1,10800000,32400000,17280000,"2022-08-05","2022-08-05","2023-01-22",120,1,56,1030672797,"LUISA FERNANDA ROBAYO RUIZ","2022-11-11",17280000,"Terminacion Anticipada",0.53333333333333333]
[301,2022,"FDLRUU-CD-301-2022","https://community.secop.gov.co/Public/Tendering/ContractNoticePhases/View?PPI=CO1.PPI.19843806&isFromPublicArea=True&isModal=False\n","Contratos de prestación de servicios profesionales y de apoyo a la gestión","Contratación directa","Prestación de servicios profesionales y de apoyo a la gestión, o para la ejecución de trabajos artísticos que sólo puedan encomendarse a determinadas personas naturales","PRESTAR LOS SERVICIOS PROFESIONALES PARA APOYAR AL DESPACHO DE LA ALCALDÍA LOCAL DE RAFAEL URIBE URIBE EN EL DISEÑO DE ESTRATEGIAS Y EMISIÓN DE LINEAMIENTOS QUE COADYUVEN AL FORTALECIMIENTO INSTITUCIONAL ENTORNO A LAS ACTIVIDADES QUE REALIZA LA ALCALDÍA LOCAL EN SUS DIFERENTES DEPENDENCIAS","Inversión","Un nuevo contrato social y ambiental para la Bogotá del Siglo XXI",57,{"$f":"IF(ISERROR(VLOOKUP(K315,Proposito_programa!$C$2:$E$59,2,FALSE)),\" \",VLOOKUP(K315,Proposito_programa!$C$2:$E$59,2,FALSE))","v":"Gestión pública local"},{"$f":"IF(ISERROR(VLOOKUP(K315,Proposito_programa!$C$2:$E$59,3,FALSE)),\" \",VLOOKUP(K315,Proposito_programa!$C$2:$E$59,3,FALSE))","v":"Propósito 5: Construir Bogotá - Región con gobierno abierto, transparente y ciudadanía consciente"},"O23011605570000001697",1,51962597,"SOLEDAD EUGENIA ROJAS HERNADEZ","Persona Natural",null,null,null,null,35200000,null,null,null,35200000,26048000,"2022-08-05","2022-08-10","2023-01-09",150,null,null,null,null,null,null,"Terminado",0.74]
[302,2022,"FDLRUU-CD-302-2022","https://community.secop.gov.co/Public/Tendering/ContractNoticePhases/View?PPI=CO1.PPI.19843579&isFromPublicArea=True&isModal=False\n","Contratos de prestación de servicios profesionales y de apoyo a la gestión","Contratación directa","Prestación de servicios profesionales y de apoyo a la gestión, o para la ejecución de trabajos artísticos que sólo puedan encomendarse a determinadas personas naturales","PRESTAR LOS SERVICIOS PROFESIONALES Y TECNICOS EN EL\nSEGUIMIENTO DE PAGOS, ACTUALIZACIÓN, LIQUIDACIÓN Y DEPURACIÓN DE LAS\nOBLIGACIONES POR PAGAR DE CONTRATOS DE OBRA PUBLICA E INFRAESTRUCTURA DE\nVIGENCIAS ANTERIORES QUE SE ENCUENTRAN VIGENTES EN EL FONDO DE DESARROLLO\nLOCAL DE RAFAEL URIBE URIBE.","Inversión","Un nuevo contrato social y ambiental para la Bogotá del Siglo XXI",57,{"$f":"IF(ISERROR(VLOOKUP(K316,Proposito_programa!$C$2:$E$59,2,FALSE)),\" \",VLOOKUP(K316,Proposito_programa!$C$2:$E$59,2,FALSE))","v":"Gestión pública local"},{"$f":"IF(ISERROR(VLOOKUP(K316,Proposito_programa!$C$2:$E$59,3,FALSE)),\" \",VLOOKUP(K316,Proposito_programa!$C$2:$E$59,3,FALSE))","v":"Propósito 5: Construir Bogotá - Región con gobierno abierto, transparente y ciudadanía consciente"},"O23011605570000001697",1,79956583,"JORGE ANDRÉS HERNÁNDEZ TORRES","Persona Natural",null,null,null,null,27000000,null,null,null,27000000,20160000,"2022-08-05","2022-08-09","2023-01-08",150,null,null,null,null,null,null,"Terminado",0.7466666666666667]
[303,2022,"FDLRUU-CD-303-2022","https://community.secop.gov.co/Public/Tendering/ContractNoticePhases/View?PPI=CO1.PPI.19837604&isFromPublicArea=True&isModal=False\n","Contratos de prestación de servicios profesionales y de apoyo a la gestión","Contratación directa","Prestación de servicios profesionales y de apoyo a la gestión, o para la ejecución de trabajos artísticos que sólo puedan encomendarse a determinadas personas naturales","“PRESTAR LOS SERVICIOS PROFESIONALES\nPARA APOYAR EN EL ANÁLISIS REVISIÓN, TRAMITE Y SUSCRIPCIÓN DE LOS ACTOS\nADMINISTRATIVOS, DESPACHOS COMISORIOS, TUTELAS Y LOS CONCEPTOS\nJURÍDICOS QUE SE LE SOLICITEN POR PARTE DE LA ALCALDÍA LOCAL DE RAFAEL\nURIBE URIBE”","Inversión","Un nuevo contrato social y ambiental para la Bogotá del Siglo XXI",57,{"$f":"IF(ISERROR(VLOOKUP(K317,Proposito_programa!$C$2:$E$59,2,FALSE)),\" \",VLOOKUP(K317,Proposito_programa!$C$2:$E$59,2,FALSE))","v":"Gestión pública local"},{"$f":"IF(ISERROR(VLOOKUP(K317,Proposito_programa!$C$2:$E$59,3,FALSE)),\" \",VLOOKUP(K317,Proposito_programa!$C$2:$E$59,3,FALSE))","v":"Propósito 5: Construir Bogotá - Región con gobierno abierto, transparente y ciudadanía consciente"},"O23011605570000001697",1,1095800182,"LEIDY KARINA CASTILLO PUENTES","Persona Natural",null,null,null,null,29500000,null,null,null,29500000,21436667,"2022-08-05","2022-08-12","2023-01-11",150,null,null,null,null,null,null,"Terminado",0.72666667796610174]
[304,2022,"FDLRUU-CD-304-2022","https://community.secop.gov.co/Public/Tendering/ContractNoticePhases/View?PPI=CO1.PPI.19971646&isFromPublicArea=True&isModal=False\n","Contratos de prestación de servicios profesionales y de apoyo a la gestión","Contratación directa","Prestación de servicios profesionales y de apoyo a la gestión, o para la ejecución de trabajos artísticos que sólo puedan encomendarse a determinadas personas naturales","PRESTAR LOS SERVICIOS COMO OPERADOR DE MAQUINARIA AMARILLA, AL SERVICIO DE LA ADMINISTRACION LOCAL DE RAFAEL URIBE URIBE ASÍ COMO APOYAR LAS DEMÁS ACTIVIDADES QUE SE GENEREN EN EL ÁREA DE GESTIÓN DEL DESARROLLO CON RELACION AL PROYECTO EN MENCION","Inversión","Un nuevo contrato social y ambiental para la Bogotá del Siglo XXI",57,{"$f":"IF(ISERROR(VLOOKUP(K318,Proposito_programa!$C$2:$E$59,2,FALSE)),\" \",VLOOKUP(K318,Proposito_programa!$C$2:$E$59,2,FALSE))","v":"Gestión pública local"},{"$f":"IF(ISERROR(VLOOKUP(K318,Proposito_programa!$C$2:$E$59,3,FALSE)),\" \",VLOOKUP(K318,Proposito_programa!$C$2:$E$59,3,FALSE))","v":"Propósito 5: Construir Bogotá - Región con gobierno abierto, transparente y ciudadanía consciente"},"O23011605570000001697",1,80139417,"JUAN CARLOS OLEGUA HURTADO","Persona Natural",null,null,null,null,10800000,null,1,4050000,14850000,9450000,"2022-08-12","2022-08-16","2023-01-22",120,1,45,null,null,null,null,"Terminacion Anticipada",0.63636363636363635]
[306,2022,"FDLRUU-CD-306-2022","https://community.secop.gov.co/Public/Tendering/ContractNoticePhases/View?PPI=CO1.PPI.20060471&isFromPublicArea=True&isModal=False\n","Contratos de prestación de servicios profesionales y de apoyo a la gestión","Contratación directa","Prestación de servicios profesionales y de apoyo a la gestión, o para la ejecución de trabajos artísticos que sólo puedan encomendarse a determinadas personas naturales","PRESTAR SERVICIOS PROFESIONALES PARA APOYAR LA EJECUCION, GESTIÓN Y PUESTA EN MARCHA DEL PROYECTO DE INVERSIÓN 1681 CULTURA CIUDADANA Y OPTIMO USO DEL ESPACIO PÚBLICO EN LA LOCALIDAD RAFAEL URIBE","Inversión","Un nuevo contrato social y ambiental para la Bogotá del Siglo XXI",45,{"$f":"IF(ISERROR(VLOOKUP(K319,Proposito_programa!$C$2:$E$59,2,FALSE)),\" \",VLOOKUP(K319,Proposito_programa!$C$2:$E$59,2,FALSE))","v":"Espacio público más seguro y construido colectivamente"},{"$f":"IF(ISERROR(VLOOKUP(K319,Proposito_programa!$C$2:$E$59,3,FALSE)),\" \",VLOOKUP(K319,Proposito_programa!$C$2:$E$59,3,FALSE))","v":"Propósito 3: Inspirar confianza y legitimidad para vivir sin miedo y ser epicentro de cultura ciudadana, paz y reconciliación"},"O23011603450000001681",1,1022929478,"JENIFFER SANCHEZ BUSTOS","Persona Natural",null,null,null,null,27000000,null,null,null,27000000,16200000,"2022-08-18","2022-09-01","2023-01-31",150,null,null,null,null,null,null,"Terminado",0.6]
[307,2022,"FDLRUU-CD307-2022 ","https://community.secop.gov.co/Public/Tendering/ContractNoticePhases/View?PPI=CO1.PPI.20183652&isFromPublicArea=True&isModal=False\n","Convenios/Contratos interadministrativos","Contratación directa","Contratos interadministrativos","Aunar esfuerzos técnicos, administrativos, jurídicos y financieros entre la Agencia Distrital para la Educación Superior, la Ciencia y la Tecnología - Atenea y el Fondo de Desarrollo Local de Rafael uribe Uribe para la implementación de un nuevo modelo inclusivo, eficiente y flexible para el acceso y la permanencia de las y los jóvenes egresados de instituciones de educación media a programas de educación superior y posmedia.","Inversión","Un nuevo contrato social y ambiental para la Bogotá del Siglo XXI",17,{"$f":"IF(ISERROR(VLOOKUP(K320,Proposito_programa!$C$2:$E$59,2,FALSE)),\" \",VLOOKUP(K320,Proposito_programa!$C$2:$E$59,2,FALSE))","v":"Jóvenes con capacidades: Proyecto de vida para la ciudadanía, la innovación y el trabajo del siglo XXI"},{"$f":"IF(ISERROR(VLOOKUP(K320,Proposito_programa!$C$2:$E$59,3,FALSE)),\" \",VLOOKUP(K320,Proposito_programa!$C$2:$E$59,3,FALSE))","v":"Propósito 1: Hacer un nuevo contrato social para incrementar la inclusión social, productiva y política"},"O23011601170000001642",1,"901508361\n","Agencia Distrital para la Educación Superior, la Ciencia y la Tecnología \"Atenea\"","Persona Jurídica",null,null,null,null,3110586000,null,null,null,3110586000,3110586000,"2022-08-25","2022-08-25","2029-12-31",2675,null,null,null,null,null,null,"En ejecución",1]
[308,2022,"FDLRUU-CD-308-2022","https://community.secop.gov.co/Public/Tendering/ContractNoticePhases/View?PPI=CO1.PPI.20199808&isFromPublicArea=True&isModal=False","Contratos de prestación de servicios profesionales y de apoyo a la gestión","Contratación directa","Prestación de servicios profesionales y de apoyo a la gestión, o para la ejecución de trabajos artísticos que sólo puedan encomendarse a determinadas personas naturales","COORDINA, LIDERA Y ASESORA LOS PLANES Y ESTRATEGIAS DE COMUNICACIÓN INTERNA Y EXTERNA PARA LA DIVULGACIÓN DE LOS PROGRAMAS, PROYECTOS Y ACTIVIDADES DE LA ALCALDÍA LOCAL","Inversión","Un nuevo contrato social y ambiental para la Bogotá del Siglo XXI",57,{"$f":"IF(ISERROR(VLOOKUP(K321,Proposito_programa!$C$2:$E$59,2,FALSE)),\" \",VLOOKUP(K321,Proposito_programa!$C$2:$E$59,2,FALSE))","v":"Gestión pública local"},{"$f":"IF(ISERROR(VLOOKUP(K321,Proposito_programa!$C$2:$E$59,3,FALSE)),\" \",VLOOKUP(K321,Proposito_programa!$C$2:$E$59,3,FALSE))","v":"Propósito 5: Construir Bogotá - Región con gobierno abierto, transparente y ciudadanía consciente"},"O23011605570000001697",1,80821008,"CRHISTIAN ALEXIS SANDOVAL GARCIA","Persona Natural",null,null,null,null,34500000,null,null,null,34500000,20930000,"2022-08-26","2022-08-30","2023-02-18",150,null,null,null,null,null,null,"En ejecución",0.60666666666666669]
[309,2022,"FDLRUU-CD-309-2022","https://community.secop.gov.co/Public/Tendering/ContractNoticePhases/View?PPI=CO1.PPI.20284815&isFromPublicArea=True&isModal=False","Contratos de prestación de servicios profesionales y de apoyo a la gestión","Contratación directa","Prestación de servicios profesionales y de apoyo a la gestión, o para la ejecución de trabajos artísticos que sólo puedan encomendarse a determinadas personas naturales","APOYAR AL ÁREA DE DESARROLLO LOCAL EN EL CENTRO DE DOCUMENTACIÓN E INFORMACIÓN (CDI) EN EL MANEJO DE LAS COMUNICACIONES DE ENTRADA, INTERNAS Y EXTERNAS Y EN LA ATENCIÓN A LOS CIUDADANOS EN LOS DIFERENTES CANALES ESTABLECIDOS POR LA ENTIDAD","Inversión","Un nuevo contrato social y ambiental para la Bogotá del Siglo XXI",57,{"$f":"IF(ISERROR(VLOOKUP(K322,Proposito_programa!$C$2:$E$59,2,FALSE)),\" \",VLOOKUP(K322,Proposito_programa!$C$2:$E$59,2,FALSE))","v":"Gestión pública local"},{"$f":"IF(ISERROR(VLOOKUP(K322,Proposito_programa!$C$2:$E$59,3,FALSE)),\" \",VLOOKUP(K322,Proposito_programa!$C$2:$E$59,3,FALSE))","v":"Propósito 5: Construir Bogotá - Región con gobierno abierto, transparente y ciudadanía consciente"},"O23011605570000001697",1,52727810," MARIA CAROLINA HERNANDEZ POVEDA ","Persona Natural",null,null,null,null,13500000,null,null,null,13500000,7740000,"2022-08-31","2022-09-05","2023-02-04",150,null,null,null,null,null,null,"Terminado",0.57333333333333336]
[310,2021,"FDLRUU-MC-305-2021","https://community.secop.gov.co/Public/Tendering/OpportunityDetail/Index?noticeUID=CO1.NTC.2360412&isFromPublicArea=True&isModal=False\n","Suministro","Contratación mínima cuantia","No aplica","SUMINISTRO DE ELEMENTOS Y MATERIALES DE FERRETERIA EN GENERAL A MONTO AGOTABLE PARA EL MANTENIMIENTO, LAS ADECUACIONES O LAS MEJORAS DE TIPO LOCATIVO DE LOS BIENES MUEBLES E INMUEBLES DE PROPIEDAD DEL FONDO DE DESARROLLO LOCAL DE RAFAEL URIBE","Funcionamiento","Un nuevo contrato social y ambiental para la Bogotá del Siglo XXI","No aplica",{"$f":"IF(ISERROR(VLOOKUP(K323,Proposito_programa!$C$2:$E$59,2,FALSE)),\" \",VLOOKUP(K323,Proposito_programa!$C$2:$E$59,2,FALSE))","v":" "},{"$f":"IF(ISERROR(VLOOKUP(K323,Proposito_programa!$C$2:$E$59,3,FALSE)),\" \",VLOOKUP(K323,Proposito_programa!$C$2:$E$59,3,FALSE))","v":" "},"O2120202",7,901044822,"GRUPO EMPRESARIAL LCS S.A.S","Persona Jurídica",null,null,null,null,0,null,1,9000000,9000000,0,"2021-11-23","2021-11-29","2022-11-28",360,null,null,null,null,null,null,"Terminado",0]
[311,2022,"FDLRUU-CD-311-2022","https://community.secop.gov.co/Public/Tendering/ContractNoticePhases/View?PPI=CO1.PPI.20298842&isFromPublicArea=True&isModal=False","Contratos de prestación de servicios profesionales y de apoyo a la gestión","Contratación directa","Prestación de servicios profesionales y de apoyo a la gestión, o para la ejecución de trabajos artísticos que sólo puedan encomendarse a determinadas personas naturales","APOYAR JURÍDICAMENTE LAS ACCIONES REQUERIDAS PARA LA DEPURACIÓN DE LAS ACTUACIONES ADMINISTRATIVAS QUE CURSAN EN LA ALCALDÍA LOCAL DE RAFAEL URIBE URIBE","Inversión","Un nuevo contrato social y ambiental para la Bogotá del Siglo XXI",57,{"$f":"IF(ISERROR(VLOOKUP(K324,Proposito_programa!$C$2:$E$59,2,FALSE)),\" \",VLOOKUP(K324,Proposito_programa!$C$2:$E$59,2,FALSE))","v":"Gestión pública local"},{"$f":"IF(ISERROR(VLOOKUP(K324,Proposito_programa!$C$2:$E$59,3,FALSE)),\" \",VLOOKUP(K324,Proposito_programa!$C$2:$E$59,3,FALSE))","v":"Propósito 5: Construir Bogotá - Región con gobierno abierto, transparente y ciudadanía consciente"},"O23011605570000001698",1,79325616,"PEDRO JULIO ORTIZ GARAY","Persona Natural",null,null,null,null,21600000,null,null,null,21600000,15120000,"2022-08-31","2022-09-07","2023-01-06",120,null,null,null,null,null,null,"Terminado",0.7]
[312,2022,"FDLRUU-CD-312-2022","https://community.secop.gov.co/Public/Tendering/ContractNoticePhases/View?PPI=CO1.PPI.20413576&isFromPublicArea=True&isModal=False","Contratos de prestación de servicios profesionales y de apoyo a la gestión","Contratación directa","Prestación de servicios profesionales y de apoyo a la gestión, o para la ejecución de trabajos artísticos que sólo puedan encomendarse a determinadas personas naturales","APOYAR JURÍDICAMENTE LAS ACCIONES REQUERIDAS PARA LA DEPURACIÓN DE LAS ACTUACIONES ADMINISTRATIVAS QUE CURSAN EN LA ALCALDÍA LOCAL DE RAFAEL URIBE URIBE","Inversión","Un nuevo contrato social y ambiental para la Bogotá del Siglo XXI",57,{"$f":"IF(ISERROR(VLOOKUP(K325,Proposito_programa!$C$2:$E$59,2,FALSE)),\" \",VLOOKUP(K325,Proposito_programa!$C$2:$E$59,2,FALSE))","v":"Gestión pública local"},{"$f":"IF(ISERROR(VLOOKUP(K325,Proposito_programa!$C$2:$E$59,3,FALSE)),\" \",VLOOKUP(K325,Proposito_programa!$C$2:$E$59,3,FALSE))","v":"Propósito 5: Construir Bogotá - Región con gobierno abierto, transparente y ciudadanía consciente"},"O23011605570000001697",1,1030657007,"JUAN CAMILO MOLANO APONTE","Persona Natural",null,null,null,null,21600000,null,null,null,21600000,14760000,"2022-09-06","2022-09-09","2023-01-08",120,null,null,null,null,null,null,"Terminado",0.68333333333333335]
[313,2021,"FDLRUU-SAMC-306-2021","https://community.secop.gov.co/Public/Tendering/OpportunityDetail/Index?noticeUID=CO1.NTC.2401466&isFromPublicArea=True&isModal=False\n","Seguros","Selección abreviada","Selección abreviada por menor cuantía ","CONTRATAR LOS SEGUROS QUE AMPAREN LOS INTERESES PATRIMONIALES ACTUALES Y FUTUROS, ASÍ COMO LOS BIENES DE PROPIEDAD DE LA FONDO DE DESARROLLO LOCAL DE RAFAEL URIBE URIBE, QUE ESTÉN BAJO SU RESPONSABILIDAD Y CUSTODIA Y AQUELLOS QUE SEAN ADQUIRIDOS PARA DESARROLLAR LAS FUNCIONES INHERENTES A SU ACTIVIDAD Y CUALQUIER OTRA PÓLIZA DE SEGUROS QUE REQUIERA LA ENTIDAD EN EL DESARROLLO DE SU ACTIVIDAD","Funcionamiento","Un nuevo contrato social y ambiental para la Bogotá del Siglo XXI","No aplica",{"$f":"IF(ISERROR(VLOOKUP(K326,Proposito_programa!$C$2:$E$59,2,FALSE)),\" \",VLOOKUP(K326,Proposito_programa!$C$2:$E$59,2,FALSE))","v":" "},{"$f":"IF(ISERROR(VLOOKUP(K326,Proposito_programa!$C$2:$E$59,3,FALSE)),\" \",VLOOKUP(K326,Proposito_programa!$C$2:$E$59,3,FALSE))","v":" "},"O2120202",1,860524654,"ASEGURADORA SOLIDARIA DE COLOMBIA ENTIDAD COOPERATIVA ","Persona Jurídica",null,null,null,null,0,null,4,7954006,7954006,7954006,"2021-12-02","2021-12-03","2022-05-22",170,null,null,null,null,null,null,"Terminado",1]
[313,2022,"FDLRUU-CMA-001-2022","https://community.secop.gov.co/Public/Tendering/OpportunityDetail/Index?noticeUID=CO1.NTC.3126061&isFromPublicArea=True&isModal=False","Consultoría","Concurso de méritos","No aplica","REALIZAR LA ELABORACIÓN DE ESTUDIOS Y DISEÑOS PARA LA CONSTRUCCIÓN DE OBRAS CIVILES QUE PERMITAN LA MITIGACIÓN DEL RIESGO EN EL BARRIO COLINAS DE LA LOCALIDAD RAFAEL URIBE URIBE, EN BOGOTA D.C.","Operación","Un nuevo contrato social y ambiental para la Bogotá del Siglo XXI","No aplica",{"$f":"IF(ISERROR(VLOOKUP(K327,Proposito_programa!$C$2:$E$59,2,FALSE)),\" \",VLOOKUP(K327,Proposito_programa!$C$2:$E$59,2,FALSE))","v":" "},{"$f":"IF(ISERROR(VLOOKUP(K327,Proposito_programa!$C$2:$E$59,3,FALSE)),\" \",VLOOKUP(K327,Proposito_programa!$C$2:$E$59,3,FALSE))","v":" "},0,null,900411419,"ASOCIACION DE PROFESIONALES DE INGENIERIA Y SERVICIOS APIS SAS-Consultoria Barrio Colinas ","Persona Jurídica",null,null,null,null,54255399,null,null,null,54255399,0,"2022-09-12","2022-10-03","2022-12-25",30,2,38,null,null,null,null,"Terminado",0]
[314,2022,"FDLRUU-CMA-002-2022","https://community.secop.gov.co/Public/Tendering/OpportunityDetail/Index?noticeUID=CO1.NTC.3131689&isFromPublicArea=True&isModal=False","Interventoría","Concurso de méritos","No aplica","REALIZAR LA INTERVENTORÍA TÉCNICA, ADMINISTRATIVA, FINANCIERA, AMBIENTAL Y SST AL CONTRATO DE CONSULTORÍA RESULTANTE DEL CONCURSO DE MÉRITOS CUYO OBJETO ES REALIZAR LA ELABORACIÓN DE ESTUDIOS Y DISEÑOS PARA LA CONSTRUCCIÓN DE OBRAS CIVILES QUE PERMITAN LA MITIGACIÓN DEL RIESGO EN EL BARRIO COLINAS DE LA LOCALIDAD RAFAEL URIBE URIBE, EN BOGOTÁ D.C","Operación","Un nuevo contrato social y ambiental para la Bogotá del Siglo XXI","No aplica",{"$f":"IF(ISERROR(VLOOKUP(K328,Proposito_programa!$C$2:$E$59,2,FALSE)),\" \",VLOOKUP(K328,Proposito_programa!$C$2:$E$59,2,FALSE))","v":" "},{"$f":"IF(ISERROR(VLOOKUP(K328,Proposito_programa!$C$2:$E$59,3,FALSE)),\" \",VLOOKUP(K328,Proposito_programa!$C$2:$E$59,3,FALSE))","v":" "},0,null,901172605,"ICOD CONSTRUCCIONES Y PROYECTOS S.A.S -Interventoria Consultoria Barrio Colinas ","Persona Jurídica",null,null,null,null,26845945,null,null,null,26845945,0,"2022-09-12","2022-10-03","2022-12-25",30,2,38,null,null,null,null,"Terminado",0]
[315,2021,"FDLRUU-CMA-311-2021 ","https://community.secop.gov.co/Public/Tendering/OpportunityDetail/Index?noticeUID=CO1.NTC.2436890&isFromPublicArea=True&isModal=False\n","Interventoría","Concurso de méritos","No aplica","REALIZAR LA INTERVENTORIA TECNICA, ADMINISTRATIVA, FINANCIERA, AMBIENTAL Y SST AL CONTRATO DE OBRA PUBLICA RESULTANTE DEL PROCESO DE LICITACION PUBLICA No. FDLRUU-LP-288-2021, CUYO OBJETO ES EJECUTAR A PRECIOS UNITARIOS FIJOS SIN FORMULA DE REAJUSTE LA CONSTRUCCIÓN DE PARQUES VECINALES Y DE BOLSILLO, EN LA LOCALIDAD DE RAFAEL URIBE URIBE, DE CONFORMIDAD CON LOS ESTUDIOS Y DISEÑOS, ANEXOS TECNICOS Y DEMÁS DOCUMENTOS QUE HACEN PARTE INTEGRAL DEL PROCESO...","Inversión","Un nuevo contrato social y ambiental para la Bogotá del Siglo XXI",33,{"$f":"IF(ISERROR(VLOOKUP(K329,Proposito_programa!$C$2:$E$59,2,FALSE)),\" \",VLOOKUP(K329,Proposito_programa!$C$2:$E$59,2,FALSE))","v":"Más árboles y más y mejor espacio público"},{"$f":"IF(ISERROR(VLOOKUP(K329,Proposito_programa!$C$2:$E$59,3,FALSE)),\" \",VLOOKUP(K329,Proposito_programa!$C$2:$E$59,3,FALSE))","v":"Propósito 2 : Cambiar Nuestros Hábitos de Vida para Reverdecer a Bogotá y Adaptarnos y Mitigar la Crisis Climática"},"O23011602330000001670",2,800104214,"INCITECO S A S","Persona Jurídica",null,null,null,null,0,null,1,200812430,200812430,36954906,"2021-12-30",null,"2022-07-21",null,null,null,null,null,null,null,"En ejecución",0.18402698478376064]
[315,2022,"FDLRUU-MIC-006-2022","https://community.secop.gov.co/Public/Tendering/OpportunityDetail/Index?noticeUID=CO1.NTC.3191413&isFromPublicArea=True&isModal=False","Compraventa de bienes muebles","Contratación mínima cuantia","No aplica","ADQUISICIÓN DE CHAQUETAS INSTITUCIONALES PARA LOS FUNCIONARIOS Y CONTRATISTAS DE LA ALCALDÍA LOCAL DE RAFAEL URIBE URIBE","Funcionamiento","Un nuevo contrato social y ambiental para la Bogotá del Siglo XXI","No aplica",{"$f":"IF(ISERROR(VLOOKUP(K330,Proposito_programa!$C$2:$E$59,2,FALSE)),\" \",VLOOKUP(K330,Proposito_programa!$C$2:$E$59,2,FALSE))","v":" "},{"$f":"IF(ISERROR(VLOOKUP(K330,Proposito_programa!$C$2:$E$59,3,FALSE)),\" \",VLOOKUP(K330,Proposito_programa!$C$2:$E$59,3,FALSE))","v":" "},"O2120201002082823117\nO2120201002082823313",10,900990752,"PROINCOL JK SAS","Persona Jurídica",null,null,null,null,1190000,null,null,null,1190000,1190000,"2022-09-14","2022-09-20","2022-11-13",60,null,null,null,null,null,null,"Terminado",1]
[316,2022,"FDLRUU-MIC-007-2022","https://community.secop.gov.co/Public/Tendering/OpportunityDetail/Index?noticeUID=CO1.NTC.3232781&isFromPublicArea=True&isModal=False","Compraventa de bienes muebles","Contratación mínima cuantia","No aplica","CONTRATAR LOS SERVICIOS DE UN OPERADOR LOGISTICO PARA EL DESARROLLO DEL FORO EDUCATIVO LOCAL 2022","Inversión","Un nuevo contrato social y ambiental para la Bogotá del Siglo XXI",55,{"$f":"IF(ISERROR(VLOOKUP(K331,Proposito_programa!$C$2:$E$59,2,FALSE)),\" \",VLOOKUP(K331,Proposito_programa!$C$2:$E$59,2,FALSE))","v":"Fortalecimiento de cultura ciudadana y su institucionalidad"},{"$f":"IF(ISERROR(VLOOKUP(K331,Proposito_programa!$C$2:$E$59,3,FALSE)),\" \",VLOOKUP(K331,Proposito_programa!$C$2:$E$59,3,FALSE))","v":"Propósito 5: Construir Bogotá - Región con gobierno abierto, transparente y ciudadanía consciente"},"O23011605550000001689",10,830029325,"Autogestión Colombia","Persona Jurídica",null,null,null,null,22960800,null,null,null,22960800,22960800,"2022-09-14","2022-09-16","2022-10-14",30,null,null,null,null,null,null,"Terminado",1]
[317,2021,"FDLRUU-MC-312-2021","https://community.secop.gov.co/Public/Tendering/OpportunityDetail/Index?noticeUID=CO1.NTC.2415037&isFromPublicArea=True&isModal=False\n","Suministro","Contratación mínima cuantia","No aplica","CONTRATAR EL SUMINISTRO DE PUBLICIDAD IMPRESA Y ELEMENTOS P.O.P. PARA EL FORTALECIMIENTO DE LA IMAGEN INSTITUCIONAL DE LA ALCALDÍA LOCAL DE RA-FAEL URIBE URIBE\"\n\n","Funcionamiento","Un nuevo contrato social y ambiental para la Bogotá del Siglo XXI","No aplica",{"$f":"IF(ISERROR(VLOOKUP(K332,Proposito_programa!$C$2:$E$59,2,FALSE)),\" \",VLOOKUP(K332,Proposito_programa!$C$2:$E$59,2,FALSE))","v":" "},{"$f":"IF(ISERROR(VLOOKUP(K332,Proposito_programa!$C$2:$E$59,3,FALSE)),\" \",VLOOKUP(K332,Proposito_programa!$C$2:$E$59,3,FALSE))","v":" "},"O2120202",13,900605957,"EN ALIANZAS SAS","Persona Jurídica",null,null,null,null,0,null,1,20000000,20000000,8400212,"2021-12-14","2021-12-27","2022-08-26",240,null,null,null,null,null,null,"Terminado",0.42001060000000001]
[317,2022,"FDLRUU-CD-317-2022 ","https://community.secop.gov.co/Public/Tendering/OpportunityDetail/Index?noticeUID=CO1.NTC.3285583&isFromPublicArea=True&isModal=False","Convenios/Contratos interadministrativos","Contratación directa","Contratos interadministrativos","AUNAR ESFUERZOS TÉCNICOS, ADMINISTRATIVOS, FINANCIEROS Y LOGÍSTICOS PARA FORTALECER LOS EMPRENDIMIENTOS O MICRONEGOCIOS DE LA LOCALIDAD RAFAEL URIBE URIBE A TRAVÉS DE PROCESOS DE ASISTENCIA TÉCNICA, FORMULACIÓN DE PLAN DE INVERSIÓN Y CAPITALIZACIÓN BAJO UN ENFOQUE DE PRIORIZACIÓN POBLACIONAL Y TERRITORIAL CON EL FIN DE PROMOVER LA PRODUCTIVIDAD Y SOSTENIBILIDAD DE LA POBLACIÓN CON BRECHAS SOCIALES Y ECONÓMICAS DE LA LOCALIDADAUNAR ESFUERZOS TÉCNICOS, ADMINISTRATIVOS, FINANCIEROS Y LOGÍSTICOS PARA FORTALECER LOS EMPRENDIMIENTOS O MICRONEGOCIOS DE LA LOCALIDAD RAFAEL URIBE URIBE A TRAVÉS DE PROCESOS DE ASISTENCIA TÉCNICA, FORMULACIÓN DE PLAN DE INVERSIÓN Y CAPITALIZACIÓN BAJO UN ENFOQUE DE PRIORIZACIÓN POBLACIONAL Y TERRITORIAL CON EL FIN DE PROMOVER LA PRODUCTIVIDAD Y SOSTENIBILIDAD DE LA POBLACIÓN CON BRECHAS SOCIALES Y ECONÓMICAS DE LA LOCALIDAD","Inversión","Un nuevo contrato social y ambiental para la Bogotá del Siglo XXI",6,{"$f":"IF(ISERROR(VLOOKUP(K333,Proposito_programa!$C$2:$E$59,2,FALSE)),\" \",VLOOKUP(K333,Proposito_programa!$C$2:$E$59,2,FALSE))","v":"Sistema Distrital de Cuidado"},{"$f":"IF(ISERROR(VLOOKUP(K333,Proposito_programa!$C$2:$E$59,3,FALSE)),\" \",VLOOKUP(K333,Proposito_programa!$C$2:$E$59,3,FALSE))","v":"Propósito 1: Hacer un nuevo contrato social para incrementar la inclusión social, productiva y política"},"O23011601060000001653",1,800250713,"CONVENIO PROPAIS","Persona Jurídica",null,null,null,null,570093111,null,null,null,{"$f":"+W333+X333+Z333","v":570093111},405796556,"2022-09-19","2022-10-03","2023-07-02",280,null,null,null,null,null,null,"En ejecución",0.71180750682672256]
[318,2021,"FDLRUU-MC-319-2021","https://community.secop.gov.co/Public/Tendering/OpportunityDetail/Index?noticeUID=CO1.NTC.2443542&isFromPublicArea=True&isModal=False\n","Contratos de prestación de servicios","Contratación mínima cuantia","No aplica","PRESTACIÓN DEL SERVICIO DE MONITOREO DE GPS Y MEDICIÓN DE VARIABLES DE OPERACIÓN DE LOS VEHÍCULOS LIVIANOS Y MAQUINARIA PESADA DEL FONDO DE DESARROLLO LOCAL RAFAEL URIBE URIBE","Inversión","Un Nuevo Contrato Social y Ambiental para la Bogotá del Siglo XXI",49,{"$f":"IF(ISERROR(VLOOKUP(K334,Proposito_programa!$C$2:$E$59,2,FALSE)),\" \",VLOOKUP(K334,Proposito_programa!$C$2:$E$59,2,FALSE))","v":"Movilidad segura, sostenible y accesible"},{"$f":"IF(ISERROR(VLOOKUP(K334,Proposito_programa!$C$2:$E$59,3,FALSE)),\" \",VLOOKUP(K334,Proposito_programa!$C$2:$E$59,3,FALSE))","v":"Propósito 4: Hacer de Bogotá Región un modelo de movilidad multimodal, incluyente y sostenible"},"O23011604490000001685",1,900465924,"VISATEL DE COLOMBIA S A S","Persona Jurídica",null," "," ",null,0,null,1,3000000,3000000,0,"2021-12-17","2022-01-03","2023-01-02",null,1,150," "," "," "," ","Terminado",{"$f":"IF(ISERROR(AB334/AA334),\"-\",(AB334/AA334))","v":0}]
[318,2022,"FDLRUU-SASI-001-2022","https://community.secop.gov.co/Public/Tendering/OpportunityDetail/Index?noticeUID=CO1.NTC.3130762&isFromPublicArea=True&isModal=False","Suministro","Selección abreviada","Subasta inversa ","SUMINISTRAR POR SISTEMA DE PRECIOS UNITARIOS FIJOS A MONTO AGOTABLE, EMULSIÓN ASFÁLTICA CRL-1, PARA EL MEJORAMIENTO DE LA MALLA VIAL DE LA LOCALIDAD DE RAFAEL URIBE URIBE","Inversión","Un nuevo contrato social y ambiental para la Bogotá del Siglo XXI",49,{"$f":"IF(ISERROR(VLOOKUP(K335,Proposito_programa!$C$2:$E$59,2,FALSE)),\" \",VLOOKUP(K335,Proposito_programa!$C$2:$E$59,2,FALSE))","v":"Movilidad segura, sostenible y accesible"},{"$f":"IF(ISERROR(VLOOKUP(K335,Proposito_programa!$C$2:$E$59,3,FALSE)),\" \",VLOOKUP(K335,Proposito_programa!$C$2:$E$59,3,FALSE))","v":"Propósito 4: Hacer de Bogotá Región un modelo de movilidad multimodal, incluyente y sostenible"},"O23011604490000001685",3,900641347,"CONSORCIO PLUSEL INGENIEROS - PLM","Consorcio","PLUTARCO LANDINEZ MARTINEZ\nPLUSEL INGENIEROS S A S","6765018\n900465391","(50%)\n(50%)",null,200000000,null,null,null,200000000,0,"2022-10-03","2022-10-07","2023-05-06",210,null,null,null,null,null,null,"En ejecución",0]
[319,2022,"FDLRUU-CD-319-2022","https://community.secop.gov.co/Public/Tendering/ContractNoticePhases/View?PPI=CO1.PPI.20729930&isFromPublicArea=True&isModal=False","Contratos de prestación de servicios profesionales y de apoyo a la gestión","Contratación directa","Prestación de servicios profesionales y de apoyo a la gestión, o para la ejecución de trabajos artísticos que sólo puedan encomendarse a determinadas personas naturales","PRESTAR SUS SERVICIOS DE APOYO ADMINISTRATIVO ASISTENCIAL AL DESPACHO DE LA ALCALDÍA LOCAL DE RAFAEL URIBE URIBE.","Inversión","Un nuevo contrato social y ambiental para la Bogotá del Siglo XXI",57,{"$f":"IF(ISERROR(VLOOKUP(K336,Proposito_programa!$C$2:$E$59,2,FALSE)),\" \",VLOOKUP(K336,Proposito_programa!$C$2:$E$59,2,FALSE))","v":"Gestión pública local"},{"$f":"IF(ISERROR(VLOOKUP(K336,Proposito_programa!$C$2:$E$59,3,FALSE)),\" \",VLOOKUP(K336,Proposito_programa!$C$2:$E$59,3,FALSE))","v":"Propósito 5: Construir Bogotá - Región con gobierno abierto, transparente y ciudadanía consciente"},"O23011605570000001697",1,80165879,"JONATHAN BERNAL CORTINA","Persona Natural",null,null,null,null,10800000,null,null,null,10800000,5400000,"2022-09-23","2022-10-01","2023-01-31",120,null,null,null,null,null,null,"Terminado",0.5]
[320,2019,"CI-320-2019","https://community.secop.gov.co/Public/Tendering/OpportunityDetail/Index?noticeUID=CO1.NTC.996014&isFromPublicArea=True&isModal=False","Interventoría","Concurso de méritos","No aplica","REALIZAR LA INTERVENTORÍA TÉCNICA, ADMINISTRATIVA, LEGAL, FINANCIERA, SOCIAL, AMBIENTAL Y DE SEGURIDAD Y SALUD EN EL TRABAJO (SST), DEL CONTRATO DE OBRA PÚBLICA QUE TIENE POR OBJETO: “EJECUTAR LAS OBRAS Y ACTIVIDADES PARA LA CONSERVACIÓN DE LA MALLA VIAL Y ESPACIO PÚBLICO DE LA LOCALIDAD DE RAFAEL URIBE URIBE EN BOGOTÁ, D. C.” DERIVADO DEL PROCESO DE LA LICITACIÓN PUBLICA No. FDLRUU-LP-224-2019","Inversión","Un Nuevo Contrato Social y Ambiental para la Bogotá del Siglo XXI",49,{"$f":"IF(ISERROR(VLOOKUP(K337,Proposito_programa!$C$2:$E$59,2,FALSE)),\" \",VLOOKUP(K337,Proposito_programa!$C$2:$E$59,2,FALSE))","v":"Movilidad segura, sostenible y accesible"},{"$f":"IF(ISERROR(VLOOKUP(K337,Proposito_programa!$C$2:$E$59,3,FALSE)),\" \",VLOOKUP(K337,Proposito_programa!$C$2:$E$59,3,FALSE))","v":"Propósito 4: Hacer de Bogotá Región un modelo de movilidad multimodal, incluyente y sostenible"},"O23011604490000001685",1,900107376,"INTERVENTORIA Y CONSTRUCIVILES SAS","Persona Jurídica",null," "," ",null,0,null,1,159286738,159286738,0,"2021-05-12","2021-05-12","2022-05-26",660,5,660," "," "," "," ","Terminado",0]
[320,2022,"FDLRUU-CD-320-2022","https://community.secop.gov.co/Public/Tendering/OpportunityDetail/Index?noticeUID=CO1.NTC.3351465&isFromPublicArea=True&isModal=False","Convenios/Contratos interadministrativos","Contratación directa","Contratos interadministrativos","AUNAR ESFUERZOS ADMINISTRATIVOS, TÉCNICOS Y FINANCIEROS ENTRE EL FONDO DE DESARROLLO LOCAL RAFAEL URIBE URIBE Y LA SUBRED INTEGRADA DE SERVICIOS DE SALUD CENTRO ORIENTE, CON EL FIN DE BENEFICIAR PERSONAS CON DISCAPACIDAD PERMANENTE RESIDENTES EN LA LOCALIDAD A TRAVÉS DEL OTORGAMIENTO DE DISPOSITIVOS DE ASISTENCIA PERSONAL-DAP, NO INCLUIDOS EN LOS PLANES DE BENEFICIOS DE SALUD EN PRO DE MEJORAR SU CALIDAD DE VIDA Y LA DE SUS CUIDADORES, EN EL MARCO DEL PROYECTO DE INVERSIÓN 1658 Y EN DESARROLLO D","Inversión","Un nuevo contrato social y ambiental para la Bogotá del Siglo XXI",6,{"$f":"IF(ISERROR(VLOOKUP(K338,Proposito_programa!$C$2:$E$59,2,FALSE)),\" \",VLOOKUP(K338,Proposito_programa!$C$2:$E$59,2,FALSE))","v":"Sistema Distrital de Cuidado"},{"$f":"IF(ISERROR(VLOOKUP(K338,Proposito_programa!$C$2:$E$59,3,FALSE)),\" \",VLOOKUP(K338,Proposito_programa!$C$2:$E$59,3,FALSE))","v":"Propósito 1: Hacer un nuevo contrato social para incrementar la inclusión social, productiva y política"},"O23011601060000001658",1,900959051,"SUBRED INTEGRADA DE SERVICIO DE SALUD CENTRO ORIENTE E.S.E","Persona Jurídica",null,null,null,null,1102586000,null,null,null,1102586000,0,"2022-10-31","2022-12-01","2023-10-31",330,null,null,null,null,null,null,"En ejecución",0]
[321,2019,"COP-321-2019","https://community.secop.gov.co/Public/Tendering/OpportunityDetail/Index?noticeUID=CO1.NTC.975649&isFromPublicArea=True&isModal=False","Obra pública","Licitación pública","No aplica","EJECUTAR LAS OBRAS Y ACTIVIDADES PARA LA CONSERVACIÓN DE LA MALLA VIAL Y ESPACIO PÚBLICO DE LA LOCALIDAD DE RAFAEL URIBE URIBE EN BOGOTÁ, D. C.","Inversión","Un Nuevo Contrato Social y Ambiental para la Bogotá del Siglo XXI",49,{"$f":"IF(ISERROR(VLOOKUP(K339,Proposito_programa!$C$2:$E$59,2,FALSE)),\" \",VLOOKUP(K339,Proposito_programa!$C$2:$E$59,2,FALSE))","v":"Movilidad segura, sostenible y accesible"},{"$f":"IF(ISERROR(VLOOKUP(K339,Proposito_programa!$C$2:$E$59,3,FALSE)),\" \",VLOOKUP(K339,Proposito_programa!$C$2:$E$59,3,FALSE))","v":"Propósito 4: Hacer de Bogotá Región un modelo de movilidad multimodal, incluyente y sostenible"},"O23011604490000001685",1,901351603,"CONSORCIO RU 2020","Consorcio",null," "," ",null,0,null,1,1794385972,1794385972,0,"2021-05-12","2021-05-12","2022-05-26",660,5,660," "," "," "," ","Terminado",0]
[321,2022,"FDLRUU-LP-003-2022","https://community.secop.gov.co/Public/Tendering/OpportunityDetail/Index?noticeUID=CO1.NTC.2978923&isFromPublicArea=True&isModal=False","Obra pública","Licitación pública","No aplica","CONTRATAR A PRECIOS UNITARIOS FIJOS, A MONTO AGOTABLE, LA COSNTRUCCIÓN, MEJORAMIENTO, MANTENIMIENTO Y/O DOTACIÓN DE LOS PARQUES CATALOGADOS COMO VECINALES Y DE BOLSILLO, DE LA LOCALIDAD DE RAFAEL URIBE URIBE EN BOGOTÁ D.C","Inversión","Un nuevo contrato social y ambiental para la Bogotá del Siglo XXI",33,{"$f":"IF(ISERROR(VLOOKUP(K340,Proposito_programa!$C$2:$E$59,2,FALSE)),\" \",VLOOKUP(K340,Proposito_programa!$C$2:$E$59,2,FALSE))","v":"Más árboles y más y mejor espacio público"},{"$f":"IF(ISERROR(VLOOKUP(K340,Proposito_programa!$C$2:$E$59,3,FALSE)),\" \",VLOOKUP(K340,Proposito_programa!$C$2:$E$59,3,FALSE))","v":"Propósito 2 : Cambiar Nuestros Hábitos de Vida para Reverdecer a Bogotá y Adaptarnos y Mitigar la Crisis Climática"},"O23011602330000001670",20,901636488,"CONSORCIO PARQUES RU 2022","Persona Jurídica","JOHN WILLIAM CASALLAS JURADO (20%)\nEDILBERTO MATEUS ALVAREZ (40%)\nPROCIVIN SAS (40%)","79453948\n79450592\n900961137","(20%)\n(40%)\n(40%)",null,3520000188,null,null,null,3520000188,581050536,"2022-10-10","2022-10-31","2023-04-30",180,null,null,null,null,null,null,"En ejecución",0.16507116618369908]
[322,2021,"FDLRUU-LP-293-2021 ","https://community.secop.gov.co/Public/Tendering/OpportunityDetail/Index?noticeUID=CO1.NTC.2418002&isFromPublicArea=True&isModal=False\n","Obra pública","Licitación pública","No aplica","CONTRATAR POR EL SISTEMA DE PRECIOS UNITARIOS FIJOS SIN FÓRMULA DE REAJUSTE LA CONSTRUCCIÓN DE OBRAS CIVILES PARA LA MITIGACIÓN DE RIESGO EN LA LOCALIDAD DE RAFAEL URIBE URIBE.","Inversión","Un Nuevo Contrato Social y Ambiental para la Bogotá del Siglo XXI",30,"Eficiencia en la atención de emergencias","Propósito 2 : Cambiar Nuestros Hábitos de Vida para Reverdecer a Bogotá y Adaptarnos y Mitigar la Crisis Climática","O23011602300000001665",4,901557514,"CONSORCIO MITIGACION 2021","Consorcio",null,null,null,null,0,null,1,965876497,965876497,0,null,null,"2023-03-19",null,150,null,null,null,null,null,"En ejecución",0]
[322,2022,"FDLRUU CMA-003-2022","https://community.secop.gov.co/Public/Tendering/OpportunityDetail/Index?noticeUID=CO1.NTC.3270171&isFromPublicArea=True&isModal=False","Interventoría","Concurso de méritos","No aplica","REALIZAR LA INTERVENTORIA TECNICA, ADMINISTRATIVA, FINANCIERA, AMBIENTAL Y SST AL CONTRATO DE OBRA PUBLICA RESULTANTE DEL PROCESO DE LICITACION PUBLICA No. FDLRUU-LP-003-2022, CUYO OBJETO ES CONTRATAR A PRECIOS UNITARIOS FIJOS, A MONTO AGOTABLE, LA COSNTRUCCIÓN, MEJORAMIENTO, MANTENIMIENTO Y/O DOTACIÓN DE LOS PARQUES CATALOGADOS COMO VECINALES Y DE BOLSILLO, DE LA LOCALIDAD DE RAFAEL URIBE URIBE EN BOGOTÁ D.C","Inversión","Un nuevo contrato social y ambiental para la Bogotá del Siglo XXI",33,{"$f":"IF(ISERROR(VLOOKUP(K342,Proposito_programa!$C$2:$E$59,2,FALSE)),\" \",VLOOKUP(K342,Proposito_programa!$C$2:$E$59,2,FALSE))","v":"Más árboles y más y mejor espacio público"},{"$f":"IF(ISERROR(VLOOKUP(K342,Proposito_programa!$C$2:$E$59,3,FALSE)),\" \",VLOOKUP(K342,Proposito_programa!$C$2:$E$59,3,FALSE))","v":"Propósito 2 : Cambiar Nuestros Hábitos de Vida para Reverdecer a Bogotá y Adaptarnos y Mitigar la Crisis Climática"},"O23011602330000001670",1,901642319,"CONSORCIO PARQUES 2L INTERVENTORIA","Persona Jurídica","2LPROYECTOS SAS (90%)\nINTERVENTORIA Y CONSTRUCCIONES CIVILES (10%)","901154678\n900107376","(90%)\n(10%)",null,290157552,null,null,null,290157552,47905012,"2022-10-18","2022-10-31","2023-04-30",180,null,null,null,null,null,null,"En ejecución",0.16510000056796731]
[323,2022,"FDLRUU-LP-004-2022","https://community.secop.gov.co/Public/Tendering/OpportunityDetail/Index?noticeUID=CO1.NTC.3281145&isFromPublicArea=True&isModal=False","Contratos de prestación de servicios","Licitación pública","No aplica","DISEÑAR E IMPLEMENTAR ACCIONES INNOVADORAS Y TRANSFERENCIA DE CONOCIMIENTO PARA PROMOVER EL FORTALECIMIENTO DE LA CONFIANZA CIUDADANA, LA CONVIVENCIA SOCIAL Y LA JUSTICIA LOCAL EN LA LOCALIDAD RAFAEL URIBE URIBE EN EL MARCO DEL PLAN DE DESARROLLO LOCAL 2021- 2024 \"UN NUEVO CONTRATO SOCIAL Y AMBIENTAL PARA LA LOCALIDAD DE RAFAEL URIBE URIBE\". EN EL MARCO DEL PROYECTO DE INVERSION 1682","Inversión","Un nuevo contrato social y ambiental para la Bogotá del Siglo XXI",48,{"$f":"IF(ISERROR(VLOOKUP(K343,Proposito_programa!$C$2:$E$59,2,FALSE)),\" \",VLOOKUP(K343,Proposito_programa!$C$2:$E$59,2,FALSE))","v":"Plataforma institucional para la seguridad y justicia"},{"$f":"IF(ISERROR(VLOOKUP(K343,Proposito_programa!$C$2:$E$59,3,FALSE)),\" \",VLOOKUP(K343,Proposito_programa!$C$2:$E$59,3,FALSE))","v":"Propósito 3: Inspirar confianza y legitimidad para vivir sin miedo y ser epicentro de cultura ciudadana, paz y reconciliación"},"O23011603480000001682",12,900175374,"ASOCIACIÓN DE HOGARES SI A LA VIDA","Persona Jurídica",null,null,null,null,563932500,null,1,44067500,608000000,0,"2022-10-14","2022-10-21","2023-04-20",180,null,null,null,null,null,null,"En ejecución",0]
[324,2022,"FDLRUU-SAMC-004-2022","https://community.secop.gov.co/Public/Tendering/ContractNoticePhases/View?PPI=CO1.PPI.20553686&isFromPublicArea=True&isModal=False","Contratos de prestación de servicios","Selección abreviada","Selección abreviada por menor cuantía ","CONTRATAR A MONTO AGOTABLE EL DIAGNÓSTICO, MANTENIMIENTO PREVENTIVO Y CORRECTIVO INCLUYENDO MANO DE OBRA Y/O SUMINISTRO DE REPUESTOS ORIGINALES, HOMOLOGADOS, KITS DE ELEMENTOS, LUBRICANTES, SUMINISTRO DE LLANTAS, DESPINCHES PARA LOS VEHÍCULOS LIVIANOS DEL FONDO DE DESARROLLO LOCAL DE LA ALCALDIA DE RAFAEL URIBE URIBE.","Funcionamiento","Un nuevo contrato social y ambiental para la Bogotá del Siglo XXI","No aplica",{"$f":"IF(ISERROR(VLOOKUP(K344,Proposito_programa!$C$2:$E$59,2,FALSE)),\" \",VLOOKUP(K344,Proposito_programa!$C$2:$E$59,2,FALSE))","v":" "},{"$f":"IF(ISERROR(VLOOKUP(K344,Proposito_programa!$C$2:$E$59,3,FALSE)),\" \",VLOOKUP(K344,Proposito_programa!$C$2:$E$59,3,FALSE))","v":" "},"O2120202008078714199",null,830006596,"AUTOS MONGUI SAS","Persona Jurídica",null,null,null,null,52494000,null,null,null,52494000,0,"2022-10-24","2022-11-28","2023-04-23",180,null,null,null,null,null,null,"En ejecución",0]
[325,2022,"FDLRUU-CD-325-2022","https://community.secop.gov.co/Public/Tendering/ContractNoticePhases/View?PPI=CO1.PPI.21283843&isFromPublicArea=True&isModal=False","Contratos de prestación de servicios profesionales y de apoyo a la gestión","Contratación directa","Prestación de servicios profesionales y de apoyo a la gestión, o para la ejecución de trabajos artísticos que sólo puedan encomendarse a determinadas personas naturales","PRESTAR LOS SERVICIOS PROFESIONALES EN EL SEGUIMIENTO DE PAGOS, ACTUALIZACIÓN,\nLIQUIDACIÓN Y DEPURACIÓN DE LAS OBLIGACIONES POR PAGAR DE CONTRATOS DE OBRA PUBLICA\nE INFRAESTRUCTURA DE VIGENCIAS ANTERIORES QUE SE ENCUENTRAN VIGENTES EN EL FONDO\nDE DESARROLLO LOCAL DE RAFAEL URIBE URIBE.","Inversión","Un nuevo contrato social y ambiental para la Bogotá del Siglo XXI",57,{"$f":"IF(ISERROR(VLOOKUP(K345,Proposito_programa!$C$2:$E$59,2,FALSE)),\" \",VLOOKUP(K345,Proposito_programa!$C$2:$E$59,2,FALSE))","v":"Gestión pública local"},{"$f":"IF(ISERROR(VLOOKUP(K345,Proposito_programa!$C$2:$E$59,3,FALSE)),\" \",VLOOKUP(K345,Proposito_programa!$C$2:$E$59,3,FALSE))","v":"Propósito 5: Construir Bogotá - Región con gobierno abierto, transparente y ciudadanía consciente"},"O23011605570000001697",1,1000696681,"DIEGO ARMANDO MENDIVELSO MENDIVELSO","Persona Natural",null,null,null,null,12750000,null,null,null,12750000,5950000,"2022-10-25","2022-10-26","2023-01-10",60.5,null,null,null,null,null,null,"Terminado",0.46666666666666667]
[326,2022,"FDLRUU-CD-326-2022","https://community.secop.gov.co/Public/Tendering/ContractNoticePhases/View?PPI=CO1.PPI.21383905&isFromPublicArea=True&isModal=False","Contratos de prestación de servicios profesionales y de apoyo a la gestión","Contratación directa","Prestación de servicios profesionales y de apoyo a la gestión, o para la ejecución de trabajos artísticos que sólo puedan encomendarse a determinadas personas naturales","APOYAR ASISTENCIALMENTE EN LAS LABORES ADMINISTRATIVAS Y OPERATIVAS QUE SE REQUIERAN EN EL ÁREA DE GESTION DESARROLLO LOCAL DE LA ALCALDIA LOCAL DE RAFAEL URIBE URIBE","Inversión","Un nuevo contrato social y ambiental para la Bogotá del Siglo XXI",57,{"$f":"IF(ISERROR(VLOOKUP(K346,Proposito_programa!$C$2:$E$59,2,FALSE)),\" \",VLOOKUP(K346,Proposito_programa!$C$2:$E$59,2,FALSE))","v":"Gestión pública local"},{"$f":"IF(ISERROR(VLOOKUP(K346,Proposito_programa!$C$2:$E$59,3,FALSE)),\" \",VLOOKUP(K346,Proposito_programa!$C$2:$E$59,3,FALSE))","v":"Propósito 5: Construir Bogotá - Región con gobierno abierto, transparente y ciudadanía consciente"},"O23011605570000001697",1,80749053,"PABLO ALEJANDRO MESA GONZALEZ","Persona Natural",null,null,null,null,6750000,null,null,null,6750000,2610000,"2022-10-31","2022-11-02","2023-01-16",60.5,null,null,null,null,null,null,"Terminado",0.38666666666666666]
[327,2022,"FDLRUU-LP-008-2022","https://community.secop.gov.co/Public/Tendering/OpportunityDetail/Index?noticeUID=CO1.NTC.3330690&isFromPublicArea=True&isModal=False","Contratos de prestación de servicios","Licitación pública","No aplica","PRESTAR SERVICIOS ENFOCADOS A LA REALIZACIÒN DE ACCIONES EN DERECHOS DE LAS MUJERES, PREVENCIÒN DEL FEMINICIDIO Y VIOLENCIA CONTRA LAS MUJERES DE LA LOCALIDAD RAFAEL URIBE URIBE\"","Inversión","Un nuevo contrato social y ambiental para la Bogotá del Siglo XXI",40,{"$f":"IF(ISERROR(VLOOKUP(K347,Proposito_programa!$C$2:$E$59,2,FALSE)),\" \",VLOOKUP(K347,Proposito_programa!$C$2:$E$59,2,FALSE))","v":"Más mujeres viven una vida libre de violencias, se sienten seguras y acceden con confianza al sistema de justicia"},{"$f":"IF(ISERROR(VLOOKUP(K347,Proposito_programa!$C$2:$E$59,3,FALSE)),\" \",VLOOKUP(K347,Proposito_programa!$C$2:$E$59,3,FALSE))","v":"Propósito 3: Inspirar confianza y legitimidad para vivir sin miedo y ser epicentro de cultura ciudadana, paz y reconciliación"},"O23011603400000001679",12,830133329,"FUNDESCO","Persona Jurídica",null,null,null,null,1518249898,null,null,null,1518249898,0,"2022-10-25","2022-11-01","2023-06-24",212,null,null,null,null,null,null,"Suspendido ",0]
[328,2022,"FDLRUU-SAMC-003-2022","https://community.secop.gov.co/Public/Tendering/OpportunityDetail/Index?noticeUID=CO1.NTC.3322565&isFromPublicArea=True&isModal=False","Contratos de prestación de servicios","Selección abreviada","Selección abreviada por menor cuantía ","DESARROLLAR ACTIVIDADES COMPLEMENTARIAS EN SALUD DIRIGIDAS A PERSONAS CON DISCAPACIDAD Y/O SUS CUIDADORES Y CUIDADORAS, RESIDENTES EN LA LOCALIDAD DE RAFAEL URIBE URIBE, QUE CONTRIBUYAN A RESOVER LAS DIFERENTES PROBLEMÁTICAS A LAS QUE SE ENFRENTAN Y QUE PROPENDAN POR EL AUTOCUIDADO Y EL BUEN VIVIR EL MARCO DEL PROYECTO DE INVERSIÓN 1658\"","Inversión","Un nuevo contrato social y ambiental para la Bogotá del Siglo XXI",6,{"$f":"IF(ISERROR(VLOOKUP(K348,Proposito_programa!$C$2:$E$59,2,FALSE)),\" \",VLOOKUP(K348,Proposito_programa!$C$2:$E$59,2,FALSE))","v":"Sistema Distrital de Cuidado"},{"$f":"IF(ISERROR(VLOOKUP(K348,Proposito_programa!$C$2:$E$59,3,FALSE)),\" \",VLOOKUP(K348,Proposito_programa!$C$2:$E$59,3,FALSE))","v":"Propósito 1: Hacer un nuevo contrato social para incrementar la inclusión social, productiva y política"},"O23011601060000001658",1,901233617,"COINDERE","Persona Jurídica",null,null,null,null,394657300,null,null,null,394657300,0,"2022-10-26","2022-11-01","2023-05-31",212,null,null,null,null,null,null,"En ejecución",0]
[329,2022,"FDLRUU-SAMC-005-2022","https://community.secop.gov.co/Public/Tendering/ContractNoticePhases/View?PPI=CO1.PPI.20459519&isFromPublicArea=True&isModal=False","Contratos de prestación de servicios","Selección abreviada","Selección abreviada por menor cuantía ","REALIZAR ACCIONES DE RESTAURACIÓN, REHABILITACIÓN Y RECUPERACIÓN EN ÁREAS PRIORITARIAS Y DE VALOR AMBIENTAL E IMPLEMENTAR ACCIONES DE MANTENIMIENTO Y PLANTACIÓN DE ÁRBOLES EN LA LOCALIDAD DE RAFAEL URIBE URIBE EN EL MARCO DE LOS PROYECTOS DE INVERSIÓN 1661 Y 1667","Inversión","Un nuevo contrato social y ambiental para la Bogotá del Siglo XXI",28,{"$f":"IF(ISERROR(VLOOKUP(K349,Proposito_programa!$C$2:$E$59,2,FALSE)),\" \",VLOOKUP(K349,Proposito_programa!$C$2:$E$59,2,FALSE))","v":"Bogotá protectora de sus recursos naturales"},{"$f":"IF(ISERROR(VLOOKUP(K349,Proposito_programa!$C$2:$E$59,3,FALSE)),\" \",VLOOKUP(K349,Proposito_programa!$C$2:$E$59,3,FALSE))","v":"Propósito 2 : Cambiar Nuestros Hábitos de Vida para Reverdecer a Bogotá y Adaptarnos y Mitigar la Crisis Climática"},"O23011602280000001661",10,901231658,"ASOCIACION DE PROFESIONALES PARA EL DESARROLLO DE PROYECTOS DE INVERSION PÚBLICA Y PRIVADA S&A","Persona Jurídica",null,null,null,null,275954982,null,1,24045018,300000000,0,"2022-10-27","2022-11-21","2023-07-20",242,null,null,null,null,null,null,"En ejecución",0]
[329,2022,"FDLRUU-SAMC-005-2022","https://community.secop.gov.co/Public/Tendering/ContractNoticePhases/View?PPI=CO1.PPI.20459519&isFromPublicArea=True&isModal=False","Contratos de prestación de servicios","Selección abreviada","Selección abreviada por menor cuantía ","REALIZAR ACCIONES DE RESTAURACIÓN, REHABILITACIÓN Y RECUPERACIÓN EN ÁREAS PRIORITARIAS Y DE VALOR AMBIENTAL E IMPLEMENTAR ACCIONES DE MANTENIMIENTO Y PLANTACIÓN DE ÁRBOLES EN LA LOCALIDAD DE RAFAEL URIBE URIBE EN EL MARCO DE LOS PROYECTOS DE INVERSIÓN 1661 Y 1667","Inversión","Un nuevo contrato social y ambiental para la Bogotá del Siglo XXI",33,{"$f":"IF(ISERROR(VLOOKUP(K350,Proposito_programa!$C$2:$E$59,2,FALSE)),\" \",VLOOKUP(K350,Proposito_programa!$C$2:$E$59,2,FALSE))","v":"Más árboles y más y mejor espacio público"},{"$f":"IF(ISERROR(VLOOKUP(K350,Proposito_programa!$C$2:$E$59,3,FALSE)),\" \",VLOOKUP(K350,Proposito_programa!$C$2:$E$59,3,FALSE))","v":"Propósito 2 : Cambiar Nuestros Hábitos de Vida para Reverdecer a Bogotá y Adaptarnos y Mitigar la Crisis Climática"},"O23011602330000001667",10,901231658,"ASOCIACION DE PROFESIONALES PARA EL DESARROLLO DE PROYECTOS DE INVERSION PÚBLICA Y PRIVADA S&A","Persona Jurídica",null,null,null,null,101866023,null,1,8133977,110000000,0,"2022-10-27","2022-11-21","2023-07-20",242,null,null,null,null,null,null,"En ejecución",0]
[330,2021,"FDLRUU-LP-288-2021","https://community.secop.gov.co/Public/Tendering/OpportunityDetail/Index?noticeUID=CO1.NTC.2373811&isFromPublicArea=True&isModal=False\n","Obra pública","Licitación pública","No aplica","EJECUTAR A PRECIOS UNITARIOS FIJOS SIN FORMULA DE REAJUSTE LA CONSTRUCCIÓN DE PARQUES VECINALES Y DE BOLSILLO, EN LA LOCALIDAD DE RAFAEL URIBE URIBE, DE CONFORMIDAD CON LOS ESTUDIOS Y DISEÑOS, ANEXOS TECNICOS Y DEMÁS DOCUMENTOS QUE HACEN PARTE INTEGRAL DEL PROCESO DEL CONTRATO.","Inversión","Un nuevo contrato social y ambiental para la Bogotá del Siglo XXI",33,{"$f":"IF(ISERROR(VLOOKUP(K351,Proposito_programa!$C$2:$E$59,2,FALSE)),\" \",VLOOKUP(K351,Proposito_programa!$C$2:$E$59,2,FALSE))","v":"Más árboles y más y mejor espacio público"},{"$f":"IF(ISERROR(VLOOKUP(K351,Proposito_programa!$C$2:$E$59,3,FALSE)),\" \",VLOOKUP(K351,Proposito_programa!$C$2:$E$59,3,FALSE))","v":"Propósito 2 : Cambiar Nuestros Hábitos de Vida para Reverdecer a Bogotá y Adaptarnos y Mitigar la Crisis Climática"},"O23011602330000001670",2,830028126,"R & M CONSTRUCCIONES E INTERVENTORIAS S A S","Persona Jurídica",null,null,null,null,0,null,1,11856508,11856508,0,"2021-12-09",null,"2022-07-21",null,null,null,null,null,null,null,"En ejecución",0]
[331,2021,"FDLRUU-CMA-316-2021 ","https://community.secop.gov.co/Public/Tendering/OpportunityDetail/Index?noticeUID=CO1.NTC.2443557&isFromPublicArea=True&isModal=False\n","Interventoría","Concurso de méritos","No aplica","REALIZAR LA INTERVENTORÍA TÉCNICA, ADMINISTRATIVA, LEGAL, FINANCIERA, SOCIAL, AMBIENTAL Y DE SEGURIDAD Y SALUD EN EL TRABAJO (SST), DEL CONTRATO DE OBRA PÚBLICA QUE TIENE POR OBJETO: CONTRATAR POR EL SISTEMA DE PRECIOS UNITARIOS FIJOS SIN FORMULA DE REAJUSTE LA CONSTRUCCIÓN DE OBRAS CIVILES PARA LA MITIGACIÓN DE RIESGO EN LA LOCALIDAD DE RAFAEL URIBE URIBE DERIVADO DEL PROCESO DE LA LICITACION PUBLICA No. FDLRUU-LP-293-2021.","Inversión","Un Nuevo Contrato Social y Ambiental para la Bogotá del Siglo XXI",30,"Eficiencia en la atención de emergencias","Propósito 2 : Cambiar Nuestros Hábitos de Vida para Reverdecer a Bogotá y Adaptarnos y Mitigar la Crisis Climática","O23011602300000001665",2,901565507,"CONSORCIO INTER MITIGACION 2022","Consorcio",null,null,null,null,0,null,1,98326227,98326227,0,null,null,"2023-03-19",null,150,null,null,null,null,null,"En ejecución",0]
[332,2022,"FDLRUU-CD-332-2022","https://community.secop.gov.co/Public/Tendering/ContractNoticePhases/View?PPI=CO1.PPI.21386961&isFromPublicArea=True&isModal=False","Convenios/Contratos interadministrativos","Contratación directa","Contratos interadministrativos","AUNAR ESFUERZOS TÉCNICOS, ADMINISTRATIVOS Y FINANCIEROS PARA IMPLEMENTAR UN PROCESO QUE APOYE Y PROMUEVA EL FORTALECIMIENTO EMPRESARIAL A LOS EMPRENDIMIENTOS Y/O UNIDADES PRODUCTIVAS FAMILIARES Y/O POBLACIONES DEDICADAS A ACTIVIDADES TRADICIONALES Y/O MIPYMES DE LA ECONOMÍA, QUE PERMITAN GENERAR INGRESOS (AUTOEMPLEO), EN EL MARCO DEL PROYECTO No. 1653, OPORTUNIDADES PARA EL DESARROLLO ECONOMICO CULTURAL Y CREATIVO EN RUU","Inversión","Un nuevo contrato social y ambiental para la Bogotá del Siglo XXI",6,{"$f":"IF(ISERROR(VLOOKUP(K353,Proposito_programa!$C$2:$E$59,2,FALSE)),\" \",VLOOKUP(K353,Proposito_programa!$C$2:$E$59,2,FALSE))","v":"Sistema Distrital de Cuidado"},{"$f":"IF(ISERROR(VLOOKUP(K353,Proposito_programa!$C$2:$E$59,3,FALSE)),\" \",VLOOKUP(K353,Proposito_programa!$C$2:$E$59,3,FALSE))","v":"Propósito 1: Hacer un nuevo contrato social para incrementar la inclusión social, productiva y política"},"O23011601060000001653",1,901100455,"ALDESARROLLO","Persona Jurídica",null,null,null,null,3831906889,null,null,null,3831906889,0,"2022-11-01","2022-12-13","2022-06-12",180,null,null,null,null,null,null,"Terminado",0]
[333,2022,"FDLRUU-LP-009-2022 ","https://community.secop.gov.co/Public/Tendering/OpportunityDetail/Index?noticeUID=CO1.NTC.3281803&isFromPublicArea=True&isModal=False","Contratos de prestación de servicios","Licitación pública","No aplica","DISEÑAR Y EJECUTAR EL PLAN CURRICULAR Y METODOLÓGICO EN LOS PROCESOS DE FORMACIÓN EN PARTICIPACION CIUDADANA, JUNTO CON SUS ACCIONES JURIDICAS, TECNICAS, ADMINISTRATIVAS Y FINANCIERAS PARA EL FORTALECIMIENTO A ORGANIZACIONES, MEDIOS ALTERNATIVOS DE COMUNICACIÓN COMUNITARIA, JAC E INSTANCIAS DE PARTICIPACION CIUDADANA EN EL MARCO DEL PROYECTO 1689 PARTICIPACIÓN CIUDADANA ORGANIZADA Y SOLIDARIA EN LA LOCALIDAD DE RAFAEL URIBE","Inversión","Un nuevo contrato social y ambiental para la Bogotá del Siglo XXI",55,{"$f":"IF(ISERROR(VLOOKUP(K354,Proposito_programa!$C$2:$E$59,2,FALSE)),\" \",VLOOKUP(K354,Proposito_programa!$C$2:$E$59,2,FALSE))","v":"Fortalecimiento de cultura ciudadana y su institucionalidad"},{"$f":"IF(ISERROR(VLOOKUP(K354,Proposito_programa!$C$2:$E$59,3,FALSE)),\" \",VLOOKUP(K354,Proposito_programa!$C$2:$E$59,3,FALSE))","v":"Propósito 5: Construir Bogotá - Región con gobierno abierto, transparente y ciudadanía consciente"},"O23011605550000001689",10,900094963,"FUNDACION IWOKE","Persona Jurídica",null,null,null,null,637227101,null,null,null,637227101,0,"2022-11-01","2022-11-15","2023-05-16",180,null,null,null,null,null,null,"En ejecución",0]
[334,2022,"FDLRUU-CD-334-2022","https://community.secop.gov.co/Public/Tendering/ContractNoticePhases/View?PPI=CO1.PPI.21568085&isFromPublicArea=True&isModal=False","Contratos de prestación de servicios profesionales y de apoyo a la gestión","Contratación directa","Prestación de servicios profesionales y de apoyo a la gestión, o para la ejecución de trabajos artísticos que sólo puedan encomendarse a determinadas personas naturales","PRESTAR LOS SERVICIOS PROFESIONALES PARA EL APOYO A LA EJECUCIÓN INTEGRAL DE LOS PROCESOS DE FORMULACIÓN, EVALUACIÓN Y SEGUIMIENTO DE LOS PROYECTOS DE INFRAESTRUCTURA, MALLA VIAL, ESPACIO PÚBLICO, CICLO INFRAESTRUCTURA, PUENTES, SALONES COMUNALES, MITIGACIÓNY PARQUES DE LA LOCALIDAD DE RAFAEL URIBE URIBE.","Inversión","Un nuevo contrato social y ambiental para la Bogotá del Siglo XXI",57,{"$f":"IF(ISERROR(VLOOKUP(K355,Proposito_programa!$C$2:$E$59,2,FALSE)),\" \",VLOOKUP(K355,Proposito_programa!$C$2:$E$59,2,FALSE))","v":"Gestión pública local"},{"$f":"IF(ISERROR(VLOOKUP(K355,Proposito_programa!$C$2:$E$59,3,FALSE)),\" \",VLOOKUP(K355,Proposito_programa!$C$2:$E$59,3,FALSE))","v":"Propósito 5: Construir Bogotá - Región con gobierno abierto, transparente y ciudadanía consciente"},"O23011605570000001697",1,1020755560,"LUISA FERNANDA CHAVES MANRIQUE","Persona Natural",null,null,null,null,11800000,null,null,null,11800000,2950000,"2022-11-15","2022-11-16","2023-01-15",60,null,null,null,null,null,null,"Terminado",0.25]
[335,2022,"FDLRUU-CD-335-2022","https://community.secop.gov.co/Public/Tendering/ContractNoticePhases/View?PPI=CO1.PPI.21592332&isFromPublicArea=True&isModal=False","Contratos de prestación de servicios profesionales y de apoyo a la gestión","Contratación directa","Prestación de servicios profesionales y de apoyo a la gestión, o para la ejecución de trabajos artísticos que sólo puedan encomendarse a determinadas personas naturales","\tAPOYAR TÉCNICAMENTE LAS DISTINTAS ETAPAS DE LOS PROCESOS DE COMPETENCIA DE LA ALCALDÍA LOCAL PARA LA DEPURACIÓN LAS ACTUACIONES ADMINISTRATIVAS","Inversión","Un nuevo contrato social y ambiental para la Bogotá del Siglo XXI",57,{"$f":"IF(ISERROR(VLOOKUP(K356,Proposito_programa!$C$2:$E$59,2,FALSE)),\" \",VLOOKUP(K356,Proposito_programa!$C$2:$E$59,2,FALSE))","v":"Gestión pública local"},{"$f":"IF(ISERROR(VLOOKUP(K356,Proposito_programa!$C$2:$E$59,3,FALSE)),\" \",VLOOKUP(K356,Proposito_programa!$C$2:$E$59,3,FALSE))","v":"Propósito 5: Construir Bogotá - Región con gobierno abierto, transparente y ciudadanía consciente"},"O23011605570000001698",1,19410967,"ORLANDO MERCHAN BARRETO","Persona Natural",null,null,null,null,10800000,null,null,null,10800000,2700000,"2022-11-15","2022-11-16","2023-01-15",60,null,null,null,null,null,null,"Terminado",0.25]
[336,2022,"FDLRUU-CD-336-2022","https://community.secop.gov.co/Public/Tendering/ContractNoticePhases/View?PPI=CO1.PPI.21553923&isFromPublicArea=True&isModal=False","Contratos de prestación de servicios profesionales y de apoyo a la gestión","Contratación directa","Prestación de servicios profesionales y de apoyo a la gestión, o para la ejecución de trabajos artísticos que sólo puedan encomendarse a determinadas personas naturales","APOYAR Y DAR SOPORTE TÉCNICO AL ADMINISTRADOR Y USUARIO FINAL DE LA RED DE SISTEMAS Y TECNOLOGÍA E INFORMACIÓN DE LA ALCALDÍA LOCAL","Inversión","Un nuevo contrato social y ambiental para la Bogotá del Siglo XXI",57,{"$f":"IF(ISERROR(VLOOKUP(K357,Proposito_programa!$C$2:$E$59,2,FALSE)),\" \",VLOOKUP(K357,Proposito_programa!$C$2:$E$59,2,FALSE))","v":"Gestión pública local"},{"$f":"IF(ISERROR(VLOOKUP(K357,Proposito_programa!$C$2:$E$59,3,FALSE)),\" \",VLOOKUP(K357,Proposito_programa!$C$2:$E$59,3,FALSE))","v":"Propósito 5: Construir Bogotá - Región con gobierno abierto, transparente y ciudadanía consciente"},"O23011605570000001697",1,52316051,"WALDINA CONTRERAS ALFONSO","Persona Natural",null,null,null,null,8000000,null,null,null,8000000,2666667,"2022-11-09","2022-11-11","2023-01-10",60,null,null,null,null,null,null,"Terminado",0.33333337499999999]
[337,2022,"FDLRUU-CD-337-2022","https://community.secop.gov.co/Public/Tendering/ContractNoticePhases/View?PPI=CO1.PPI.21518473&isFromPublicArea=True&isModal=False","Contratos de prestación de servicios profesionales y de apoyo a la gestión","Contratación directa","Prestación de servicios profesionales y de apoyo a la gestión, o para la ejecución de trabajos artísticos que sólo puedan encomendarse a determinadas personas naturales","PRESTAR LOS SERVICIOS DE APOYO TÉCNICO EN LA GESTIÓN EN LAS LABORES ADMINISTRATIVAS, OPERATIVAS Y LOGÍSTICAS QUE SE REQUIERAN EN EL ÁREA DE GESTIÓN DEL DESARROLLO DE LA ALCALDÍA LOCAL DE RAFAEL URIBE URIBE","Inversión","Un nuevo contrato social y ambiental para la Bogotá del Siglo XXI",57,{"$f":"IF(ISERROR(VLOOKUP(K358,Proposito_programa!$C$2:$E$59,2,FALSE)),\" \",VLOOKUP(K358,Proposito_programa!$C$2:$E$59,2,FALSE))","v":"Gestión pública local"},{"$f":"IF(ISERROR(VLOOKUP(K358,Proposito_programa!$C$2:$E$59,3,FALSE)),\" \",VLOOKUP(K358,Proposito_programa!$C$2:$E$59,3,FALSE))","v":"Propósito 5: Construir Bogotá - Región con gobierno abierto, transparente y ciudadanía consciente"},"O23011605570000001697",1,19445797,"CARLOS ALBERTO ESCOBAR LARA","Persona Natural",null,null,null,null,8000000,null,null,null,8000000,2800000,"2022-11-08","2022-11-10","2023-01-09",60,null,null,null,null,null,null,"Terminado",0.35]
[338,2022,"FDLRUU-CD-338-2022","https://community.secop.gov.co/Public/Tendering/ContractNoticePhases/View?PPI=CO1.PPI.21512410&isFromPublicArea=True&isModal=False","Contratos de prestación de servicios profesionales y de apoyo a la gestión","Contratación directa","Prestación de servicios profesionales y de apoyo a la gestión, o para la ejecución de trabajos artísticos que sólo puedan encomendarse a determinadas personas naturales","PRESTAR LOS SERVICIOS PROFESIONALES PARA APOYAR LA FORMULACION, EJECUCIÓN Y SEGUIMIENTO DE LOS PROYECTOS DE INVERSIÓN DEL SECTOR AMBIENTE EN EL MARCO DEL CUMPLIMIENTO DEL PLAN DE DESARROLLO LOCAL DE LA ALCALDÍA LOCAL DE RAFAEL URIBE URIBE 2021-2024","Inversión","Un nuevo contrato social y ambiental para la Bogotá del Siglo XXI",57,{"$f":"IF(ISERROR(VLOOKUP(K359,Proposito_programa!$C$2:$E$59,2,FALSE)),\" \",VLOOKUP(K359,Proposito_programa!$C$2:$E$59,2,FALSE))","v":"Gestión pública local"},{"$f":"IF(ISERROR(VLOOKUP(K359,Proposito_programa!$C$2:$E$59,3,FALSE)),\" \",VLOOKUP(K359,Proposito_programa!$C$2:$E$59,3,FALSE))","v":"Propósito 5: Construir Bogotá - Región con gobierno abierto, transparente y ciudadanía consciente"},"O23011605570000001697",1,1018475446,"MAIRA ALEJANDRA MORENO LOZANO","Persona Natural",null,null,null,null,10800000,null,null,null,10800000,3960000,"2022-11-08","2022-11-09","2023-01-08",60,null,null,null,null,null,null,"Terminado",0.36666666666666664]
[339,2022,"FDLRUU-CD-339-2022","https://community.secop.gov.co/Public/Tendering/ContractNoticePhases/View?PPI=CO1.PPI.21524456&isFromPublicArea=True&isModal=False","Contratos de prestación de servicios profesionales y de apoyo a la gestión","Contratación directa","Prestación de servicios profesionales y de apoyo a la gestión, o para la ejecución de trabajos artísticos que sólo puedan encomendarse a determinadas personas naturales","\tPRESTAR LOS SERVICIOS PROFESIONALES PARA APOYAR LA FORMULACION, EJECUCIÓN Y SEGUIMIENTO DE LOS PROYECTOS DE INVERSIÓN DEL SECTOR AMBIENTE EN EL MARCO DEL CUMPLIMIENTO DEL PLAN DE DESARROLLO LOCAL DE LA ALCALDÍA LOCAL DE RAFAEL URIBE URIBE 2021-2024","Inversión","Un nuevo contrato social y ambiental para la Bogotá del Siglo XXI",57,{"$f":"IF(ISERROR(VLOOKUP(K360,Proposito_programa!$C$2:$E$59,2,FALSE)),\" \",VLOOKUP(K360,Proposito_programa!$C$2:$E$59,2,FALSE))","v":"Gestión pública local"},{"$f":"IF(ISERROR(VLOOKUP(K360,Proposito_programa!$C$2:$E$59,3,FALSE)),\" \",VLOOKUP(K360,Proposito_programa!$C$2:$E$59,3,FALSE))","v":"Propósito 5: Construir Bogotá - Región con gobierno abierto, transparente y ciudadanía consciente"},"O23011605570000001697",1,1026279529,"DIANA CAROLINA PINZON PEREZ","Persona Natural",null,null,null,null,10800000,null,null,null,10800000,3780000,"2022-11-08","2022-11-10","2023-01-09",60,null,null,null,null,null,null,"Terminado",0.35]
[341,2022,"FDLRUU-LP-012-2022","https://community.secop.gov.co/Public/Tendering/OpportunityDetail/Index?noticeUID=CO1.NTC.3384874&isFromPublicArea=True&isModal=False","Contratos de prestación de servicios","Licitación pública","No aplica","REALIZAR ACCIONES DE PREVENCIÓN Y ATENCIÓN DE VIOLENCIA INTRAFAMILIAR Y SEXUAL PARA POBLACIONES EN SITUACION DE RIESGO Y VULNERACIÓN DE DERECHOS EN LA LOCALIDAD DE RAFAEL URIBE URIBE DEL PROYECTO DE INVERSIÓN 1656","Inversión","Un nuevo contrato social y ambiental para la Bogotá del Siglo XXI",6,{"$f":"IF(ISERROR(VLOOKUP(K361,Proposito_programa!$C$2:$E$59,2,FALSE)),\" \",VLOOKUP(K361,Proposito_programa!$C$2:$E$59,2,FALSE))","v":"Sistema Distrital de Cuidado"},{"$f":"IF(ISERROR(VLOOKUP(K361,Proposito_programa!$C$2:$E$59,3,FALSE)),\" \",VLOOKUP(K361,Proposito_programa!$C$2:$E$59,3,FALSE))","v":"Propósito 1: Hacer un nuevo contrato social para incrementar la inclusión social, productiva y política"},"O23011601060000001656",null,900216251,"ASOCIACION PARA EL DESARROLLO INTEGRAL DE LA FAMILIA COLOMBIANA","Persona Jurídica",null,null,null,null,744082964,null,null,null,744082964,0,"2022-11-09","2022-11-16","2023-06-26",180,null,null,null,null,null,null,"En ejecución",0]
[342,2022,"FDLRUU-CD-342-2022","https://community.secop.gov.co/Public/Tendering/ContractNoticePhases/View?PPI=CO1.PPI.21536995&isFromPublicArea=True&isModal=False","Contratos de prestación de servicios profesionales y de apoyo a la gestión","Contratación directa","Prestación de servicios profesionales y de apoyo a la gestión, o para la ejecución de trabajos artísticos que sólo puedan encomendarse a determinadas personas naturales","PRESTAR LOS SERVICIOS DE APOYO TÉCNICO EN LA GESTIÓN EN LAS LABORES ADMINISTRATIVAS, OPERATIVAS Y LOGÍSTICAS QUE SE REQUIERAN EN EL ÁREA DE GESTIÓN DEL DESARROLLO DE LA ALCALDÍA LOCAL DE RAFAEL URIBE","Inversión","Un nuevo contrato social y ambiental para la Bogotá del Siglo XXI",57,{"$f":"IF(ISERROR(VLOOKUP(K362,Proposito_programa!$C$2:$E$59,2,FALSE)),\" \",VLOOKUP(K362,Proposito_programa!$C$2:$E$59,2,FALSE))","v":"Gestión pública local"},{"$f":"IF(ISERROR(VLOOKUP(K362,Proposito_programa!$C$2:$E$59,3,FALSE)),\" \",VLOOKUP(K362,Proposito_programa!$C$2:$E$59,3,FALSE))","v":"Propósito 5: Construir Bogotá - Región con gobierno abierto, transparente y ciudadanía consciente"},"O23011605570000001697",1,1030559488,"CARLOS GIOVANNY CASTELLANOS GUZMAN","Persona Natural",null,null,null,null,8000000,null,null,null,8000000,2666667,"2022-11-09","2022-11-11","2023-01-10",60,null,null,null,null,null,null,"Terminado",0.33333337499999999]
[343,2022,"FDLRUU-CD-343-2022","https://community.secop.gov.co/Public/Tendering/ContractNoticePhases/View?PPI=CO1.PPI.21539014&isFromPublicArea=True&isModal=False","Contratos de prestación de servicios profesionales y de apoyo a la gestión","Contratación directa","Prestación de servicios profesionales y de apoyo a la gestión, o para la ejecución de trabajos artísticos que sólo puedan encomendarse a determinadas personas naturales","PRESTAR LOS SERVICIOS PROFESIONALES AL DESPACHO EN EL SEGUIMIENTO E IMPLEMENTACION DE POLITICAS PUBLICAS DISTRITALES EN LA ALCALDÍA LOCAL DE RAFAEL URIBE URIBE","Inversión","Un nuevo contrato social y ambiental para la Bogotá del Siglo XXI",57,{"$f":"IF(ISERROR(VLOOKUP(K363,Proposito_programa!$C$2:$E$59,2,FALSE)),\" \",VLOOKUP(K363,Proposito_programa!$C$2:$E$59,2,FALSE))","v":"Gestión pública local"},{"$f":"IF(ISERROR(VLOOKUP(K363,Proposito_programa!$C$2:$E$59,3,FALSE)),\" \",VLOOKUP(K363,Proposito_programa!$C$2:$E$59,3,FALSE))","v":"Propósito 5: Construir Bogotá - Región con gobierno abierto, transparente y ciudadanía consciente"},"O23011605570000001697",1,1010232623,"RONALD ESTEBAN PAEZ MUÑOZ","Persona Natural",null,null,null,null,14080000,null,null,null,14080000,4693333,"2022-11-10","2022-11-11","2023-01-10",60,null,null,null,null,null,null,"Terminado",0.33333330965909092]
[344,2022,"FDLRUU-CD-344-2022","https://community.secop.gov.co/Public/Tendering/ContractNoticePhases/View?PPI=CO1.PPI.21560305&isFromPublicArea=True&isModal=False\n","Contratos de prestación de servicios profesionales y de apoyo a la gestión","Contratación directa","Prestación de servicios profesionales y de apoyo a la gestión, o para la ejecución de trabajos artísticos que sólo puedan encomendarse a determinadas personas naturales","PRESTAR SUS SERVICIOS DE APOYO ADMINISTRATIVO ASISTENCIAL AL DESPACHO DE LA ALCALDÍA LOCAL DE RAFAEL URIBE URIBE","Inversión","Un nuevo contrato social y ambiental para la Bogotá del Siglo XXI",57,{"$f":"IF(ISERROR(VLOOKUP(K364,Proposito_programa!$C$2:$E$59,2,FALSE)),\" \",VLOOKUP(K364,Proposito_programa!$C$2:$E$59,2,FALSE))","v":"Gestión pública local"},{"$f":"IF(ISERROR(VLOOKUP(K364,Proposito_programa!$C$2:$E$59,3,FALSE)),\" \",VLOOKUP(K364,Proposito_programa!$C$2:$E$59,3,FALSE))","v":"Propósito 5: Construir Bogotá - Región con gobierno abierto, transparente y ciudadanía consciente"},"O23011605570000001697",1,79287603,"DIEGO ANDRES LOPEZ MORENO","Persona Natural",null,null,null,null,5400000,null,null,null,5400000,1800000,"2022-11-10","2022-11-11","2023-01-10",60,null,null,null,null,null,null,"Terminado",0.33333333333333331]
[345,2022,"FDLRUU-CD-345-2022","https://community.secop.gov.co/Public/Tendering/ContractNoticePhases/View?PPI=CO1.PPI.21567990&isFromPublicArea=True&isModal=False","Contratos de prestación de servicios profesionales y de apoyo a la gestión","Contratación directa","Prestación de servicios profesionales y de apoyo a la gestión, o para la ejecución de trabajos artísticos que sólo puedan encomendarse a determinadas personas naturales","APOYAR TÉCNICAMENTE AL ÁREA DE GESTIÓN DE DESARROLLO LOCAL EN EL SOPORTE TECNOLÓGICO E INFORMÁTICO QUE SE REQUIERA EN LA ALCALDÍA LOCAL DE RAFAEL URIBE URIBE","Inversión","Un nuevo contrato social y ambiental para la Bogotá del Siglo XXI",57,{"$f":"IF(ISERROR(VLOOKUP(K365,Proposito_programa!$C$2:$E$59,2,FALSE)),\" \",VLOOKUP(K365,Proposito_programa!$C$2:$E$59,2,FALSE))","v":"Gestión pública local"},{"$f":"IF(ISERROR(VLOOKUP(K365,Proposito_programa!$C$2:$E$59,3,FALSE)),\" \",VLOOKUP(K365,Proposito_programa!$C$2:$E$59,3,FALSE))","v":"Propósito 5: Construir Bogotá - Región con gobierno abierto, transparente y ciudadanía consciente"},"O23011605570000001697",1,79910956,"JHON ALEXANDER OLAYA CUESTA","Persona Natural",null,null,null,null,8000000,null,null,null,{"$f":"+W365+X365+Z365","v":8000000},2800000,"2022-11-10","2022-11-10","2023-01-09",60,null,null,null,null,null,null,"Terminado",0.35]
[346,2022,"FDLRUU-CD-346-2022","https://community.secop.gov.co/Public/Tendering/ContractNoticePhases/View?PPI=CO1.PPI.21566952&isFromPublicArea=True&isModal=False","Contratos de prestación de servicios profesionales y de apoyo a la gestión","Contratación directa","Prestación de servicios profesionales y de apoyo a la gestión, o para la ejecución de trabajos artísticos que sólo puedan encomendarse a determinadas personas naturales","APOYAR AL ÁREA DE DESARROLLO LOCAL EN EL CENTRO DE DOCUMENTACIÓN E INFORMACIÓN (CDI) EN EL MANEJO DE LAS COMUNICACIONES DE ENTRADA, INTERNAS Y EXTERNAS Y EN LA ATENCIÓN A LOS CIUDADANOS EN LOS DIFERENTES CANALES ESTABLECIDOS POR LA ENTIDAD","Inversión","Un nuevo contrato social y ambiental para la Bogotá del Siglo XXI",57,{"$f":"IF(ISERROR(VLOOKUP(K366,Proposito_programa!$C$2:$E$59,2,FALSE)),\" \",VLOOKUP(K366,Proposito_programa!$C$2:$E$59,2,FALSE))","v":"Gestión pública local"},{"$f":"IF(ISERROR(VLOOKUP(K366,Proposito_programa!$C$2:$E$59,3,FALSE)),\" \",VLOOKUP(K366,Proposito_programa!$C$2:$E$59,3,FALSE))","v":"Propósito 5: Construir Bogotá - Región con gobierno abierto, transparente y ciudadanía consciente"},"O23011605570000001697",1,52903975,"SONIA PATRICIA HERNANDEZ RODRIGUEZ","Persona Natural",null,null,null,null,5400000,null,null,null,5400000,1440000,"2022-11-11","2022-11-15","2023-01-14",60,null,null,null,null,null,null,"Terminado",0.26666666666666666]
[347,2022,"FDLRUU-CD-347-2022","https://community.secop.gov.co/Public/Tendering/ContractNoticePhases/View?PPI=CO1.PPI.21570853&isFromPublicArea=True&isModal=False","Contratos de prestación de servicios profesionales y de apoyo a la gestión","Contratación directa","Prestación de servicios profesionales y de apoyo a la gestión, o para la ejecución de trabajos artísticos que sólo puedan encomendarse a determinadas personas naturales","PRESTAR LOS SERVICIOS DE APOYO TÉCNICO ADMINISTRATIVO PARA EL ÁREA DE GESTIÓN DE DESARROLLO LOCAL DE LA ALCALDÍA LOCAL DE RAFAEL URIBE URIBE EN TEMAS DE INFRAESTRUCTURA COMO PARTE DE LA EJECUCION DEL PLAN DE DESARROLLO LOCAL","Inversión","Un nuevo contrato social y ambiental para la Bogotá del Siglo XXI",57,{"$f":"IF(ISERROR(VLOOKUP(K367,Proposito_programa!$C$2:$E$59,2,FALSE)),\" \",VLOOKUP(K367,Proposito_programa!$C$2:$E$59,2,FALSE))","v":"Gestión pública local"},{"$f":"IF(ISERROR(VLOOKUP(K367,Proposito_programa!$C$2:$E$59,3,FALSE)),\" \",VLOOKUP(K367,Proposito_programa!$C$2:$E$59,3,FALSE))","v":"Propósito 5: Construir Bogotá - Región con gobierno abierto, transparente y ciudadanía consciente"},"O23011605570000001697",1,1023896385,"ANGIE PAOLA BAUTISTA TRIANA","Persona Natural",null,null,null,null,8000000,null,null,null,8000000,2133333,"2022-11-11","2022-11-15","2023-01-14",60,null,null,null,null,null,null,"Terminado",0.26666662499999999]
[348,2022,"FDLRUU-CD-348-2022","https://community.secop.gov.co/Public/Tendering/ContractNoticePhases/View?PPI=CO1.PPI.21563169&isFromPublicArea=True&isModal=False","Contratos de prestación de servicios profesionales y de apoyo a la gestión","Contratación directa","Prestación de servicios profesionales y de apoyo a la gestión, o para la ejecución de trabajos artísticos que sólo puedan encomendarse a determinadas personas naturales","PRESTAR LOS SERVICIOS PROFESIONALES ESPECIALIZADOS PARA APOYAR EL SEGUIMIENTO Y LA SUPERVISIÓN DE LA EJECUCIÓN DE LOS PROYECTOS DE INVERSIÓN DESTINADOS A LA INTERVENCIÓN DE PARQUES Y DEMÁS INFRAESTRUCTURA DE LA LOCALIDAD DE RAFAEL URIBE URIBE\t","Inversión","Un nuevo contrato social y ambiental para la Bogotá del Siglo XXI",57,{"$f":"IF(ISERROR(VLOOKUP(K368,Proposito_programa!$C$2:$E$59,2,FALSE)),\" \",VLOOKUP(K368,Proposito_programa!$C$2:$E$59,2,FALSE))","v":"Gestión pública local"},{"$f":"IF(ISERROR(VLOOKUP(K368,Proposito_programa!$C$2:$E$59,3,FALSE)),\" \",VLOOKUP(K368,Proposito_programa!$C$2:$E$59,3,FALSE))","v":"Propósito 5: Construir Bogotá - Región con gobierno abierto, transparente y ciudadanía consciente"},"O23011605570000001697",1,68290146,"CLAUDIA INDIRA JIMENEZ ACOSTA","Persona Natural",null,null,null,null,14200000,null,null,null,14200000,4733333,"2022-11-10","2022-11-11","2023-01-10",60,null,null,null,null,null,null,"Terminado",0.33333330985915494]
[349,2022,"FDLRUU-CD-349-2022","https://community.secop.gov.co/Public/Tendering/ContractNoticePhases/View?PPI=CO1.PPI.21563163&isFromPublicArea=True&isModal=False","Contratos de prestación de servicios profesionales y de apoyo a la gestión","Contratación directa","Prestación de servicios profesionales y de apoyo a la gestión, o para la ejecución de trabajos artísticos que sólo puedan encomendarse a determinadas personas naturales","PRESTAR LOS SERVICIOS PROFESIONALES COMO ADMINISTRATIVOS EN EL SEGUIMIENTO DE PAGOS, LA ACTUALIZACIÓN, LIQUIDACIÓN Y DEPURACIÓN DE LOS CONTRATOS QUE SE ENCUENTRAN EN EJECUCION Y/O OBLIGACIONES POR PAGAR DE VIGENCIAS ANTERIORES QUE SE ENCUENTRAN VIGENTES EN EL FONDO DE DESARROLLO LOCAL DE RAFAEL URIBE URIBE.","Inversión","Un nuevo contrato social y ambiental para la Bogotá del Siglo XXI",57,{"$f":"IF(ISERROR(VLOOKUP(K369,Proposito_programa!$C$2:$E$59,2,FALSE)),\" \",VLOOKUP(K369,Proposito_programa!$C$2:$E$59,2,FALSE))","v":"Gestión pública local"},{"$f":"IF(ISERROR(VLOOKUP(K369,Proposito_programa!$C$2:$E$59,3,FALSE)),\" \",VLOOKUP(K369,Proposito_programa!$C$2:$E$59,3,FALSE))","v":"Propósito 5: Construir Bogotá - Región con gobierno abierto, transparente y ciudadanía consciente"},"O23011605570000001697",1,1101177020,"YIRLY NHAYIA PEÑA QUINTERO","Persona Natural",null,null,null,null,10800000,null,null,null,10800000,2880000,"2022-11-10","2022-11-15","2023-01-14",60,null,null,null,null,null,null,"Terminado",0.26666666666666666]
[350,2022,"FDLRUU-CD-350-2022","https://community.secop.gov.co/Public/Tendering/ContractNoticePhases/View?PPI=CO1.PPI.21561454&isFromPublicArea=True&isModal=False","Contratos de prestación de servicios profesionales y de apoyo a la gestión","Contratación directa","Prestación de servicios profesionales y de apoyo a la gestión, o para la ejecución de trabajos artísticos que sólo puedan encomendarse a determinadas personas naturales","PRESTAR LOS SERVICIOS PROFESIONALES COMO ADMINISTRATIVOS EN EL SEGUIMIENTO DE PAGOS, LA ACTUALIZACIÓN, LIQUIDACIÓN Y DEPURACIÓN DE LOS CONTRATOS QUE SE ENCUENTRAN EN EJECUCION Y/O OBLIGACIONES POR PAGAR DE VIGENCIAS ANTERIORES QUE SE ENCUENTRAN VIGENTES EN EL FONDO DE DESARROLLO LOCAL DE RAFAEL URIBE URIBE.","Inversión","Un nuevo contrato social y ambiental para la Bogotá del Siglo XXI",57,{"$f":"IF(ISERROR(VLOOKUP(K370,Proposito_programa!$C$2:$E$59,2,FALSE)),\" \",VLOOKUP(K370,Proposito_programa!$C$2:$E$59,2,FALSE))","v":"Gestión pública local"},{"$f":"IF(ISERROR(VLOOKUP(K370,Proposito_programa!$C$2:$E$59,3,FALSE)),\" \",VLOOKUP(K370,Proposito_programa!$C$2:$E$59,3,FALSE))","v":"Propósito 5: Construir Bogotá - Región con gobierno abierto, transparente y ciudadanía consciente"},"O23011605570000001697",1,87941057,"JOSE LUIS GOMEZ GONZALEZ","Persona Natural",null,null,null,null,10800000,null,null,null,10800000,2340000,"2022-11-18","2022-11-18","2023-01-17",60,null,null,null,null,null,null,"Terminado",0.21666666666666667]
[351,2022,"FDLRUU-CD-351-2022","https://community.secop.gov.co/Public/Tendering/ContractNoticePhases/View?PPI=CO1.PPI.21597809&isFromPublicArea=True&isModal=False","Contratos de prestación de servicios profesionales y de apoyo a la gestión","Contratación directa","Prestación de servicios profesionales y de apoyo a la gestión, o para la ejecución de trabajos artísticos que sólo puedan encomendarse a determinadas personas naturales","\tAPOYAR JURIDICAMENTE EN LA EJECUCION Y EL SEGUIMIENTO DE LAS FUNCIONES ASIGNADAS AL AREA DE GESTION POLICIVA JURIDICA DE LA ALCALDIA LOCAL DE RAFAEL URIBE URIBE","Inversión","Un nuevo contrato social y ambiental para la Bogotá del Siglo XXI",57,{"$f":"IF(ISERROR(VLOOKUP(K371,Proposito_programa!$C$2:$E$59,2,FALSE)),\" \",VLOOKUP(K371,Proposito_programa!$C$2:$E$59,2,FALSE))","v":"Gestión pública local"},{"$f":"IF(ISERROR(VLOOKUP(K371,Proposito_programa!$C$2:$E$59,3,FALSE)),\" \",VLOOKUP(K371,Proposito_programa!$C$2:$E$59,3,FALSE))","v":"Propósito 5: Construir Bogotá - Región con gobierno abierto, transparente y ciudadanía consciente"},"O23011605570000001698",1,13541996,"RAUL ENRIQUE DANGOND CONTRERAS","Persona Natural",null,null,null,null,10800000,null,null,null,10800000,2340000,"2022-11-11","2022-11-18","2023-01-17",60,null,null,null,null,null,null,"Terminado",0.21666666666666667]
[352,2022,"FDLRUU-CD-352-2022","https://community.secop.gov.co/Public/Tendering/ContractNoticePhases/View?PPI=CO1.PPI.21588479&isFromPublicArea=True&isModal=False","Contratos de prestación de servicios profesionales y de apoyo a la gestión","Contratación directa","Prestación de servicios profesionales y de apoyo a la gestión, o para la ejecución de trabajos artísticos que sólo puedan encomendarse a determinadas personas naturales","APOYAR AL ÁREA DE DESARROLLO LOCAL EN EL CENTRO DE DOCUMENTACIÓN E INFORMACIÓN (CDI) EN EL MANEJO DE LAS COMUNICACIONES DE ENTRADA, INTERNAS Y EXTERNAS Y EN LA ATENCIÓN A LOS CIUDADANOS EN LOS DIFERENTES CANALES ESTABLECIDOS POR LA ENTIDAD","Inversión","Un nuevo contrato social y ambiental para la Bogotá del Siglo XXI",57,{"$f":"IF(ISERROR(VLOOKUP(K372,Proposito_programa!$C$2:$E$59,2,FALSE)),\" \",VLOOKUP(K372,Proposito_programa!$C$2:$E$59,2,FALSE))","v":"Gestión pública local"},{"$f":"IF(ISERROR(VLOOKUP(K372,Proposito_programa!$C$2:$E$59,3,FALSE)),\" \",VLOOKUP(K372,Proposito_programa!$C$2:$E$59,3,FALSE))","v":"Propósito 5: Construir Bogotá - Región con gobierno abierto, transparente y ciudadanía consciente"},"O23011605570000001697",1,1016109867,"LAURA VANESSA PAEZ LOPEZ","Persona Natural",null,null,null,null,5400000,null,null,null,5400000,1800000,"2022-11-11","2022-11-11","2023-01-10",60,null,null,null,null,null,null,"Terminado",0.33333333333333331]
[353,2022,"FDLRUU-CD-353-2022","https://community.secop.gov.co/Public/Tendering/ContractNoticePhases/View?PPI=CO1.PPI.21600153&isFromPublicArea=True&isModal=False","Contratos de prestación de servicios profesionales y de apoyo a la gestión","Contratación directa","Prestación de servicios profesionales y de apoyo a la gestión, o para la ejecución de trabajos artísticos que sólo puedan encomendarse a determinadas personas naturales","APOYAR TÉCNICAMENTE A LA ALCALDÍA LOCAL EN EL ADECUADO MANEJO DE LOS DOCUMENTOS OFICIALES, MEDIANTE LA SOCIALIZACIÓN, IMPLEMENTACIÓN, MONITOREO Y SEGUIMIENTO AL APLICATIVO ORFEO, EN LAS DIFERENTES DEPENDENCIAS, CON ÉNFASIS EN EL CDI DEL AREA DE GESTION DE DESARROLLO LOCAL","Inversión","Un nuevo contrato social y ambiental para la Bogotá del Siglo XXI",57,{"$f":"IF(ISERROR(VLOOKUP(K373,Proposito_programa!$C$2:$E$59,2,FALSE)),\" \",VLOOKUP(K373,Proposito_programa!$C$2:$E$59,2,FALSE))","v":"Gestión pública local"},{"$f":"IF(ISERROR(VLOOKUP(K373,Proposito_programa!$C$2:$E$59,3,FALSE)),\" \",VLOOKUP(K373,Proposito_programa!$C$2:$E$59,3,FALSE))","v":"Propósito 5: Construir Bogotá - Región con gobierno abierto, transparente y ciudadanía consciente"},"O23011605570000001697",1,1033819386,"ANDREA CAROLINA CAICEDO GARAVITO","Persona Natural",null,null,null,null,6800000,null,null,null,6800000,1813333,"2022-11-11","2022-11-15","2023-01-14",60,null,null,null,null,null,null,"Terminado",0.26666661764705885]
[354,2022,"FDLRUU CMA-354-2022","https://community.secop.gov.co/Public/Tendering/ContractNoticePhases/View?PPI=CO1.PPI.21600566&isFromPublicArea=True&isModal=False","Contratos de prestación de servicios profesionales y de apoyo a la gestión","Contratación directa","Prestación de servicios profesionales y de apoyo a la gestión, o para la ejecución de trabajos artísticos que sólo puedan encomendarse a determinadas personas naturales","APOYAR CON SERVICIOS PROFESIONALES AL ÁREA DE GESTIÓN DE DESARROLLO LOCAL PARA APOYAR A LA ADMINISTRACIÓN EN LA FORMULACIÓN Y SEGUIMIENTO A LOS PROYECTOS DE INVERSIÓN Y GASTOS DE FUNCIONAMIENTO DEL PROYECTO DE FORTALECIMIENTO INSTITUCIONAL DE LA ALCALDÍA LOCAL","Inversión","Un nuevo contrato social y ambiental para la Bogotá del Siglo XXI",57,{"$f":"IF(ISERROR(VLOOKUP(K374,Proposito_programa!$C$2:$E$59,2,FALSE)),\" \",VLOOKUP(K374,Proposito_programa!$C$2:$E$59,2,FALSE))","v":"Gestión pública local"},{"$f":"IF(ISERROR(VLOOKUP(K374,Proposito_programa!$C$2:$E$59,3,FALSE)),\" \",VLOOKUP(K374,Proposito_programa!$C$2:$E$59,3,FALSE))","v":"Propósito 5: Construir Bogotá - Región con gobierno abierto, transparente y ciudadanía consciente"},"O23011605570000001697",1,19398360,"ALVARO DE JESUS APARICIO CELY","Persona Natural",null,null,null,null,12400000,null,null,null,12400000,3306667,"2022-11-11","2022-11-15","2023-01-14",60,null,null,null,null,null,null,"Terminado",0.26666669354838712]
[355,2022,"FDLRUU-CD-355-2022","https://community.secop.gov.co/Public/Tendering/ContractNoticePhases/View?PPI=CO1.PPI.21592393&isFromPublicArea=True&isModal=False","Contratos de prestación de servicios profesionales y de apoyo a la gestión","Contratación directa","Prestación de servicios profesionales y de apoyo a la gestión, o para la ejecución de trabajos artísticos que sólo puedan encomendarse a determinadas personas naturales","APOYAR LA GESTIÓN DOCUMENTAL DE LA ALCALDÍA LOCAL AL EQUIPO JURÍDICO DE DEPURACIÓN EN LAS LABORES OPERATIVAS QUE GENERA EL PROCESO DE IMPULSO DE LAS ACTUACIONES ADMINISTRATIVAS EXISTENTES EN LA ALCALDÍA LOCAL DE RAFAEL URIBE URIBE","Inversión","Un nuevo contrato social y ambiental para la Bogotá del Siglo XXI",57,{"$f":"IF(ISERROR(VLOOKUP(K375,Proposito_programa!$C$2:$E$59,2,FALSE)),\" \",VLOOKUP(K375,Proposito_programa!$C$2:$E$59,2,FALSE))","v":"Gestión pública local"},{"$f":"IF(ISERROR(VLOOKUP(K375,Proposito_programa!$C$2:$E$59,3,FALSE)),\" \",VLOOKUP(K375,Proposito_programa!$C$2:$E$59,3,FALSE))","v":"Propósito 5: Construir Bogotá - Región con gobierno abierto, transparente y ciudadanía consciente"},"O23011605570000001698",1,52517945,"INGRIS YOHANNA MORALES SUAREZ","Persona Natural",null,null,null,null,3760000,null,null,null,3760000,877333,"2022-11-15","2022-11-17","2023-01-16",60,null,null,null,null,null,null,"Terminado",0.23333324468085107]
[356,2022,"FDLRUU-CD-356-2022","https://community.secop.gov.co/Public/Tendering/ContractNoticePhases/View?PPI=CO1.PPI.21630448&isFromPublicArea=True&isModal=False","Contratos de prestación de servicios profesionales y de apoyo a la gestión","Contratación directa","Prestación de servicios profesionales y de apoyo a la gestión, o para la ejecución de trabajos artísticos que sólo puedan encomendarse a determinadas personas naturales","APOYAR TÉCNICAMENTE LAS DISTINTAS ETAPAS DE LOS PROCESOS DE COMPETENCIA DE LA ALCALDÍA LOCAL PARA LA DEPURACIÓN DE LAS ACTUACIONES ADMINISTRATIVAS.","Inversión","Un nuevo contrato social y ambiental para la Bogotá del Siglo XXI",57,{"$f":"IF(ISERROR(VLOOKUP(K376,Proposito_programa!$C$2:$E$59,2,FALSE)),\" \",VLOOKUP(K376,Proposito_programa!$C$2:$E$59,2,FALSE))","v":"Gestión pública local"},{"$f":"IF(ISERROR(VLOOKUP(K376,Proposito_programa!$C$2:$E$59,3,FALSE)),\" \",VLOOKUP(K376,Proposito_programa!$C$2:$E$59,3,FALSE))","v":"Propósito 5: Construir Bogotá - Región con gobierno abierto, transparente y ciudadanía consciente"},"O23011605570000001698",1,1020753752,"CARLOS FELIPE SUAREZ PIEDRAHITA","Persona Natural",null,null,null,null,10800000,null,null,null,10800000,2520000,"2022-11-15","2022-11-17","2023-01-16",60,null,null,null,null,null,null,"Terminado",0.23333333333333334]
[357,2022,"FDLRUU-CD-357-2022","https://community.secop.gov.co/Public/Tendering/ContractNoticePhases/View?PPI=CO1.PPI.21665868&isFromPublicArea=True&isModal=False","Contratos de prestación de servicios profesionales y de apoyo a la gestión","Contratación directa","Prestación de servicios profesionales y de apoyo a la gestión, o para la ejecución de trabajos artísticos que sólo puedan encomendarse a determinadas personas naturales","PRESTAR LOS SERVICIOS PROFESIONALES COMO ABOGADO PARA APOYAR AL FONDO DE DESARROLLO LOCAL EN EL ANÁLISIS, REVISIÓN, TRÁMITE PARA COBRO PERSUASIVO Y COACTIVO, SOLICITUDES DE ENTES DE CONTROL, CORPORACIONES PÚBLICAS Y LOS CONCEPTOS JURÍDICOS QUE SE LE SOLICITEN","Inversión","Un nuevo contrato social y ambiental para la Bogotá del Siglo XXI",57,{"$f":"IF(ISERROR(VLOOKUP(K377,Proposito_programa!$C$2:$E$59,2,FALSE)),\" \",VLOOKUP(K377,Proposito_programa!$C$2:$E$59,2,FALSE))","v":"Gestión pública local"},{"$f":"IF(ISERROR(VLOOKUP(K377,Proposito_programa!$C$2:$E$59,3,FALSE)),\" \",VLOOKUP(K377,Proposito_programa!$C$2:$E$59,3,FALSE))","v":"Propósito 5: Construir Bogotá - Región con gobierno abierto, transparente y ciudadanía consciente"},"O23011605570000001698",1,1033773166,"YURY TATIANA ANGULO PATIÑO","Persona Natural",null,null,null,null,11800000,null,null,null,11800000,1573333,"2022-11-18","2022-11-23","2023-01-22",60,null,null,null,null,null,null,"Terminado",0.13333330508474575]
[358,2022,"FDLRUU-CD-358-2022","https://community.secop.gov.co/Public/Tendering/ContractNoticePhases/View?PPI=CO1.PPI.21600268&isFromPublicArea=True&isModal=False","Contratos de prestación de servicios profesionales y de apoyo a la gestión","Contratación directa","Prestación de servicios profesionales y de apoyo a la gestión, o para la ejecución de trabajos artísticos que sólo puedan encomendarse a determinadas personas naturales","PRESTAR LOS SERVICIOS PROFESIONALES PARA ADELANTAR LAS ACCIONES TENDIENTES AL AGENCIAMIENTO E IMPLEMENTACIÓN DE LAS POLÍTICAS PÚBLICAS DEL ORDEN DISTRITAL EN LO LOCAL, SEGUIMIENTO AL PLAN DE DESARROLLO LOCAL, ACOMPAÑAR LAS INSTANCIAS DE PARTICIPACIÓN QUE LE SEAN ASIGNADAS POR EL SUPERVISOR Y APOYAR LAS DEMÁS ACTIVIDADES QUE SE GENEREN EN EL ÁREA DE GESTIÓN DEL DESARROLLO LOCAL","Inversión","Un nuevo contrato social y ambiental para la Bogotá del Siglo XXI",57,{"$f":"IF(ISERROR(VLOOKUP(K378,Proposito_programa!$C$2:$E$59,2,FALSE)),\" \",VLOOKUP(K378,Proposito_programa!$C$2:$E$59,2,FALSE))","v":"Gestión pública local"},{"$f":"IF(ISERROR(VLOOKUP(K378,Proposito_programa!$C$2:$E$59,3,FALSE)),\" \",VLOOKUP(K378,Proposito_programa!$C$2:$E$59,3,FALSE))","v":"Propósito 5: Construir Bogotá - Región con gobierno abierto, transparente y ciudadanía consciente"},"O23011605570000001697",1,79443062,"LUIS FERNANDO BARRETO GONZALEZ","Persona Natural",null,null,null,null,10800000,null,null,null,10800000,2520000,"2022-11-16","2022-11-17","2023-01-16",60,null,null,null,null,null,null,"Terminado",0.23333333333333334]
[359,2022,"FDLRUU-CD-359-2022","https://community.secop.gov.co/Public/Tendering/ContractNoticePhases/View?PPI=CO1.PPI.21653163&isFromPublicArea=True&isModal=False","Contratos de prestación de servicios profesionales y de apoyo a la gestión","Contratación directa","Prestación de servicios profesionales y de apoyo a la gestión, o para la ejecución de trabajos artísticos que sólo puedan encomendarse a determinadas personas naturales","APOYAR LA GESTIÓN DOCUMENTAL DE LA ALCALDÍA LOCAL, ACOMPAÑANDO AL EQUIPO JURÍDICO DE DEPURACIÓN EN LAS LABORES OPERATIVAS QUE GENERA EL PROCESO DE IMPULSO DE LAS ACTUACIONES ADMINISTRATIVAS EXISTENTES EN LA ALCALDÍA LOCAL DE RAFAEL URIBE URIBE\t","Inversión","Un nuevo contrato social y ambiental para la Bogotá del Siglo XXI",57,{"$f":"IF(ISERROR(VLOOKUP(K379,Proposito_programa!$C$2:$E$59,2,FALSE)),\" \",VLOOKUP(K379,Proposito_programa!$C$2:$E$59,2,FALSE))","v":"Gestión pública local"},{"$f":"IF(ISERROR(VLOOKUP(K379,Proposito_programa!$C$2:$E$59,3,FALSE)),\" \",VLOOKUP(K379,Proposito_programa!$C$2:$E$59,3,FALSE))","v":"Propósito 5: Construir Bogotá - Región con gobierno abierto, transparente y ciudadanía consciente"},"O23011605570000001698",1,1032436573,"CRISTHIAN CAMILO GARAVITO MARTINEZ","Persona Natural",null,null,null,null,5400000,null,null,null,5400000,0,"2022-11-16","2022-11-18","2023-01-17",60,null,null,null,null,null,null,"Terminado",0]
[360,2022,"FDLRUU-CD-360-2022","https://community.secop.gov.co/Public/Tendering/ContractNoticePhases/View?PPI=CO1.PPI.21646555&isFromPublicArea=True&isModal=False","Contratos de prestación de servicios profesionales y de apoyo a la gestión","Contratación directa","Prestación de servicios profesionales y de apoyo a la gestión, o para la ejecución de trabajos artísticos que sólo puedan encomendarse a determinadas personas naturales","PRESTAR SERVICIOS PROFESIONALES EN EL ÁREA DE GESTIÓN\nPOLICIVA JURIDICA DE LA ALCALDÍA LOCAL DE RAFAEL URIBE URIBE, PARA VIGILANCIA\nY CONTROL DE LAS ZONAS DE PROTECCION AMBIENTAL, REASENTAMIENTOS, RESERVAS\nAMBIENTALES, HUMEDALES Y ECOSISTEMAS","Inversión","Un nuevo contrato social y ambiental para la Bogotá del Siglo XXI",57,{"$f":"IF(ISERROR(VLOOKUP(K380,Proposito_programa!$C$2:$E$59,2,FALSE)),\" \",VLOOKUP(K380,Proposito_programa!$C$2:$E$59,2,FALSE))","v":"Gestión pública local"},{"$f":"IF(ISERROR(VLOOKUP(K380,Proposito_programa!$C$2:$E$59,3,FALSE)),\" \",VLOOKUP(K380,Proposito_programa!$C$2:$E$59,3,FALSE))","v":"Propósito 5: Construir Bogotá - Región con gobierno abierto, transparente y ciudadanía consciente"},"O23011605570000001698",1,1033700550,"DANIEL ALBERTO VEGA OCHOA","Persona Natural",null,null,null,null,10800000,null,null,null,10800000,0,"2022-11-16","2022-11-17","2023-01-16",60,null,null,null,null,null,null,"Terminado",0]
[361,2022,"FDLRUU-CD-361-2022","https://community.secop.gov.co/Public/Tendering/ContractNoticePhases/View?PPI=CO1.PPI.21658219&isFromPublicArea=True&isModal=False","Contratos de prestación de servicios profesionales y de apoyo a la gestión","Contratación directa","Prestación de servicios profesionales y de apoyo a la gestión, o para la ejecución de trabajos artísticos que sólo puedan encomendarse a determinadas personas naturales","APOYAR JURIDICAMENTE EN LA EJECUCION Y EL SEGUIMIENTO DE LAS FUNCIONES ASIGNADAS AL AREA DE GESTION POLICIVA JURIDICA DE LA ALCALDIA LOCAL DE RAFAEL URIBE URIBE","Inversión","Un nuevo contrato social y ambiental para la Bogotá del Siglo XXI",57,{"$f":"IF(ISERROR(VLOOKUP(K381,Proposito_programa!$C$2:$E$59,2,FALSE)),\" \",VLOOKUP(K381,Proposito_programa!$C$2:$E$59,2,FALSE))","v":"Gestión pública local"},{"$f":"IF(ISERROR(VLOOKUP(K381,Proposito_programa!$C$2:$E$59,3,FALSE)),\" \",VLOOKUP(K381,Proposito_programa!$C$2:$E$59,3,FALSE))","v":"Propósito 5: Construir Bogotá - Región con gobierno abierto, transparente y ciudadanía consciente"},"O23011605570000001698",1,1077436601," MANUEL FERLEY MATURANA MENA","Persona Natural",null,null,null,null,10800000,null,null,null,10800000,0,"2022-11-16","2022-11-17","2023-01-16",60,null,null,null,null,null,null,"Terminado",0]
[362,2022,"FDLRUU-CD-362-2022","https://community.secop.gov.co/Public/Tendering/ContractNoticePhases/View?PPI=CO1.PPI.21635143&isFromPublicArea=True&isModal=False","Contratos de prestación de servicios profesionales y de apoyo a la gestión","Contratación directa","Prestación de servicios profesionales y de apoyo a la gestión, o para la ejecución de trabajos artísticos que sólo puedan encomendarse a determinadas personas naturales","PRESTAR LOS SERVICIOS PROFESIONALES A LA ALCALDÍA LOCAL DE RAFAEL URIBE URIBE, PARA LA EJECUCIÓN Y DIVULGACION DE LAS ACTIVIDADES COMUNITARIAS Y DE APOYO A LOS PROCESOS DE PARTICIPACIÓN EN EL MARCO DEL SISTEMA LOCAL Y DISTRITAL DE PARTICIPACIÓN, LAS RELACIONES INTERINSTITUCIONALES Y LA EJECUCIÓN DE LOS PROYECTOS QUE HACEN PARTE DEL PLAN DE DESARROLLO","Inversión","Un nuevo contrato social y ambiental para la Bogotá del Siglo XXI",57,{"$f":"IF(ISERROR(VLOOKUP(K382,Proposito_programa!$C$2:$E$59,2,FALSE)),\" \",VLOOKUP(K382,Proposito_programa!$C$2:$E$59,2,FALSE))","v":"Gestión pública local"},{"$f":"IF(ISERROR(VLOOKUP(K382,Proposito_programa!$C$2:$E$59,3,FALSE)),\" \",VLOOKUP(K382,Proposito_programa!$C$2:$E$59,3,FALSE))","v":"Propósito 5: Construir Bogotá - Región con gobierno abierto, transparente y ciudadanía consciente"},"O23011605570000001697",1,1071548371,"LADY JOHANNA MORENO HERRERA","Persona Natural",null,null,null,null,10800000,null,null,null,10800000,2520000,"2022-11-16","2022-11-17","2023-01-16",60,null,null,null,null,null,null,"Terminado",0.23333333333333334]
[363,2022,"FDLRUU-CD-363-2022","https://community.secop.gov.co/Public/Tendering/ContractNoticePhases/View?PPI=CO1.PPI.21635363&isFromPublicArea=True&isModal=False","Contratos de prestación de servicios profesionales y de apoyo a la gestión","Contratación directa","Prestación de servicios profesionales y de apoyo a la gestión, o para la ejecución de trabajos artísticos que sólo puedan encomendarse a determinadas personas naturales","PRESTAR LOS SERVICIOS PROFESIONALES PARA ADELANTAR LAS ACCIONES TENDIENTES AL AGENCIAMIENTO E IMPLEMENTACIÓN DE LAS POLÍTICAS PÚBLICAS DEL ORDEN DISTRITAL EN LO LOCAL, SEGUIMIENTO AL PLAN DE DESARROLLO LOCAL, ACOMPAÑAR LAS INSTANCIAS DE PARTICIPACIÓN QUE LE SEAN ASIGNADAS POR EL SUPERVISOR Y APOYAR LAS DEMÁS ACTIVIDADES QUE SE GENEREN EN EL ÁREA DE GESTIÓN DEL DESARROLLO LOCAL","Inversión","Un nuevo contrato social y ambiental para la Bogotá del Siglo XXI",57,{"$f":"IF(ISERROR(VLOOKUP(K383,Proposito_programa!$C$2:$E$59,2,FALSE)),\" \",VLOOKUP(K383,Proposito_programa!$C$2:$E$59,2,FALSE))","v":"Gestión pública local"},{"$f":"IF(ISERROR(VLOOKUP(K383,Proposito_programa!$C$2:$E$59,3,FALSE)),\" \",VLOOKUP(K383,Proposito_programa!$C$2:$E$59,3,FALSE))","v":"Propósito 5: Construir Bogotá - Región con gobierno abierto, transparente y ciudadanía consciente"},"O23011605570000001697",1,1026283917,"LIZETH JURANY HERNANDEZ SANABRIA","Persona Natural",null,null,null,null,10800000,null,null,null,10800000,2520000,"2022-11-15","2022-11-17","2023-01-16",60,null,null,null,null,null,null,"Terminado",0.23333333333333334]
[365,2022,"FDLRUU-CD-365-2022","https://community.secop.gov.co/Public/Tendering/ContractNoticePhases/View?PPI=CO1.PPI.21641589&isFromPublicArea=True&isModal=False","Contratos de prestación de servicios profesionales y de apoyo a la gestión","Contratación directa","Prestación de servicios profesionales y de apoyo a la gestión, o para la ejecución de trabajos artísticos que sólo puedan encomendarse a determinadas personas naturales","PRESTAR LOS SERVICIOS PROFESIONALES APOYANDO AL FONDO DE DESARROLLO LOCAL DE RAFAEL URIBE URIBE EN EL SEGUIMIENTO DE PAGOS, ACTUALIZACIÓN LIQUIDACIÓN Y DEPURACIÓN DE LOS CONTRATOS QUE SE ENCUENTRAN EN EJECUCIONY/O OBLIGACIONES POR PAGAR DE VIGENCIAS ANTERIORES QUE SE ENCUENTRAN VIGENTES.","Inversión","Un nuevo contrato social y ambiental para la Bogotá del Siglo XXI",57,{"$f":"IF(ISERROR(VLOOKUP(K384,Proposito_programa!$C$2:$E$59,2,FALSE)),\" \",VLOOKUP(K384,Proposito_programa!$C$2:$E$59,2,FALSE))","v":"Gestión pública local"},{"$f":"IF(ISERROR(VLOOKUP(K384,Proposito_programa!$C$2:$E$59,3,FALSE)),\" \",VLOOKUP(K384,Proposito_programa!$C$2:$E$59,3,FALSE))","v":"Propósito 5: Construir Bogotá - Región con gobierno abierto, transparente y ciudadanía consciente"},"O23011605570000001697",1,79878658,"JULIO CESAR FLOREZ MORENO","Persona Natural",null,null,null,null,10800000,null,null,null,10800000,2340000,"2022-11-15","2022-11-18","2023-01-17",60,null,null,null,null,null,null,"Terminado",0.21666666666666667]
[366,2022,"FDLRUU-CD-366-2022","https://community.secop.gov.co/Public/Tendering/ContractNoticePhases/View?PPI=CO1.PPI.21646004&isFromPublicArea=True&isModal=False","Contratos de prestación de servicios profesionales y de apoyo a la gestión","Contratación directa","Prestación de servicios profesionales y de apoyo a la gestión, o para la ejecución de trabajos artísticos que sólo puedan encomendarse a determinadas personas naturales","APOYAR AL ALCALDE (SA) LOCAL EN LA PROMOCIÓN, ACOMPAÑAMIENTO, COORDINACIÓN Y ATENCIÓN DE LAS INSTANCIAS DE COORDINACIÓN INTERINSTITUCIONALES Y LAS INSTANCIAS DE PARTICIPACIÓN LOCALES, ASÍ COMO LOS PROCESOS COMUNITARIOS EN LA LOCALIDAD","Inversión","Un nuevo contrato social y ambiental para la Bogotá del Siglo XXI",57,{"$f":"IF(ISERROR(VLOOKUP(K385,Proposito_programa!$C$2:$E$59,2,FALSE)),\" \",VLOOKUP(K385,Proposito_programa!$C$2:$E$59,2,FALSE))","v":"Gestión pública local"},{"$f":"IF(ISERROR(VLOOKUP(K385,Proposito_programa!$C$2:$E$59,3,FALSE)),\" \",VLOOKUP(K385,Proposito_programa!$C$2:$E$59,3,FALSE))","v":"Propósito 5: Construir Bogotá - Región con gobierno abierto, transparente y ciudadanía consciente"},"O23011605570000001697",1,80913594,"CARLOS ALEXANDER CASTILLO MUÑOZ","Persona Natural",null,null,null,null,13800000,null,null,null,13800000,3220000,"2022-11-16","2022-11-17","2023-01-16",60,null,null,null,null,null,null,"Terminado",0.23333333333333334]
[367,2022,"FDLRUU-CD-367-2022","https://community.secop.gov.co/Public/Tendering/ContractNoticePhases/View?PPI=CO1.PPI.21660846&isFromPublicArea=True&isModal=False","Contratos de prestación de servicios profesionales y de apoyo a la gestión","Contratación directa","Prestación de servicios profesionales y de apoyo a la gestión, o para la ejecución de trabajos artísticos que sólo puedan encomendarse a determinadas personas naturales","APOYAR TÉCNICAMENTE LAS DISTINTAS ETAPAS DE LOS PROCESOS DE COMPETENCIA DE LAS INSPECCIONES DE POLICÍA DE LA LOCALIDAD, SEGÚN REPARTO","Inversión","Un nuevo contrato social y ambiental para la Bogotá del Siglo XXI",57,{"$f":"IF(ISERROR(VLOOKUP(K386,Proposito_programa!$C$2:$E$59,2,FALSE)),\" \",VLOOKUP(K386,Proposito_programa!$C$2:$E$59,2,FALSE))","v":"Gestión pública local"},{"$f":"IF(ISERROR(VLOOKUP(K386,Proposito_programa!$C$2:$E$59,3,FALSE)),\" \",VLOOKUP(K386,Proposito_programa!$C$2:$E$59,3,FALSE))","v":"Propósito 5: Construir Bogotá - Región con gobierno abierto, transparente y ciudadanía consciente"},"O23011605570000001698",1,79692123,"CAMPO ELIAS GUTIERREZ GARCÍA","Persona Natural",null,null,null,null,10800000,null,null,null,10800000,0,"2022-11-16","2022-11-17","2023-01-16",60,null,null,null,null,null,null,"Terminado",0]
[368,2022,"FDLRUU-CD-368-2022","https://community.secop.gov.co/Public/Tendering/ContractNoticePhases/View?PPI=CO1.PPI.21661157&isFromPublicArea=True&isModal=False","Contratos de prestación de servicios profesionales y de apoyo a la gestión","Contratación directa","Prestación de servicios profesionales y de apoyo a la gestión, o para la ejecución de trabajos artísticos que sólo puedan encomendarse a determinadas personas naturales","PRESTAR LOS SERVICIOS PROFESIONALES EN EL SEGUIMIENTO DE PAGOS, LA ACTUALIZACIÓN, LIQUIDACIÓN Y DEPURACIÓN DE LOS CONTRATOS QUE SE ENCUENTRAN EN EJECUCION Y/O OBLIGACIONES POR PAGAR DE VIGENCIAS ANTERIORES QUE SE ENCUENTRAN VIGENTES EN EL FONDO DE DESARROLLO LOCAL DE RAFAEL URIBE URIBE\t","Inversión","Un nuevo contrato social y ambiental para la Bogotá del Siglo XXI",57,{"$f":"IF(ISERROR(VLOOKUP(K387,Proposito_programa!$C$2:$E$59,2,FALSE)),\" \",VLOOKUP(K387,Proposito_programa!$C$2:$E$59,2,FALSE))","v":"Gestión pública local"},{"$f":"IF(ISERROR(VLOOKUP(K387,Proposito_programa!$C$2:$E$59,3,FALSE)),\" \",VLOOKUP(K387,Proposito_programa!$C$2:$E$59,3,FALSE))","v":"Propósito 5: Construir Bogotá - Región con gobierno abierto, transparente y ciudadanía consciente"},"O23011605570000001697",1,1022950072,"JENNY VIVIANA SASTOQUE LOPEZ","Persona Natural",null,null,null,null,10800000,null,null,null,10800000,2520000,"2022-11-16","2022-11-17","2023-01-16",60,null,null,null,null,null,null,"Terminado",0.23333333333333334]
[369,2022,"FDLRUU-CD-369-2022","https://community.secop.gov.co/Public/Tendering/ContractNoticePhases/View?PPI=CO1.PPI.21654546&isFromPublicArea=True&isModal=False","Contratos de prestación de servicios profesionales y de apoyo a la gestión","Contratación directa","Prestación de servicios profesionales y de apoyo a la gestión, o para la ejecución de trabajos artísticos que sólo puedan encomendarse a determinadas personas naturales","APOYAR LA GESTIÓN DOCUMENTAL DE LA ALCALDÍA LOCAL, ACOMPAÑANDO AL EQUIPO JURÍDICO DE DEPURACIÓN EN LAS LABORES OPERATIVAS QUE GENERA EL PROCESO DE IMPULSO DE LAS ACTUACIONES ADMINISTRATIVAS EXISTENTES EN LA ALCALDÍA LOCAL DE RAFAEL URIBE URIBE\t","Inversión","Un nuevo contrato social y ambiental para la Bogotá del Siglo XXI",57,{"$f":"IF(ISERROR(VLOOKUP(K388,Proposito_programa!$C$2:$E$59,2,FALSE)),\" \",VLOOKUP(K388,Proposito_programa!$C$2:$E$59,2,FALSE))","v":"Gestión pública local"},{"$f":"IF(ISERROR(VLOOKUP(K388,Proposito_programa!$C$2:$E$59,3,FALSE)),\" \",VLOOKUP(K388,Proposito_programa!$C$2:$E$59,3,FALSE))","v":"Propósito 5: Construir Bogotá - Región con gobierno abierto, transparente y ciudadanía consciente"},"O23011605570000001698",1,1031177773,"NICOLAS MORA RODRIGUEZ","Persona Natural",null,null,null,null,5400000,null,null,null,5400000,1260000,"2022-10-30","2022-11-17","2023-01-16",60,null,null,null,null,null,null,"Terminado",0.23333333333333334]
[370,2022,"FDLRUU-LP-006-2022","https://community.secop.gov.co/Public/Tendering/ContractNoticePhases/View?PPI=CO1.PPI.20505177&isFromPublicArea=True&isModal=False","Contratos de prestación de servicios","Licitación pública","No aplica","PRESTAR SERVICIOS PARA REALIZAR ACTIVIDADES DE BIENESTAR Y RESPIRO A CUIDADORAS Y CUIDADORES DE LA LOCALIDAD RAFAEL URIBE URIBE","Inversión","Un nuevo contrato social y ambiental para la Bogotá del Siglo XXI",6,{"$f":"IF(ISERROR(VLOOKUP(K389,Proposito_programa!$C$2:$E$59,2,FALSE)),\" \",VLOOKUP(K389,Proposito_programa!$C$2:$E$59,2,FALSE))","v":"Sistema Distrital de Cuidado"},{"$f":"IF(ISERROR(VLOOKUP(K389,Proposito_programa!$C$2:$E$59,3,FALSE)),\" \",VLOOKUP(K389,Proposito_programa!$C$2:$E$59,3,FALSE))","v":"Propósito 1: Hacer un nuevo contrato social para incrementar la inclusión social, productiva y política"},"O23011601060000001657",null,830069703,"FUNDACIÓN JUSTICIA SOCIAL","Persona Jurídica",null,null,null,null,552983163,null,1,63119268,616102431,0,"2022-11-21","2022-12-01","2023-05-30",180,null,null,null,null,null,null,"En ejecución",0]
[371,2022,"FDLRUU-CD-371-2022","https://community.secop.gov.co/Public/Tendering/ContractNoticePhases/View?PPI=CO1.PPI.21661707&isFromPublicArea=True&isModal=False","Contratos de prestación de servicios profesionales y de apoyo a la gestión","Contratación directa","Prestación de servicios profesionales y de apoyo a la gestión, o para la ejecución de trabajos artísticos que sólo puedan encomendarse a determinadas personas naturales","APOYAR AL EQUIPO DE PRENSA Y COMUNICACIONES DE LA ALCALDÍA LOCAL EN LA REALIZACIÓN DE PRODUCTOS Y PIEZAS DIGITALES, IMPRESAS Y PUBLICITARIAS DE GRAN FORMATO Y DE ANIMACIÓN GRÁFICA, ASÍ COMO APOYAR LA PRODUCCIÓN Y MONTAJE DE EVENTOS.","Inversión","Un nuevo contrato social y ambiental para la Bogotá del Siglo XXI",57,{"$f":"IF(ISERROR(VLOOKUP(K390,Proposito_programa!$C$2:$E$59,2,FALSE)),\" \",VLOOKUP(K390,Proposito_programa!$C$2:$E$59,2,FALSE))","v":"Gestión pública local"},{"$f":"IF(ISERROR(VLOOKUP(K390,Proposito_programa!$C$2:$E$59,3,FALSE)),\" \",VLOOKUP(K390,Proposito_programa!$C$2:$E$59,3,FALSE))","v":"Propósito 5: Construir Bogotá - Región con gobierno abierto, transparente y ciudadanía consciente"},"O23011605570000001697",1,1012410729,"DANIEL FERNANDO AMADOR CARVAJAL ","Persona Natural",null,null,null,null,10800000,null,null,null,10800000,2340000,"2022-11-16","2022-11-18","2023-01-17",60,null,null,null,null,null,null,"Terminado",0.21666666666666667]
[372,2022,"FDLRUU-CD-372-2022","https://community.secop.gov.co/Public/Tendering/ContractNoticePhases/View?PPI=CO1.PPI.21784437&isFromPublicArea=True&isModal=False","Contratos de prestación de servicios profesionales y de apoyo a la gestión","Contratación directa","Prestación de servicios profesionales y de apoyo a la gestión, o para la ejecución de trabajos artísticos que sólo puedan encomendarse a determinadas personas naturales","PRESTAR SERVICIOS PROFESIONALES PARA INCENTIVAR PROCESOS DE PARTICIPACION, CONVIVENCIA CIUDADANA Y EL USO DEL ESPACIO PUBLICO DESDE UNA PERSPECTIVA DE PAZ Y DIALOGO, LLEVANDO A CABO ACUERDOS CIUDADANOS EN EL MARCO DEL PROYECTO 1681.\t","Inversión","Un nuevo contrato social y ambiental para la Bogotá del Siglo XXI",45,{"$f":"IF(ISERROR(VLOOKUP(K391,Proposito_programa!$C$2:$E$59,2,FALSE)),\" \",VLOOKUP(K391,Proposito_programa!$C$2:$E$59,2,FALSE))","v":"Espacio público más seguro y construido colectivamente"},{"$f":"IF(ISERROR(VLOOKUP(K391,Proposito_programa!$C$2:$E$59,3,FALSE)),\" \",VLOOKUP(K391,Proposito_programa!$C$2:$E$59,3,FALSE))","v":"Propósito 3: Inspirar confianza y legitimidad para vivir sin miedo y ser epicentro de cultura ciudadana, paz y reconciliación"},"O23011603450000001681",1,79845438,"CARLOS ANDRES SUESCUM LESMES","Persona Natural",null,null,null,null,10400000,null,null,null,10400000,0,"2022-11-22","2022-11-25","2023-01-24",60,null,null,null,null,null,null,"Terminado",0]
[373,2022,"FDLRUU-CD-373-2022","https://community.secop.gov.co/Public/Tendering/ContractNoticePhases/View?PPI=CO1.PPI.21709748&isFromPublicArea=True&isModal=False","Contratos de prestación de servicios profesionales y de apoyo a la gestión","Contratación directa","Prestación de servicios profesionales y de apoyo a la gestión, o para la ejecución de trabajos artísticos que sólo puedan encomendarse a determinadas personas naturales","PRESTAR SUS SERVICIOS PROFESIONALES EN LA FORMULACION, SEGUIMIENTO Y EVALUACION DEL PROYECTO 1665 EN SU COMPONENTE DE VIGÍAS DEL RIESGO DE LA LOCALIDAD DE RAFAEL URIBE URIBE, A LA LUZ DEL PLAN DE DESARROLLO 2021-2024 'UN NUEVO CONTRATO AMBIENTAL Y SOCIAL\t","Inversión","Un nuevo contrato social y ambiental para la Bogotá del Siglo XXI",30,{"$f":"IF(ISERROR(VLOOKUP(K392,Proposito_programa!$C$2:$E$59,2,FALSE)),\" \",VLOOKUP(K392,Proposito_programa!$C$2:$E$59,2,FALSE))","v":"Eficiencia en la atención de emergencias"},{"$f":"IF(ISERROR(VLOOKUP(K392,Proposito_programa!$C$2:$E$59,3,FALSE)),\" \",VLOOKUP(K392,Proposito_programa!$C$2:$E$59,3,FALSE))","v":"Propósito 2 : Cambiar Nuestros Hábitos de Vida para Reverdecer a Bogotá y Adaptarnos y Mitigar la Crisis Climática"},"O23011602300000001665",1,1033747880,"KEVIN ORLANDO BALLESTEROS ROJAS","Persona Natural",null,null,null,null,9200000,null,null,null,9200000,0,"2022-11-18","2022-11-25","2023-01-24",60,null,null,null,null,null,null,"Terminado",0]
[374,2022,"FDLRUU-CD-374-2022","https://community.secop.gov.co/Public/Tendering/ContractNoticePhases/View?PPI=CO1.PPI.21698891&isFromPublicArea=True&isModal=False","Contratos de prestación de servicios profesionales y de apoyo a la gestión","Contratación directa","Prestación de servicios profesionales y de apoyo a la gestión, o para la ejecución de trabajos artísticos que sólo puedan encomendarse a determinadas personas naturales","PRESTAR LOS SERVICIOS PROFESIONALES EN EL ANÁLISIS, REVISIÓN Y TRÁMITE PARA GESTIONAR EL COBRO PERSUASIVO Y COACTIVO ASI COMO SOLICITUDES DE ENTES DE CONTROL, CORPORACIONES PÚBLICAS QUE SE LE SOLICITEN EN LA ALCALDIA LOCAL DE RAFAEL URIBE URIBE\t","Inversión","Un nuevo contrato social y ambiental para la Bogotá del Siglo XXI",57,{"$f":"IF(ISERROR(VLOOKUP(K393,Proposito_programa!$C$2:$E$59,2,FALSE)),\" \",VLOOKUP(K393,Proposito_programa!$C$2:$E$59,2,FALSE))","v":"Gestión pública local"},{"$f":"IF(ISERROR(VLOOKUP(K393,Proposito_programa!$C$2:$E$59,3,FALSE)),\" \",VLOOKUP(K393,Proposito_programa!$C$2:$E$59,3,FALSE))","v":"Propósito 5: Construir Bogotá - Región con gobierno abierto, transparente y ciudadanía consciente"},"O23011605570000001698",1,52207882,"PILAR JASBLEIDY CASTELLANOS ROJAS","Persona Natural",null,null,null,null,10800000,null,null,null,10800000,1620000,"2022-11-18","2022-11-22","2023-01-02",60,null,null,null,null,null,null,"Terminacion Anticipada",0.15]
[375,2022,"FDLRUU-CD-375-2022","https://community.secop.gov.co/Public/Tendering/ContractNoticePhases/View?PPI=CO1.PPI.21700365&isFromPublicArea=True&isModal=False","Contratos de prestación de servicios profesionales y de apoyo a la gestión","Contratación directa","Prestación de servicios profesionales y de apoyo a la gestión, o para la ejecución de trabajos artísticos que sólo puedan encomendarse a determinadas personas naturales","APOYAR AL ALCALDE LOCAL EN LA FORMULACIÓN, SEGUIMIENTO E IMPLEMENTACIÓN DE LA ESTRATEGIA LOCAL PARA LA TERMINACIÓN JURÍDICA O INACTIVACIÓNDE LAS ACTUACIONES ADMINISTRATIVAS QUE CURSAN EN LA ALCALDÍA LOCAL\"\t","Inversión","Un nuevo contrato social y ambiental para la Bogotá del Siglo XXI",57,{"$f":"IF(ISERROR(VLOOKUP(K394,Proposito_programa!$C$2:$E$59,2,FALSE)),\" \",VLOOKUP(K394,Proposito_programa!$C$2:$E$59,2,FALSE))","v":"Gestión pública local"},{"$f":"IF(ISERROR(VLOOKUP(K394,Proposito_programa!$C$2:$E$59,3,FALSE)),\" \",VLOOKUP(K394,Proposito_programa!$C$2:$E$59,3,FALSE))","v":"Propósito 5: Construir Bogotá - Región con gobierno abierto, transparente y ciudadanía consciente"},"O23011605570000001698",1,53084681,"JUDY LORENA CIFUENTES SILVA","Persona Natural",null,null,null,null,14200000,null,null,null,14200000,1656667,"2022-11-22","2022-11-24","2023-01-23",60,null,null,null,null,null,null,"Terminado",0.11666669014084508]
[376,2022,"FDLRUU-CD-376-2022","https://community.secop.gov.co/Public/Tendering/ContractNoticePhases/View?PPI=CO1.PPI.21701340&isFromPublicArea=True&isModal=False","Contratos de prestación de servicios profesionales y de apoyo a la gestión","Contratación directa","Prestación de servicios profesionales y de apoyo a la gestión, o para la ejecución de trabajos artísticos que sólo puedan encomendarse a determinadas personas naturales","APOYAR AL ÁREA DE DESARROLLO LOCAL EN EL CENTRO DE DOCUMENTACIÓN E INFORMACIÓN (CDI) EN EL MANEJO DE LAS COMUNICACIONES DE ENTRADA, INTERNAS Y EXTERNAS Y EN LA ATENCIÓN A LOS CIUDADANOS EN LOS DIFERENTES CANALES ESTABLECIDOS POR LA ENTIDAD.\t","Inversión","Un nuevo contrato social y ambiental para la Bogotá del Siglo XXI",57,{"$f":"IF(ISERROR(VLOOKUP(K395,Proposito_programa!$C$2:$E$59,2,FALSE)),\" \",VLOOKUP(K395,Proposito_programa!$C$2:$E$59,2,FALSE))","v":"Gestión pública local"},{"$f":"IF(ISERROR(VLOOKUP(K395,Proposito_programa!$C$2:$E$59,3,FALSE)),\" \",VLOOKUP(K395,Proposito_programa!$C$2:$E$59,3,FALSE))","v":"Propósito 5: Construir Bogotá - Región con gobierno abierto, transparente y ciudadanía consciente"},"O23011605570000001697",1,1033797126,"CAMILO ANDRES GOMEZ CUBILLOS ","Persona Natural",null,null,null,null,5400000,null,null,null,5400000,0,"2022-11-22","2022-11-24","2023-01-23",60,null,null,null,null,null,null,"Terminado",0]
[377,2022,"FDLRUU-CD-377-2022","https://community.secop.gov.co/Public/Tendering/ContractNoticePhases/View?PPI=CO1.PPI.21701309&isFromPublicArea=True&isModal=False","Contratos de prestación de servicios profesionales y de apoyo a la gestión","Contratación directa","Prestación de servicios profesionales y de apoyo a la gestión, o para la ejecución de trabajos artísticos que sólo puedan encomendarse a determinadas personas naturales","APOYAR LA FORMULACIÓN, EJECUCIÓN, SEGUIMIENTO Y MEJORA CONTINUA DE LAS HERRAMIENTAS QUE CONFORMAN LA GESTIÓN AMBIENTAL INSTITUCIONAL DE LA ALCALDÍA LOCAL\t","Inversión","Un nuevo contrato social y ambiental para la Bogotá del Siglo XXI",57,{"$f":"IF(ISERROR(VLOOKUP(K396,Proposito_programa!$C$2:$E$59,2,FALSE)),\" \",VLOOKUP(K396,Proposito_programa!$C$2:$E$59,2,FALSE))","v":"Gestión pública local"},{"$f":"IF(ISERROR(VLOOKUP(K396,Proposito_programa!$C$2:$E$59,3,FALSE)),\" \",VLOOKUP(K396,Proposito_programa!$C$2:$E$59,3,FALSE))","v":"Propósito 5: Construir Bogotá - Región con gobierno abierto, transparente y ciudadanía consciente"},"O23011605570000001697",1,1020797579,"LAURA NATHALIA VALENCIA ORTIZ","Persona Natural",null,null,null,null,9200000,null,null,null,9200000,1380000,"2022-11-18","2022-11-22","2023-01-21",60,null,null,null,null,null,null,"Terminado",0.15]
[379,2022,"FDLRUU-SAMC-007-2022","https://community.secop.gov.co/Public/Tendering/OpportunityDetail/Index?noticeUID=CO1.NTC.3438935&isFromPublicArea=True&isModal=False","Contratos de prestación de servicios","Selección abreviada","Selección abreviada por menor cuantía ","PRESTAR SERVICIOS PARA REALIZAR ACCIONES VINCULANTES TENDIENTES A LA CONSTRUCCIÓN DE MEMORIA, PAZ Y RECONCILIACIÓN, Y DE LA CALIDAD DE VIDA DE LAS VICTIMAS DEL CONFLICTO Y EXCOMBATIENTES RESIDENTES EN LA LOCALIDAD RAFAEL URIBE URIBE EN EL MARCO PROYECTO 1678 \"TERRITORIO DE PAZ, MEMORIA Y RECONCILIACIÓN DE LAS VICTIMAS EN EL RUU\"","Inversión","Un nuevo contrato social y ambiental para la Bogotá del Siglo XXI",39,{"$f":"IF(ISERROR(VLOOKUP(K397,Proposito_programa!$C$2:$E$59,2,FALSE)),\" \",VLOOKUP(K397,Proposito_programa!$C$2:$E$59,2,FALSE))","v":"Bogotá territorio de paz y atención integral a las víctimas del conflicto armado"},{"$f":"IF(ISERROR(VLOOKUP(K397,Proposito_programa!$C$2:$E$59,3,FALSE)),\" \",VLOOKUP(K397,Proposito_programa!$C$2:$E$59,3,FALSE))","v":"Propósito 3: Inspirar confianza y legitimidad para vivir sin miedo y ser epicentro de cultura ciudadana, paz y reconciliación"},"O23011603390000001678",1,79867234,"CARLOS ALBERTO PINZON MOLINA","Persona Natural",null,null,null,null,351411539,null,null,null,{"$f":"+W397+X397+Z397","v":351411539},0,"2022-11-18","2022-11-30","2023-05-29",180,null,null,null,null,null,null,"En ejecución",0]
[380,2022,"FDLRUU-SAMC-006-2022","https://community.secop.gov.co/Public/Tendering/ContractNoticePhases/View?PPI=CO1.PPI.20895836&isFromPublicArea=True&isModal=False","Contratos de prestación de servicios","Selección abreviada","Selección abreviada por menor cuantía ","CONTRATAR EL SERVICIO PARA LA TOMA FÍSICA, VERIFICACIÓN, CLASIFICACIÓN, Y ACTUALIZACIÓN DE LA INFORMACIÓN DE BIENES MUEBLES E INMUEBLES DE PROPIEDAD Y/O A CARGO DEL FONDO DE DESARROLLO LOCAL DE RAFAEL URIBE URIBE Y LA MEDICIÓN POSTERIOR, DETERIORO DE LOS BIENES CLASIFICADOS COMO PROPIEDAD, PLANTA Y EQUIPO, DE CONFORMIDAD CON LAS DISPOSICIONES LEGALES VIGENTES.\t","Inversión","Un nuevo contrato social y ambiental para la Bogotá del Siglo XXI",57,{"$f":"IF(ISERROR(VLOOKUP(K398,Proposito_programa!$C$2:$E$59,2,FALSE)),\" \",VLOOKUP(K398,Proposito_programa!$C$2:$E$59,2,FALSE))","v":"Gestión pública local"},{"$f":"IF(ISERROR(VLOOKUP(K398,Proposito_programa!$C$2:$E$59,3,FALSE)),\" \",VLOOKUP(K398,Proposito_programa!$C$2:$E$59,3,FALSE))","v":"Propósito 5: Construir Bogotá - Región con gobierno abierto, transparente y ciudadanía consciente"},"O23011605570000001697",1,830014292,"GERENCIA PUBLICA Y PRIVADA LTDA","Persona Jurídica",null,null,null,null,51927911,null,null,null,51927911,0,"2022-11-18","2022-11-22","2023-04-21",150,null,null,null,null,null,null,"En ejecución",{"$f":"IF(ISERROR(AB398/AA398),\"-\",(AB398/AA398))","v":0}]
[381,2022,"FDLRUU-CD-381-2022","https://community.secop.gov.co/Public/Tendering/ContractNoticePhases/View?PPI=CO1.PPI.21710359&isFromPublicArea=True&isModal=False","Contratos de prestación de servicios profesionales y de apoyo a la gestión","Contratación directa","Prestación de servicios profesionales y de apoyo a la gestión, o para la ejecución de trabajos artísticos que sólo puedan encomendarse a determinadas personas naturales","\tAPOYAR AL EQUIPO DE PRENSA Y COMUNICACIONES DE LA ALCALDÍA LOCAL EN LA REALIZACIÓN Y PUBLICACIÓN DE CONTENIDOS DE REDES SOCIALES Y CANALES DE DIVULGACIÓN DIGITAL (SITIO WEB) DE LA ALCALDÍA LOCAL","Inversión","Un nuevo contrato social y ambiental para la Bogotá del Siglo XXI",57,{"$f":"IF(ISERROR(VLOOKUP(K399,Proposito_programa!$C$2:$E$59,2,FALSE)),\" \",VLOOKUP(K399,Proposito_programa!$C$2:$E$59,2,FALSE))","v":"Gestión pública local"},{"$f":"IF(ISERROR(VLOOKUP(K399,Proposito_programa!$C$2:$E$59,3,FALSE)),\" \",VLOOKUP(K399,Proposito_programa!$C$2:$E$59,3,FALSE))","v":"Propósito 5: Construir Bogotá - Región con gobierno abierto, transparente y ciudadanía consciente"},"O23011605570000001697",1,79391495,"WILLIAM CADENA ACOSTA","Persona Natural",null,null,null,null,10800000,null,null,null,10800000,1800000,"2022-11-18","2022-11-21","2023-01-20",60,null,null,null,null,null,null,"Terminado",0.16666666666666666]
[382,2022,"FDLRUU-CD-382-2022","https://community.secop.gov.co/Public/Tendering/ContractNoticePhases/View?PPI=CO1.PPI.21713148&isFromPublicArea=True&isModal=False","Contratos de prestación de servicios profesionales y de apoyo a la gestión","Contratación directa","Prestación de servicios profesionales y de apoyo a la gestión, o para la ejecución de trabajos artísticos que sólo puedan encomendarse a determinadas personas naturales","PRESTAR LOS SERVICIOS PROFESIONALES EN EL ÁREA DE GESTIÓN DEL DESARROLLO LOCAL DE LA ALCALDIA RAFAEL URIBE URIBE EN TEMAS DE PLANEACION PARA LOGRAR EL CUMPLIMIENTO DE LA EJECUCIÓN Y METAS DEL PLAN DE DESARROLLO LOCAL DE LA LOCALIDAD DE RAFAEL URIBE URIBE 2021 - 2024\t","Inversión","Un nuevo contrato social y ambiental para la Bogotá del Siglo XXI",57,{"$f":"IF(ISERROR(VLOOKUP(K400,Proposito_programa!$C$2:$E$59,2,FALSE)),\" \",VLOOKUP(K400,Proposito_programa!$C$2:$E$59,2,FALSE))","v":"Gestión pública local"},{"$f":"IF(ISERROR(VLOOKUP(K400,Proposito_programa!$C$2:$E$59,3,FALSE)),\" \",VLOOKUP(K400,Proposito_programa!$C$2:$E$59,3,FALSE))","v":"Propósito 5: Construir Bogotá - Región con gobierno abierto, transparente y ciudadanía consciente"},"O23011605570000001697",1,80762005,"EDWARD YESID ROA LOZANO","Persona Natural",null,null,null,null,13000000,null,null,null,13000000,0,"2022-11-18","2022-11-21","2023-01-20",60,null,null,null,null,null,null,"Terminado",0]
[383,2022,"FDLRUU-LP-010-2022 ","https://community.secop.gov.co/Public/Tendering/OpportunityDetail/Index?noticeUID=CO1.NTC.3368408&isFromPublicArea=True&isModal=False","Contratos de prestación de servicios","Licitación pública","No aplica","DESARROLLAR ACCIONES Y ESTRATEGIAS DIRIGIDAS A LA COMUNIDAD DE LA\nLOCALIDAD DE RAFAEL URIBE URIBE, ESPECIALMENTE A LOS ADOLESCENTES Y JOVENES QUE\nCONTRIBUYAN A LA DISMINUCION DE LOS FACTORES DE RIESGO POR EL CONSUMO DE SUSTANCIAS\nPSICOACTIVAS – SPA Y PREVENCION DE EMBARAZO A TEMPRANA EDAD","Inversión","Un nuevo contrato social y ambiental para la Bogotá del Siglo XXI",6,{"$f":"IF(ISERROR(VLOOKUP(K401,Proposito_programa!$C$2:$E$59,2,FALSE)),\" \",VLOOKUP(K401,Proposito_programa!$C$2:$E$59,2,FALSE))","v":"Sistema Distrital de Cuidado"},{"$f":"IF(ISERROR(VLOOKUP(K401,Proposito_programa!$C$2:$E$59,3,FALSE)),\" \",VLOOKUP(K401,Proposito_programa!$C$2:$E$59,3,FALSE))","v":"Propósito 1: Hacer un nuevo contrato social para incrementar la inclusión social, productiva y política"},"O23011601060000001658",14,900216251,"ASOCIACION PARA EL DESARROLLO INTEGRAL DE LA FAMILIA COLOMBIANA - ADIFCOL","Persona Jurídica",null,null,null,null,373728507,null,1,26185388,399913895,0,"2022-11-21","2022-12-05","2023-08-04",243,null,null,null,null,null,null,"Suspendido ",0]
[383,2022,"FDLRUU-LP-010-2022 ","https://community.secop.gov.co/Public/Tendering/OpportunityDetail/Index?noticeUID=CO1.NTC.3368408&isFromPublicArea=True&isModal=False","Contratos de prestación de servicios","Licitación pública","No aplica","DESARROLLAR ACCIONES Y ESTRATEGIAS DIRIGIDAS A LA COMUNIDAD DE LA\nLOCALIDAD DE RAFAEL URIBE URIBE, ESPECIALMENTE A LOS ADOLESCENTES Y JOVENES QUE\nCONTRIBUYAN A LA DISMINUCION DE LOS FACTORES DE RIESGO POR EL CONSUMO DE SUSTANCIAS\nPSICOACTIVAS – SPA Y PREVENCION DE EMBARAZO A TEMPRANA EDAD","Inversión","Un nuevo contrato social y ambiental para la Bogotá del Siglo XXI",6,{"$f":"IF(ISERROR(VLOOKUP(K402,Proposito_programa!$C$2:$E$59,2,FALSE)),\" \",VLOOKUP(K402,Proposito_programa!$C$2:$E$59,2,FALSE))","v":"Sistema Distrital de Cuidado"},{"$f":"IF(ISERROR(VLOOKUP(K402,Proposito_programa!$C$2:$E$59,3,FALSE)),\" \",VLOOKUP(K402,Proposito_programa!$C$2:$E$59,3,FALSE))","v":"Propósito 1: Hacer un nuevo contrato social para incrementar la inclusión social, productiva y política"},"O23011601080000001659",14,900216251,"ASOCIACION PARA EL DESARROLLO INTEGRAL DE LA FAMILIA COLOMBIANA - ADIFCOL","Persona Jurídica",null,null,null,null,471653358,null,1,27979728,499633086,0,"2022-11-21","2022-12-05","2023-08-04",243,null,null,null,null,null,null,"Suspendido ",0]
[384,2022,"FDLRUU-CD-384-2022","https://community.secop.gov.co/Public/Tendering/ContractNoticePhases/View?PPI=CO1.PPI.21845427&isFromPublicArea=True&isModal=False","Contratos de prestación de servicios profesionales y de apoyo a la gestión","Contratación directa","Prestación de servicios profesionales y de apoyo a la gestión, o para la ejecución de trabajos artísticos que sólo puedan encomendarse a determinadas personas naturales","APOYAR JURÍDICAMENTE LAS ACCIONES REQUERIDAS PARA LA DEPURACIÓN DE LAS ACTUACIONES ADMINISTRATIVAS QUE CURSAN EN LA ALCALDÍA LOCAL DE RAFAEL URIBE URIBE","Inversión","Un nuevo contrato social y ambiental para la Bogotá del Siglo XXI",57,{"$f":"IF(ISERROR(VLOOKUP(K403,Proposito_programa!$C$2:$E$59,2,FALSE)),\" \",VLOOKUP(K403,Proposito_programa!$C$2:$E$59,2,FALSE))","v":"Gestión pública local"},{"$f":"IF(ISERROR(VLOOKUP(K403,Proposito_programa!$C$2:$E$59,3,FALSE)),\" \",VLOOKUP(K403,Proposito_programa!$C$2:$E$59,3,FALSE))","v":"Propósito 5: Construir Bogotá - Región con gobierno abierto, transparente y ciudadanía consciente"},"O23011605570000001698",1,79844551,"FRANKLIN ALEX ROMERO CARRILLO","Persona Natural",null,null,null,null,10800000,null,null,null,10800000,0,"2022-11-25","2022-11-30","2023-01-29",60,null,null,1018467983,"MOISES DAYAN FRANCISCO GOMEZ GUERRERO","2022-12-22",0,"Terminado",0]
[385,2022,"FDLRUU-CD-385-2022","https://community.secop.gov.co/Public/Tendering/ContractNoticePhases/View?PPI=CO1.PPI.21783310&isFromPublicArea=True&isModal=False","Contratos de prestación de servicios profesionales y de apoyo a la gestión","Contratación directa","Prestación de servicios profesionales y de apoyo a la gestión, o para la ejecución de trabajos artísticos que sólo puedan encomendarse a determinadas personas naturales","PRESTAR LOS SERVICIOS TÉCNICOS PARA APOYAR A LA ALCALDIA LOCAL DE RAFAEL URIBE URIBE EN LA REALIZACION DE PIEZAS DIGITALES, DE ANIMACION, PUBLICITARIAS Y DE IMAGEN INSTITUCIONAL DE GRAN FORMATO.\t","Inversión","Un nuevo contrato social y ambiental para la Bogotá del Siglo XXI",57,{"$f":"IF(ISERROR(VLOOKUP(K404,Proposito_programa!$C$2:$E$59,2,FALSE)),\" \",VLOOKUP(K404,Proposito_programa!$C$2:$E$59,2,FALSE))","v":"Gestión pública local"},{"$f":"IF(ISERROR(VLOOKUP(K404,Proposito_programa!$C$2:$E$59,3,FALSE)),\" \",VLOOKUP(K404,Proposito_programa!$C$2:$E$59,3,FALSE))","v":"Propósito 5: Construir Bogotá - Región con gobierno abierto, transparente y ciudadanía consciente"},"O23011605570000001697",1,1013595477,"LUIS FERNANDO GOMEZ GUZMAN ","Persona Natural",null,null,null,null,8000000,null,null,null,8000000,0,"2022-11-22","2022-11-24","2023-01-23",60,null,null,null,null,null,null,"Terminado",0]
[386,2022,"FDLRUU-CD-386-2022","https://community.secop.gov.co/Public/Tendering/ContractNoticePhases/View?PPI=CO1.PPI.21786704&isFromPublicArea=True&isModal=False","Contratos de prestación de servicios profesionales y de apoyo a la gestión","Contratación directa","Prestación de servicios profesionales y de apoyo a la gestión, o para la ejecución de trabajos artísticos que sólo puedan encomendarse a determinadas personas naturales","APOYAR JURÍDICAMENTE LAS ACCIONES REQUERIDAS PARA LA DEPURACIÓN DE LAS ACTUACIONES ADMINISTRATIVAS QUE CURSAN EN LA ALCALDÍA LOCAL DE RAFAEL URIBE URIBE\t","Inversión","Un nuevo contrato social y ambiental para la Bogotá del Siglo XXI",57,{"$f":"IF(ISERROR(VLOOKUP(K405,Proposito_programa!$C$2:$E$59,2,FALSE)),\" \",VLOOKUP(K405,Proposito_programa!$C$2:$E$59,2,FALSE))","v":"Gestión pública local"},{"$f":"IF(ISERROR(VLOOKUP(K405,Proposito_programa!$C$2:$E$59,3,FALSE)),\" \",VLOOKUP(K405,Proposito_programa!$C$2:$E$59,3,FALSE))","v":"Propósito 5: Construir Bogotá - Región con gobierno abierto, transparente y ciudadanía consciente"},"O23011605570000001697",1,1010202859,"MOISES MAURICIO DEL TORO JOVEN","Persona Natural",null,null,null,null,8100000,null,null,null,8100000,0,"2022-11-23","2022-11-25","2023-01-08",45,null,null,null,null,null,null,"Terminado",0]
[387,2022,"FDLRUU-CD-387-2022","https://community.secop.gov.co/Public/Tendering/ContractNoticePhases/View?PPI=CO1.PPI.21793420&isFromPublicArea=True&isModal=False","Contratos de prestación de servicios profesionales y de apoyo a la gestión","Contratación directa","Prestación de servicios profesionales y de apoyo a la gestión, o para la ejecución de trabajos artísticos que sólo puedan encomendarse a determinadas personas naturales","APOYAR TECNICAMENTE A LOS RESPONSABLES E INTEGRANTES DE LOS PROCESOS EN LA IMPLEMENTACION DE HERRAMIENTAS DE GESTION, SIGUIENDO LOS LINEAMIENTOS METODOLOGICOS ESTABLECIDOS POR LA OFICINA ASESORA DE PLANEACION DE LA SECRETARIA DISYTRITAL DE GOBIERNO\t","Inversión","Un nuevo contrato social y ambiental para la Bogotá del Siglo XXI",57,{"$f":"IF(ISERROR(VLOOKUP(K406,Proposito_programa!$C$2:$E$59,2,FALSE)),\" \",VLOOKUP(K406,Proposito_programa!$C$2:$E$59,2,FALSE))","v":"Gestión pública local"},{"$f":"IF(ISERROR(VLOOKUP(K406,Proposito_programa!$C$2:$E$59,3,FALSE)),\" \",VLOOKUP(K406,Proposito_programa!$C$2:$E$59,3,FALSE))","v":"Propósito 5: Construir Bogotá - Región con gobierno abierto, transparente y ciudadanía consciente"},"O23011605570000001697",1,1000333532,"JUAN SEBASTIAN CORAL ARTEAGA","Persona Natural",null,null,null,null,10800000,null,null,null,10800000,1260000,"2022-11-23","2022-11-24","2023-01-23",60,null,null,null,null,null,null,"Terminado",0.11666666666666667]
[388,2022,"FDLRUU-CD-388-2022","https://community.secop.gov.co/Public/Tendering/ContractNoticePhases/View?PPI=CO1.PPI.21775667&isFromPublicArea=True&isModal=False","Contratos de prestación de servicios profesionales y de apoyo a la gestión","Contratación directa","Prestación de servicios profesionales y de apoyo a la gestión, o para la ejecución de trabajos artísticos que sólo puedan encomendarse a determinadas personas naturales","APOYAR LA GESTIÓN DOCUMENTAL DE LA ALCALDÍA LOCAL DE RAEL URIBE URIBE PARA LA IMPLEMENTACIÓN DEL PROCESO DE VERIFICACIÓN, SOPORTE Y ACOMPAÑAMIENTO, EN EL DESARROLLO DE LAS ACTIVIDADES PROPIAS DE LOS PROCESOS Y ACTUACIONES ADMINISTRATIVAS EXISTENTES EN EL AREA DE GESTION POLICIVA Y JURIDICA\t","Inversión","Un nuevo contrato social y ambiental para la Bogotá del Siglo XXI",57,{"$f":"IF(ISERROR(VLOOKUP(K407,Proposito_programa!$C$2:$E$59,2,FALSE)),\" \",VLOOKUP(K407,Proposito_programa!$C$2:$E$59,2,FALSE))","v":"Gestión pública local"},{"$f":"IF(ISERROR(VLOOKUP(K407,Proposito_programa!$C$2:$E$59,3,FALSE)),\" \",VLOOKUP(K407,Proposito_programa!$C$2:$E$59,3,FALSE))","v":"Propósito 5: Construir Bogotá - Región con gobierno abierto, transparente y ciudadanía consciente"},"O23011605570000001698",1,41799594,"ANA CONSUELO TRIVIÑO MORALES","Persona Natural",null,null,null,null,4533333,null,null,null,4533333,1020000,"2022-11-22","2022-11-22","2023-01-31",40,null,null,null,null,null,null,"Terminado",0.22500001654411886]
[389,2022,"FDLRUU-LP-007-2022","https://community.secop.gov.co/Public/Tendering/OpportunityDetail/Index?noticeUID=CO1.NTC.3406788&isFromPublicArea=True&isModal=False","Contratos de prestación de servicios","Licitación pública","No aplica","IMPLEMENTAR ACCIONES DE SALUD BUCAL QUE BENEFICIEN LA POBLACIÓN\nRESIDENTE EN LA LOCALIDAD RAFAEL URIBE URIBE, COMO ACCIÓN COMPLEMENTARIA A LA\nESTRATEGIA TERRITORIAL DE SALUD, EN EL MARCO DEL PROYECTO DE INVERSIÓN 1658","Inversión","Un nuevo contrato social y ambiental para la Bogotá del Siglo XXI",6,{"$f":"IF(ISERROR(VLOOKUP(K408,Proposito_programa!$C$2:$E$59,2,FALSE)),\" \",VLOOKUP(K408,Proposito_programa!$C$2:$E$59,2,FALSE))","v":"Sistema Distrital de Cuidado"},{"$f":"IF(ISERROR(VLOOKUP(K408,Proposito_programa!$C$2:$E$59,3,FALSE)),\" \",VLOOKUP(K408,Proposito_programa!$C$2:$E$59,3,FALSE))","v":"Propósito 1: Hacer un nuevo contrato social para incrementar la inclusión social, productiva y política"},"O23011601060000001658",1,830044030,"Fundación Foro Cívico","Persona Jurídica",null,null,null,null,598521596,null,null,null,598521596,0,"2022-11-24","2022-12-14","2023-06-13",180,null,null,null,null,null,null,"En ejecución",0]
[390,2022,"FDLRUU-CD-390-2022","https://community.secop.gov.co/Public/Tendering/ContractNoticePhases/View?PPI=CO1.PPI.21802337&isFromPublicArea=True&isModal=False","Convenios/Contratos interadministrativos","Contratación directa","Contratos interadministrativos","SUMINISTRO, INSTALACIÓN, CONFIGURACIÓN, SOPORTE, GARANTÍA Y PUESTA EN FUNCIONAMIENTO DE UN CENTRO DE MONITOREO EN LA ESTACIÓN DE POLICÍA DE RAFAEL URIBE URIBE EN LA CIUDAD DE BOGOTA en el marco de proyecto de inversión 1684","Inversión","Un nuevo contrato social y ambiental para la Bogotá del Siglo XXI",48,{"$f":"IF(ISERROR(VLOOKUP(K409,Proposito_programa!$C$2:$E$59,2,FALSE)),\" \",VLOOKUP(K409,Proposito_programa!$C$2:$E$59,2,FALSE))","v":"Plataforma institucional para la seguridad y justicia"},{"$f":"IF(ISERROR(VLOOKUP(K409,Proposito_programa!$C$2:$E$59,3,FALSE)),\" \",VLOOKUP(K409,Proposito_programa!$C$2:$E$59,3,FALSE))","v":"Propósito 3: Inspirar confianza y legitimidad para vivir sin miedo y ser epicentro de cultura ciudadana, paz y reconciliación"},"O23011603480000001684",1,899999115,"ETB SA ESP","Persona Jurídica",null,null,null,null,1699998709,null,null,null,1699998709,0,"2022-12-09","2022-12-26","2023-09-25",273,null,null,null,null,null,null,"En ejecución",0]
[391,2022,"FDLRUU-LP-011-2022","https://community.secop.gov.co/Public/Tendering/OpportunityDetail/Index?noticeUID=CO1.NTC.3378800&isFromPublicArea=True&isModal=False","Contratos de prestación de servicios","Licitación pública","No aplica","REALIZAR LA ORGANIZACIÓN Y EJECUCIÓN DE LOS EVENTOS EN LOS CAMPOS ARTÍSTICOS, INTERCULTURALES, CULTURALES Y/O PATRIMONIALES, QUE APORTEN AL DESARROLLO HUMANO DE LA LOCALIDAD, EN EL MARCO DEL PROYECTO 1647 APROPIACIÓN DEL ARTE, LA CULTURA Y EL PATRIMONIO EN RAFAEL URIBE URIBE","Inversión","Un nuevo contrato social y ambiental para la Bogotá del Siglo XXI",21,{"$f":"IF(ISERROR(VLOOKUP(K410,Proposito_programa!$C$2:$E$59,2,FALSE)),\" \",VLOOKUP(K410,Proposito_programa!$C$2:$E$59,2,FALSE))","v":"Creación y vida cotidiana: Apropiación ciudadana del arte, la cultura y el patrimonio, para la democracia cultural"},{"$f":"IF(ISERROR(VLOOKUP(K410,Proposito_programa!$C$2:$E$59,3,FALSE)),\" \",VLOOKUP(K410,Proposito_programa!$C$2:$E$59,3,FALSE))","v":"Propósito 1: Hacer un nuevo contrato social para incrementar la inclusión social, productiva y política"},"O23011601210000001647",3,900332118,"Fundación Social Colombia ActIva - FUNACTIVA","Persona Jurídica",null,null,null,null,799047561,null,1,376616375,1175663936,0,"2022-11-25","2022-12-01","2023-03-31",90,null,null,null,null,null,null,"En ejecución",0]
[393,2022,"FDLRUU-CD-393-2022","https://community.secop.gov.co/Public/Tendering/ContractNoticePhases/View?PPI=CO1.PPI.21845578&isFromPublicArea=True&isModal=False","Contratos de prestación de servicios profesionales y de apoyo a la gestión","Contratación directa","Prestación de servicios profesionales y de apoyo a la gestión, o para la ejecución de trabajos artísticos que sólo puedan encomendarse a determinadas personas naturales","PRESTAR SERVICIOS DE APOYO TECNICO AL AREA DE GESTION DE DESARROLLO LOCAL EN TEMAS RELACIONADOS A PLANEACION PARA APOYAR LA FORMULACION, EJECUCION Y SEGUIMIENTO DE LOS PROYECTOS DE INVERSION QUE FORMAN PARTE DEL PLAN DE DESARROLLO LOCAL 2021-2024 DE LA LOCALIDAD DE RAFAEL URIBE URIBE\t","Inversión","Un nuevo contrato social y ambiental para la Bogotá del Siglo XXI",57,{"$f":"IF(ISERROR(VLOOKUP(K411,Proposito_programa!$C$2:$E$59,2,FALSE)),\" \",VLOOKUP(K411,Proposito_programa!$C$2:$E$59,2,FALSE))","v":"Gestión pública local"},{"$f":"IF(ISERROR(VLOOKUP(K411,Proposito_programa!$C$2:$E$59,3,FALSE)),\" \",VLOOKUP(K411,Proposito_programa!$C$2:$E$59,3,FALSE))","v":"Propósito 5: Construir Bogotá - Región con gobierno abierto, transparente y ciudadanía consciente"},"O23011605570000001697",1,1031163818,"SHAMIR ALEJANDRA HERNANDEZ MARTINEZ","Persona Natural",null,null,null,null,8000000,null,null,null,8000000,0,"2022-11-25","2022-11-28","2023-01-27",60,null,null,null,null,null,null,"Terminado",0]
[394,2022,"FDLRUU-CD-394-2022","https://community.secop.gov.co/Public/Tendering/ContractNoticePhases/View?PPI=CO1.PPI.21836679&isFromPublicArea=True&isModal=False","Contratos de prestación de servicios profesionales y de apoyo a la gestión","Contratación directa","Prestación de servicios profesionales y de apoyo a la gestión, o para la ejecución de trabajos artísticos que sólo puedan encomendarse a determinadas personas naturales","PRESTAR LOS SERVICIOS COMO OPERADOR DE MAQUINARIA AMARILLA, AL SERVICIO DE LA ADMINISTRACION LOCAL DE RAFAEL URIBE URIBE EN LA REALIZACIÓN DE LA EJECUCION DEL PROYECTO NO. 1685 MOVILIDAD MULTIMODAL, INCLUYENTE Y SOSTENIBLE EN RAFAEL URIBE URIBE, ASÍ COMO APOYAR LAS DEMÁS ACTIVIDADES QUE SE GENEREN EN EL ÁREA DE GESTIÓN DEL DESARROLLO CON RELACION AL PROYECTO EN MENCION.\t","Inversión","Un nuevo contrato social y ambiental para la Bogotá del Siglo XXI",57,{"$f":"IF(ISERROR(VLOOKUP(K412,Proposito_programa!$C$2:$E$59,2,FALSE)),\" \",VLOOKUP(K412,Proposito_programa!$C$2:$E$59,2,FALSE))","v":"Gestión pública local"},{"$f":"IF(ISERROR(VLOOKUP(K412,Proposito_programa!$C$2:$E$59,3,FALSE)),\" \",VLOOKUP(K412,Proposito_programa!$C$2:$E$59,3,FALSE))","v":"Propósito 5: Construir Bogotá - Región con gobierno abierto, transparente y ciudadanía consciente"},"O23011605570000001697",1,1022955000,"LUIS EDUARO PEREZ PATARROYO","Persona Natural",null,null,null,null,5400000,null,null,null,5400000,0,"2022-11-25","2022-11-25","2023-01-24",60,null,null,null,null,null,null,"Terminado",0]
[395,2022,"FDLRUU-CD-395-2022","https://community.secop.gov.co/Public/Tendering/ContractNoticePhases/View?PPI=CO1.PPI.21837867&isFromPublicArea=True&isModal=False","Contratos de prestación de servicios profesionales y de apoyo a la gestión","Contratación directa","Prestación de servicios profesionales y de apoyo a la gestión, o para la ejecución de trabajos artísticos que sólo puedan encomendarse a determinadas personas naturales","APOYAR JURIDICAMENTE EN EL ACOMPAÑAMIENTO A LOS OPERATIVOS Y JORNADAS RELACIONADAS CON ASUNTOS DE SEGURIDAD CIUDADANA, CONVIVENCIA Y PREVENCIÓN DE CONFLICTIVIDADES PARA EL AREA DE GESTION POLICIVA DE LA ALCALDIA LOCAL DE RAFAEL URIBE URIBE\t","Inversión","Un nuevo contrato social y ambiental para la Bogotá del Siglo XXI",57,{"$f":"IF(ISERROR(VLOOKUP(K413,Proposito_programa!$C$2:$E$59,2,FALSE)),\" \",VLOOKUP(K413,Proposito_programa!$C$2:$E$59,2,FALSE))","v":"Gestión pública local"},{"$f":"IF(ISERROR(VLOOKUP(K413,Proposito_programa!$C$2:$E$59,3,FALSE)),\" \",VLOOKUP(K413,Proposito_programa!$C$2:$E$59,3,FALSE))","v":"Propósito 5: Construir Bogotá - Región con gobierno abierto, transparente y ciudadanía consciente"},"O23011605570000001698",1,79650934,"HERNAN FABIO PALMAR CONTRERAS","Persona Natural",null,null,null,null,10800000,null,null,null,10800000,1080000,"2022-11-25","2022-11-25","2023-01-24",60,null,null,null,null,null,null,"Terminado",0.1]
[396,2022,"FDLRUU-CD-396-2022","https://community.secop.gov.co/Public/Tendering/ContractNoticePhases/View?PPI=CO1.PPI.21845600&isFromPublicArea=True&isModal=False","Contratos de prestación de servicios profesionales y de apoyo a la gestión","Contratación directa","Prestación de servicios profesionales y de apoyo a la gestión, o para la ejecución de trabajos artísticos que sólo puedan encomendarse a determinadas personas naturales","APOYAR AL (A) ALCALDE (SA) LOCAL EN EL FORTALECIMIENTO\nE INCLUSIÓN DE LAS COMUNIDADES NEGRAS, AFROCOLOMBIANAS, PALENQUERAS E\nINDÍEGNAS EN EL MARCO DE LA POLÍTICA PÚBLICA DISTRITAL Y LOS ESPACIOS DE\nPARTICIPACIÓN","Inversión","Un nuevo contrato social y ambiental para la Bogotá del Siglo XXI",57,{"$f":"IF(ISERROR(VLOOKUP(K414,Proposito_programa!$C$2:$E$59,2,FALSE)),\" \",VLOOKUP(K414,Proposito_programa!$C$2:$E$59,2,FALSE))","v":"Gestión pública local"},{"$f":"IF(ISERROR(VLOOKUP(K414,Proposito_programa!$C$2:$E$59,3,FALSE)),\" \",VLOOKUP(K414,Proposito_programa!$C$2:$E$59,3,FALSE))","v":"Propósito 5: Construir Bogotá - Región con gobierno abierto, transparente y ciudadanía consciente"},"O23011605570000001697",1,51691273,"TULIA MACARIA ASPRILLA PALACIOS","Persona Natural",null,null,null,null,8100000,null,null,null,8100000,0,"2022-11-25","2022-11-29","2023-01-13",60,null,null,null,null,null,null,"Terminado",0]
[397,2022,"FDLRUU-CD-397-2022","https://community.secop.gov.co/Public/Tendering/ContractNoticePhases/View?PPI=CO1.PPI.21846928&isFromPublicArea=True&isModal=False","Contratos de prestación de servicios profesionales y de apoyo a la gestión","Contratación directa","Prestación de servicios profesionales y de apoyo a la gestión, o para la ejecución de trabajos artísticos que sólo puedan encomendarse a determinadas personas naturales","APOYAR LA GESTIÓN DOCUMENTAL DE LA ALCALDÍA LOCAL, ACOMPAÑANDO AL EQUIPO JURÍDICO DE DEPURACIÓN EN LAS LABORES OPERATIVAS QUE GENERA EL PROCESO DE IMPULSO DE LAS ACTUACIONES ADMINISTRATIVAS EXISTENTES EN LA ALCALDÍA LOCAL DE RAFAEL URIBE URIBE\t","Inversión","Un nuevo contrato social y ambiental para la Bogotá del Siglo XXI",57,{"$f":"IF(ISERROR(VLOOKUP(K415,Proposito_programa!$C$2:$E$59,2,FALSE)),\" \",VLOOKUP(K415,Proposito_programa!$C$2:$E$59,2,FALSE))","v":"Gestión pública local"},{"$f":"IF(ISERROR(VLOOKUP(K415,Proposito_programa!$C$2:$E$59,3,FALSE)),\" \",VLOOKUP(K415,Proposito_programa!$C$2:$E$59,3,FALSE))","v":"Propósito 5: Construir Bogotá - Región con gobierno abierto, transparente y ciudadanía consciente"},"O23011605570000001698",1,52993109,"YULY PAOLA LEGUIZAMON PIÑEROS","Persona Natural",null,null,null,null,5400000,null,null,null,5400000,0,"2022-11-25","2022-11-25","2023-01-24",60,null,null,null,null,null,null,"Terminado",0]
[398,2022,"FDLRUU-CD-398-2022","https://community.secop.gov.co/Public/Tendering/ContractNoticePhases/View?PPI=CO1.PPI.21851775&isFromPublicArea=True&isModal=False","Contratos de prestación de servicios profesionales y de apoyo a la gestión","Contratación directa","Prestación de servicios profesionales y de apoyo a la gestión, o para la ejecución de trabajos artísticos que sólo puedan encomendarse a determinadas personas naturales","APOYAR AL ÁREA DE DESARROLLO LOCAL EN EL CENTRO DE DOCUMENTACIÓN E INFORMACIÓN (CDI) EN EL MANEJO DE LAS COMUNICACIONES DE ENTRADA, INTERNAS Y EXTERNAS Y EN LA ATENCIÓN A LOS CIUDADANOS EN LOS DIFERENTES CANALES ESTABLECIDOS POR LA ENTIDAD\t","Inversión","Un nuevo contrato social y ambiental para la Bogotá del Siglo XXI",57,{"$f":"IF(ISERROR(VLOOKUP(K416,Proposito_programa!$C$2:$E$59,2,FALSE)),\" \",VLOOKUP(K416,Proposito_programa!$C$2:$E$59,2,FALSE))","v":"Gestión pública local"},{"$f":"IF(ISERROR(VLOOKUP(K416,Proposito_programa!$C$2:$E$59,3,FALSE)),\" \",VLOOKUP(K416,Proposito_programa!$C$2:$E$59,3,FALSE))","v":"Propósito 5: Construir Bogotá - Región con gobierno abierto, transparente y ciudadanía consciente"},"O23011605570000001697",1,79812446,"DIEGO ALEXANDER MENDEZ REY","Persona Natural",null,null,null,null,5400000,null,null,null,5400000,0,"2022-11-25","2022-11-25","2023-01-24",60,null,null,null,null,null,null,"Terminado",0]
[399,2022,"FDLRUU-CD-399-2022","https://community.secop.gov.co/Public/Tendering/ContractNoticePhases/View?PPI=CO1.PPI.21862225&isFromPublicArea=True&isModal=False","Contratos de prestación de servicios profesionales y de apoyo a la gestión","Contratación directa","Prestación de servicios profesionales y de apoyo a la gestión, o para la ejecución de trabajos artísticos que sólo puedan encomendarse a determinadas personas naturales","PRESTAR LOS SERVICIOS COMO OPERADOR DE MAQUINARIA AMARILLA, AL SERVICIO DE LA ADMINISTRACION LOCAL DE RAFAEL URIBE URIBE EN LA REALIZACIÓN DE LA EJECUCION DEL PROYECTO NO. 1685 MOVILIDAD MULTIMODAL, INCLUYENTE Y SOSTENIBLE EN RAFAEL URIBE URIBE, ASÍ COMO APOYAR LAS DEMÁS ACTIVIDADES QUE SE GENEREN EN EL ÁREA DE GESTIÓN DEL DESARROLLO CON RELACION AL PROYECTO EN MENCION\t","Inversión","Un nuevo contrato social y ambiental para la Bogotá del Siglo XXI",57,{"$f":"IF(ISERROR(VLOOKUP(K417,Proposito_programa!$C$2:$E$59,2,FALSE)),\" \",VLOOKUP(K417,Proposito_programa!$C$2:$E$59,2,FALSE))","v":"Gestión pública local"},{"$f":"IF(ISERROR(VLOOKUP(K417,Proposito_programa!$C$2:$E$59,3,FALSE)),\" \",VLOOKUP(K417,Proposito_programa!$C$2:$E$59,3,FALSE))","v":"Propósito 5: Construir Bogotá - Región con gobierno abierto, transparente y ciudadanía consciente"},"O23011605570000001697",1,19397700,"LUIS ALBERTO ESPINOSA PRIETO","Persona Natural",null,null,null,null,5400000,null,null,null,5400000,0,"2022-11-25","2022-11-25","2023-01-24",60,null,null,null,null,null,null,"Terminado",0]
[400,2022,"FDLRUU-CD-400-2022","https://www.contratos.gov.co/consultas/detalleProceso.do?numConstancia=22-22-51277&g-recaptcha-response=03AEkXODAb67iqFURP5bNCUGE7XSMvBGetkwzPhZQns6Ws_9aiDb8kviI79a-A8sdm_nTL_w1DCz-MMGMLtGKpz1iOqpcnIaylUxAsoe7aVnjCxtBdlGrVyluRaBRwnZrduWdg8TkSUiFfjPIb7Hteec_QWsEEuO4SeVmh6RjOMXK65MKeGsa_FMSrAk2pe1YRJ13KdU843P2qwke0KBzZLcreqSaAaLa3QjWVedyW6UBojMok8Pa4APV1e6X1GqPAvSXGxzXfEwvCLmUk19S5NbUOUaC9390srzw-zm-D1HYZSzSH8SuHpUoqE23Kk-n8SoDsfprfdCnI656zuGb17TK5rO9H_J5LvxUGGNAlJZ9wB-n3lIfGX-_yFUoyyHk1s63R4bSPJYUfwX6j9nToqDso8CjZGg6vKKt2iWu45SHFugPDl7dbimUfIlqNAOahK00x3PGe_XXotwI5deh5eb7Jt9P1GBnhzknpsgtgsu2jCEsUdtPT0hndfxYlgOt-JcbtO_8BAlICzHTP-Pm3qG96zGLUnjkCpqQWJf-W0ytIcLCDxn-UkMqlCRwnCkIqqcH4TfpCVXoqM4p3Wnj4aodiQF_bpEWrAw","Convenios/Contratos interadministrativos","Contratación directa","Contratos interadministrativos","ADHERIR A LOS FONDOS DE DESARROLLO LOCAL DE ANTONIO NARIÑO, BARRIOS UNIDOS, BOSA, CHAPINERO, CIUDAD BOLÍVAR, ENGATIVÁ,FONTIBÓN, KENNEDY, PUENTE ARANDA, RAFAEL URIBE URIBE, SAN CRISTÓBAL, SUBA, SUMAPAZ, TEUSAQUILLO, TUNJUELITO, USAQUÉN,USME, SANTA FE, LOS MÁRTIRES Y LA CANDELARIA AL CONTRATO INTERADMINISTRATIVO NO. 4140000-974-2022 SUSCRITO ENTRE LASECRETARÍA GENERAL DE LA ALCALDÍA MAYOR DE BOGOTÁ D.C. y CANAL CAPITAL”.","Inversión","Un nuevo contrato social y ambiental para la Bogotá del Siglo XXI",21,{"$f":"IF(ISERROR(VLOOKUP(K418,Proposito_programa!$C$2:$E$59,2,FALSE)),\" \",VLOOKUP(K418,Proposito_programa!$C$2:$E$59,2,FALSE))","v":"Creación y vida cotidiana: Apropiación ciudadana del arte, la cultura y el patrimonio, para la democracia cultural"},{"$f":"IF(ISERROR(VLOOKUP(K418,Proposito_programa!$C$2:$E$59,3,FALSE)),\" \",VLOOKUP(K418,Proposito_programa!$C$2:$E$59,3,FALSE))","v":"Propósito 1: Hacer un nuevo contrato social para incrementar la inclusión social, productiva y política"},"O23011601210000001647",1,830012587,"CANAL CAPITAL","Persona Jurídica",null,null,null,null,100000000,null,null,null,100000000,50000000,"2022-11-24","2022-11-25","2023-04-24",127,null,null,null,null,null,null,"En ejecución",0.5]
[401,2022,"FDLRUU-CD-401-2022","https://community.secop.gov.co/Public/Tendering/ContractNoticePhases/View?PPI=CO1.PPI.21846935&isFromPublicArea=True&isModal=False","Contratos de prestación de servicios profesionales y de apoyo a la gestión","Contratación directa","Prestación de servicios profesionales y de apoyo a la gestión, o para la ejecución de trabajos artísticos que sólo puedan encomendarse a determinadas personas naturales","PRESTAR SERVICIOS PROFESIONALES PARA INCENTIVAR PROCESOS DE PARTICIPACIÓN, CONVIVENCIA CIUDADANA Y EL USO DEL ESPACIO PÚBLICO DESDE UNA PERSPECTIVA DE PAZ Y DIALOGO, LLEVANDO A CABO ACUERDOS CIUDADANOS EN EL MARCO DEL PROYECTO 1681\t","Inversión","Un nuevo contrato social y ambiental para la Bogotá del Siglo XXI",45,{"$f":"IF(ISERROR(VLOOKUP(K419,Proposito_programa!$C$2:$E$59,2,FALSE)),\" \",VLOOKUP(K419,Proposito_programa!$C$2:$E$59,2,FALSE))","v":"Espacio público más seguro y construido colectivamente"},{"$f":"IF(ISERROR(VLOOKUP(K419,Proposito_programa!$C$2:$E$59,3,FALSE)),\" \",VLOOKUP(K419,Proposito_programa!$C$2:$E$59,3,FALSE))","v":"Propósito 3: Inspirar confianza y legitimidad para vivir sin miedo y ser epicentro de cultura ciudadana, paz y reconciliación"},"O23011603450000001681",1,80129534,"CARLOS ANDRES MENDEZ MOJICA","Persona Natural",null,null,null,null,10400000,null,null,null,10400000,0,"2022-11-25","2022-11-29","2023-01-28",60,null,null,null,null,null,null,"Terminado",0]
[402,2022,"FDLRUU-CD-402-2022","https://community.secop.gov.co/Public/Tendering/ContractNoticePhases/View?PPI=CO1.PPI.21847671&isFromPublicArea=True&isModal=False","Contratos de prestación de servicios profesionales y de apoyo a la gestión","Contratación directa","Prestación de servicios profesionales y de apoyo a la gestión, o para la ejecución de trabajos artísticos que sólo puedan encomendarse a determinadas personas naturales","PRESTAR SERVICIOS PROFESIONALES PARA INCENTIVAR PROCESOS DE PARTICIPACION, CONVIVENCIA CIUDADANA Y EL USO DEL ESPACIO PUBLICO DESDE UNA PERSPECTIVA DE PAZ Y DIALOGO, LLEVANDO A CABO ACUERDOS CIUDADANOS EN EL MARCO DEL PROYECTO 1681\t","Inversión","Un nuevo contrato social y ambiental para la Bogotá del Siglo XXI",45,{"$f":"IF(ISERROR(VLOOKUP(K420,Proposito_programa!$C$2:$E$59,2,FALSE)),\" \",VLOOKUP(K420,Proposito_programa!$C$2:$E$59,2,FALSE))","v":"Espacio público más seguro y construido colectivamente"},{"$f":"IF(ISERROR(VLOOKUP(K420,Proposito_programa!$C$2:$E$59,3,FALSE)),\" \",VLOOKUP(K420,Proposito_programa!$C$2:$E$59,3,FALSE))","v":"Propósito 3: Inspirar confianza y legitimidad para vivir sin miedo y ser epicentro de cultura ciudadana, paz y reconciliación"},"O23011603450000001681",1,1140826131,"JULIETH DEL CARMEN PERNA BERDUGO","Persona Natural",null,null,null,null,10400000,null,null,null,10400000,0,"2022-11-25","2022-12-01","2023-01-31",60,null,null,null,null,null,null,"Terminado",0]
[403,2022,"FDLRUU-CD-403-2022","https://community.secop.gov.co/Public/Tendering/ContractNoticePhases/View?PPI=CO1.PPI.21883512&isFromPublicArea=True&isModal=False","Contratos de prestación de servicios profesionales y de apoyo a la gestión","Contratación directa","Prestación de servicios profesionales y de apoyo a la gestión, o para la ejecución de trabajos artísticos que sólo puedan encomendarse a determinadas personas naturales","PRESTAR LOS SERVICIOS COMO OPERADORDE MAQUINARIA AMARILLA, AL SERVICIO DE LA ADMINISTRACION LOCAL DE RAFAEL URIBE URIBE EN LA REALIZACIÓN DE LA EJECUCION DEL PROYECTO NO. 1685 MOVILIDADMULTIMODAL, INCLUYENTE Y SOSTENIBLE EN RAFAEL URIBE URIBE, ASÍ COMO APOYAR LAS DEMÁS ACTIVIDADES QUE SE GENEREN EN EL ÁREA DE GESTIÓN DEL DESARROLLO CON RELACION AL PROYECTO EN MENCION\"\t","Inversión","Un nuevo contrato social y ambiental para la Bogotá del Siglo XXI",57,{"$f":"IF(ISERROR(VLOOKUP(K421,Proposito_programa!$C$2:$E$59,2,FALSE)),\" \",VLOOKUP(K421,Proposito_programa!$C$2:$E$59,2,FALSE))","v":"Gestión pública local"},{"$f":"IF(ISERROR(VLOOKUP(K421,Proposito_programa!$C$2:$E$59,3,FALSE)),\" \",VLOOKUP(K421,Proposito_programa!$C$2:$E$59,3,FALSE))","v":"Propósito 5: Construir Bogotá - Región con gobierno abierto, transparente y ciudadanía consciente"},"O23011605570000001697",1,1031154746,"JAIME ALEJANDRO QUINTERO MARTINEZ","Persona Natural",null,null,null,null,5400000,null,null,null,5400000,0,"2022-11-28","2022-11-29","2023-01-28",60,null,null,null,null,null,null,"Terminado",0]
[404,2022,"FDLRUU-CD-404-2022","https://community.secop.gov.co/Public/Tendering/ContractNoticePhases/View?PPI=CO1.PPI.21860267&isFromPublicArea=True&isModal=False","Contratos de prestación de servicios profesionales y de apoyo a la gestión","Contratación directa","Prestación de servicios profesionales y de apoyo a la gestión, o para la ejecución de trabajos artísticos que sólo puedan encomendarse a determinadas personas naturales","APOYAR TÉCNICAMENTE LAS DISTINTAS ETAPAS DE LOS PROCESOS DE COMPETENCIA DE LA ALCALDÍA LOCAL PARA LA DEPURACIÓN DE LAS ACTUACIONES ADMINISTRATIVAS\t","Inversión","Un nuevo contrato social y ambiental para la Bogotá del Siglo XXI",57,{"$f":"IF(ISERROR(VLOOKUP(K422,Proposito_programa!$C$2:$E$59,2,FALSE)),\" \",VLOOKUP(K422,Proposito_programa!$C$2:$E$59,2,FALSE))","v":"Gestión pública local"},{"$f":"IF(ISERROR(VLOOKUP(K422,Proposito_programa!$C$2:$E$59,3,FALSE)),\" \",VLOOKUP(K422,Proposito_programa!$C$2:$E$59,3,FALSE))","v":"Propósito 5: Construir Bogotá - Región con gobierno abierto, transparente y ciudadanía consciente"},"O23011605570000001698",1,79487850,"CARLOS ALBERTO OLARTE AVILA","Persona Natural",null,null,null,null,10800000,null,null,null,10800000,0,"2022-11-26","2022-11-30","2023-01-29",60,null,null,null,null,null,null,"Terminado",0]
[405,2022,"FDLRUU-CD-405-2022","https://community.secop.gov.co/Public/Tendering/ContractNoticePhases/View?PPI=CO1.PPI.21863704&isFromPublicArea=True&isModal=False","Contratos de prestación de servicios profesionales y de apoyo a la gestión","Contratación directa","Prestación de servicios profesionales y de apoyo a la gestión, o para la ejecución de trabajos artísticos que sólo puedan encomendarse a determinadas personas naturales","APOYAR TÉCNICAMENTE LAS DISTINTAS ETAPAS DE LOS PROCESOS DE COMPETENCIA DE LA ALCALDÍA LOCAL PARA LA DEPURACIÓN DE LAS ACTUACIONES ADMINISTRATIVAS\t","Inversión","Un nuevo contrato social y ambiental para la Bogotá del Siglo XXI",57,{"$f":"IF(ISERROR(VLOOKUP(K423,Proposito_programa!$C$2:$E$59,2,FALSE)),\" \",VLOOKUP(K423,Proposito_programa!$C$2:$E$59,2,FALSE))","v":"Gestión pública local"},{"$f":"IF(ISERROR(VLOOKUP(K423,Proposito_programa!$C$2:$E$59,3,FALSE)),\" \",VLOOKUP(K423,Proposito_programa!$C$2:$E$59,3,FALSE))","v":"Propósito 5: Construir Bogotá - Región con gobierno abierto, transparente y ciudadanía consciente"},"O23011605570000001698",1,80098149,"GEOVANNY ROJAS CASTRO","Persona Natural",null,null,null,null,10800000,null,null,null,10800000,0,"2022-11-25","2022-12-05","2023-02-04",60,null,null,null,null,null,null,"Terminado",0]
[406,2022,"FDLRUU-CD-406-2022","https://community.secop.gov.co/Public/Tendering/ContractNoticePhases/View?PPI=CO1.PPI.21882261&isFromPublicArea=True&isModal=False","Contratos de prestación de servicios profesionales y de apoyo a la gestión","Contratación directa","Prestación de servicios profesionales y de apoyo a la gestión, o para la ejecución de trabajos artísticos que sólo puedan encomendarse a determinadas personas naturales","APOYAR TÉCNICAMENTE LAS DISTINTAS ETAPAS DE LOS PROCESOS DE COMPETENCIA DE LASINSPECCIONES DE POLICÍA DE LA LOCALIDAD, SEGÚN REPARTO\t","Inversión","Un nuevo contrato social y ambiental para la Bogotá del Siglo XXI",57,{"$f":"IF(ISERROR(VLOOKUP(K424,Proposito_programa!$C$2:$E$59,2,FALSE)),\" \",VLOOKUP(K424,Proposito_programa!$C$2:$E$59,2,FALSE))","v":"Gestión pública local"},{"$f":"IF(ISERROR(VLOOKUP(K424,Proposito_programa!$C$2:$E$59,3,FALSE)),\" \",VLOOKUP(K424,Proposito_programa!$C$2:$E$59,3,FALSE))","v":"Propósito 5: Construir Bogotá - Región con gobierno abierto, transparente y ciudadanía consciente"},"O23011605570000001698",1,80061073,"ENVER JULIAN LOPEZ ANGEL ","Persona Natural",null,null,null,null,8100000,null,null,null,8100000,0,"2022-11-28","2022-12-01","2023-01-15",45,null,null,null,null,null,null,"Terminado",0]
[407,2022,"FDLRUU-LP-013-2022","https://community.secop.gov.co/Public/Tendering/OpportunityDetail/Index?noticeUID=CO1.NTC.3395894&isFromPublicArea=True&isModal=False","Contratos de prestación de servicios","Licitación pública","No aplica","REALIZAR ACCIONES EN LOS PROCESOS COMUNITARIOS DE EDUCACIÓN AMBIENTAL, FORTALECIMIENTO DEL PROGRAMA DE AGRICULTURA URBANA, JARDINERIA Y COBERTURAS VERDES EN LA LOCALIDAD DE RAFAEL URIBE URIBE EN EL MARCO DE LOS PROYECTOS DE INVERSION 1660 Y 1649 ENMARCADOS EN EL ANEXO TECNICO Y DEMAS DOCUMENTOS","Inversión","Un nuevo contrato social y ambiental para la Bogotá del Siglo XXI",24,{"$f":"IF(ISERROR(VLOOKUP(K425,Proposito_programa!$C$2:$E$59,2,FALSE)),\" \",VLOOKUP(K425,Proposito_programa!$C$2:$E$59,2,FALSE))","v":"Bogotá región emprendedora e innovadora"},{"$f":"IF(ISERROR(VLOOKUP(K425,Proposito_programa!$C$2:$E$59,3,FALSE)),\" \",VLOOKUP(K425,Proposito_programa!$C$2:$E$59,3,FALSE))","v":"Propósito 1: Hacer un nuevo contrato social para incrementar la inclusión social, productiva y política"},"O23011601240000001649",4,901658978,"UT ASOCIACION AMBIENTAL","Persona Jurídica","CORPORACION AVENTURA POR LA NATURALEZA DE LOS ANDES CORPANANDES ","900220836",0.15,null,690924245,null,null,null,690924245,0,"2022-12-01","2022-12-20","2023-08-20",243,null,null,null,null,null,null,"En ejecución",0]
[407,2022,"FDLRUU-LP-013-2022","https://community.secop.gov.co/Public/Tendering/OpportunityDetail/Index?noticeUID=CO1.NTC.3395894&isFromPublicArea=True&isModal=False","Contratos de prestación de servicios","Licitación pública","No aplica","REALIZAR ACCIONES EN LOS PROCESOS COMUNITARIOS DE EDUCACIÓN AMBIENTAL, FORTALECIMIENTO DEL PROGRAMA DE AGRICULTURA URBANA, JARDINERIA Y COBERTURAS VERDES EN LA LOCALIDAD DE RAFAEL URIBE URIBE EN EL MARCO DE LOS PROYECTOS DE INVERSION 1660 Y 1649 ENMARCADOS EN EL ANEXO TECNICO Y DEMAS DOCUMENTOS","Inversión","Un nuevo contrato social y ambiental para la Bogotá del Siglo XXI",27,{"$f":"IF(ISERROR(VLOOKUP(K426,Proposito_programa!$C$2:$E$59,2,FALSE)),\" \",VLOOKUP(K426,Proposito_programa!$C$2:$E$59,2,FALSE))","v":"Cambio cultural para la gestión de la crisis climática"},{"$f":"IF(ISERROR(VLOOKUP(K426,Proposito_programa!$C$2:$E$59,3,FALSE)),\" \",VLOOKUP(K426,Proposito_programa!$C$2:$E$59,3,FALSE))","v":"Propósito 2 : Cambiar Nuestros Hábitos de Vida para Reverdecer a Bogotá y Adaptarnos y Mitigar la Crisis Climática"},"O23011602270000001660",4,901658978,"UT ASOCIACION AMBIENTAL","Persona Jurídica","CARLOS ALBERTO PINZON MOLINA","79867234",0.85,null,819995740,null,null,null,819995740,0,"2022-12-01","2022-12-20","2023-08-20",243,null,null,null,null,null,null,"En ejecución",0]
[408,2022,"FDLRUU-CD-408-2022","https://community.secop.gov.co/Public/Tendering/ContractNoticePhases/View?PPI=CO1.PPI.21923163&isFromPublicArea=True&isModal=False","Contratos de prestación de servicios profesionales y de apoyo a la gestión","Contratación directa","Prestación de servicios profesionales y de apoyo a la gestión, o para la ejecución de trabajos artísticos que sólo puedan encomendarse a determinadas personas naturales","APOYAR JURÍDICAMENTE LAS ACCIONES REQUERIDAS PARA LA DEPURACIÓN DE LAS ACTUACIONES ADMINISTRATIVAS QUE CURSAN EN LA ALCALDÍA LOCAL DE RAFAEL URIBE URIBE\t","Inversión","Un nuevo contrato social y ambiental para la Bogotá del Siglo XXI",57,{"$f":"IF(ISERROR(VLOOKUP(K427,Proposito_programa!$C$2:$E$59,2,FALSE)),\" \",VLOOKUP(K427,Proposito_programa!$C$2:$E$59,2,FALSE))","v":"Gestión pública local"},{"$f":"IF(ISERROR(VLOOKUP(K427,Proposito_programa!$C$2:$E$59,3,FALSE)),\" \",VLOOKUP(K427,Proposito_programa!$C$2:$E$59,3,FALSE))","v":"Propósito 5: Construir Bogotá - Región con gobierno abierto, transparente y ciudadanía consciente"},"O23011605570000001697",1,79583544,"JOHNNY GARRIDO RODRIGUEZ","Persona Natural",null,null,null,null,8100000,null,null,null,8100000,0,"2022-11-29","2022-12-06","2023-01-20",45,null,null,null,null,null,null,"Terminado",0]
[409,2022,"FDLRUU-CD-409-2022","https://community.secop.gov.co/Public/Tendering/ContractNoticePhases/View?PPI=CO1.PPI.21965865&isFromPublicArea=True&isModal=False","Convenios/Contratos interadministrativos","Contratación directa","Contratos interadministrativos","REALIZAR ACCIONES PEDAGÓGICAS, TÉCNICAS Y ADMINISTRATIVAS EN PRO DE LA IMPLEMENTACIÓN Y DESARROLLO ÓPTIMO DEL PROYECTO DE INVERSIÓN DE LA LOCALIDAD DE RAFAEL URIBE 1675, DENOMINADO CAMBIO DE HÁBITOS EN EL MANEJO DE RESIDUOS PARA MITIGAR EL CAMBIO CLIMÁTICO EN RAFAEL URIBE URIBE","Inversión","Un nuevo contrato social y ambiental para la Bogotá del Siglo XXI",38,{"$f":"IF(ISERROR(VLOOKUP(K428,Proposito_programa!$C$2:$E$59,2,FALSE)),\" \",VLOOKUP(K428,Proposito_programa!$C$2:$E$59,2,FALSE))","v":"Ecoeficiencia, reciclaje, manejo de residuos e inclusión de la población recicladora"},{"$f":"IF(ISERROR(VLOOKUP(K428,Proposito_programa!$C$2:$E$59,3,FALSE)),\" \",VLOOKUP(K428,Proposito_programa!$C$2:$E$59,3,FALSE))","v":"Propósito 2 : Cambiar Nuestros Hábitos de Vida para Reverdecer a Bogotá y Adaptarnos y Mitigar la Crisis Climática"},"O23011602380000001675",1,800225340,"UNIVERSIDAD MILITAR NUEVA GRANADA","Persona Jurídica",null,null,null,null,1228000000,null,null,null,1228000000,0,"2022-12-19","2023-01-17","2023-07-18",180,null,null,null,null,null,null,"En ejecución",0]
[410,2022,"FDLRUU-LP-005-2022","https://community.secop.gov.co/Public/Tendering/OpportunityDetail/Index?noticeUID=CO1.NTC.3340925&isFromPublicArea=True&isModal=False","Obra pública","Licitación pública","No aplica","\tEJECUTAR LAS OBRAS Y ACTIVIDADES PARA LA CONSTRUCCIÓN DE LA MALLA VIAL Y ESPACIO PÚBLICO DE LA LOCALIDAD DE RAFAEL URIBE URIBE A PRECIOS UNITARIOS FIJOS, SIN FORMULA DE REAJUSTE Y A MONTO AGOTABLE EN LA CIUDAD DE BOGOTÁ, D. C.","Inversión","Un nuevo contrato social y ambiental para la Bogotá del Siglo XXI",49,{"$f":"IF(ISERROR(VLOOKUP(K429,Proposito_programa!$C$2:$E$59,2,FALSE)),\" \",VLOOKUP(K429,Proposito_programa!$C$2:$E$59,2,FALSE))","v":"Movilidad segura, sostenible y accesible"},{"$f":"IF(ISERROR(VLOOKUP(K429,Proposito_programa!$C$2:$E$59,3,FALSE)),\" \",VLOOKUP(K429,Proposito_programa!$C$2:$E$59,3,FALSE))","v":"Propósito 4: Hacer de Bogotá Región un modelo de movilidad multimodal, incluyente y sostenible"},"O23011604490000001685",23,901659447,"CONSORCIO COMICRON","Consorcio","CONSTRUCTORES E INGENIEROS UNIDOS S.A.S.\n\nOMICRON DEL LLANO S.A.S","900342026\n\n900204854","50%\n\n50%",null,7627745600,null,null,null,{"$f":"+W429+X429+Z429","v":7627745600},0,"2022-12-05","2022-12-30","2023-08-29",243,null,null,null,null,null,null,"En ejecución",0]
[411,2022,"FDLRUU-SAMC-009-2022","https://community.secop.gov.co/Public/Tendering/OpportunityDetail/Index?noticeUID=CO1.NTC.3475547&isFromPublicArea=True&isModal=False","Obra pública","Selección abreviada","Selección abreviada por menor cuantía ","\tCONTRATAR A PRECIOS UNITARIOS FIJOS, LAS OBRAS REFERENTES AL MANTENIMIENTO Y REPARACIONES LOCATIVAS DE LOS SALONES COMUNALES SIN FORMULA DE REAJUSTE EN LA LOCALIDAD DE RAFAEL URIBE URIBE EN LA CIUDAD DE BOGOTA","Inversión","Un nuevo contrato social y ambiental para la Bogotá del Siglo XXI",55,{"$f":"IF(ISERROR(VLOOKUP(K430,Proposito_programa!$C$2:$E$59,2,FALSE)),\" \",VLOOKUP(K430,Proposito_programa!$C$2:$E$59,2,FALSE))","v":"Fortalecimiento de cultura ciudadana y su institucionalidad"},{"$f":"IF(ISERROR(VLOOKUP(K430,Proposito_programa!$C$2:$E$59,3,FALSE)),\" \",VLOOKUP(K430,Proposito_programa!$C$2:$E$59,3,FALSE))","v":"Propósito 5: Construir Bogotá - Región con gobierno abierto, transparente y ciudadanía consciente"},"O23011605550000001689",7,900616793,"DRV INGENIERIA SAS","Persona Jurídica",null,null,null,null,327000000,null,null,null,327000000,0,"2022-12-09","PENDIENTE",null,150,null,null,null,null,null,null,"Celebrado o por iniciar",0]
[412,2022,"FDLRUU-CD-412-2022","https://community.secop.gov.co/Public/Tendering/ContractNoticePhases/View?PPI=CO1.PPI.21998447&isFromPublicArea=True&isModal=False","Contratos de prestación de servicios profesionales y de apoyo a la gestión","Contratación directa","Prestación de servicios profesionales y de apoyo a la gestión, o para la ejecución de trabajos artísticos que sólo puedan encomendarse a determinadas personas naturales","PRESTAR SUS SERVICIOS PROFESIONALES EN EL ÁREA DE GESTIÓN DEL DESARROLLO LOCAL, REALIZANDO LA FORMULACIÓN Y APOYO A LA SUPERVISIÓN EN ASPECTOS TÉCNICOS, ADMINISTRATIVOS Y FINANCIEROS DE LOS DIFERENTES PROYECTOS Y CONTRATOS ASIGNADOS, DEL PLAN DE DESARROLLO LOCAL DE RAFAEL URIBE URIBE","Inversión","Un nuevo contrato social y ambiental para la Bogotá del Siglo XXI",57,{"$f":"IF(ISERROR(VLOOKUP(K431,Proposito_programa!$C$2:$E$59,2,FALSE)),\" \",VLOOKUP(K431,Proposito_programa!$C$2:$E$59,2,FALSE))","v":"Gestión pública local"},{"$f":"IF(ISERROR(VLOOKUP(K431,Proposito_programa!$C$2:$E$59,3,FALSE)),\" \",VLOOKUP(K431,Proposito_programa!$C$2:$E$59,3,FALSE))","v":"Propósito 5: Construir Bogotá - Región con gobierno abierto, transparente y ciudadanía consciente"},"O23011605570000001697",1,1019080350,"ANYELLY ESTEFANY GÓMEZ SALAS","Persona Natural",null,null,null,null,5400000,null,null,null,5400000,0,"2022-12-02","2022-12-05","2023-01-04",30,null,null,null,null,null,null,"Terminado",0]
[413,2022,"FDLRUU-CD-413-2022","https://community.secop.gov.co/Public/Tendering/ContractNoticePhases/View?PPI=CO1.PPI.22038275&isFromPublicArea=True&isModal=False","Contratos de prestación de servicios profesionales y de apoyo a la gestión","Contratación directa","Prestación de servicios profesionales y de apoyo a la gestión, o para la ejecución de trabajos artísticos que sólo puedan encomendarse a determinadas personas naturales","PRESTAR LOS SERVICIOS PROFESIONALES PARA ADELANTAR LAS ACCIONES TENDIENTES AL AGENCIAMIENTO E IMPLEMENTACIÓN DE LAS POLÍTICAS PÚBLICAS DEL ORDEN DISTRITAL EN LO LOCAL, SEGUIMIENTO AL PLAN DE DESARROLLO LOCAL, ACOMPAÑAR LAS INSTANCIAS DE PARTICIPACIÓN QUE LE SEAN ASIGNADAS POR EL SUPERVISOR Y APOYAR LAS DEMÁS ACTIVIDADES QUE SE GENEREN EN EL ÁREA DE GESTIÓN DEL DESARROLLO LOCAL","Inversión","Un nuevo contrato social y ambiental para la Bogotá del Siglo XXI",57,{"$f":"IF(ISERROR(VLOOKUP(K432,Proposito_programa!$C$2:$E$59,2,FALSE)),\" \",VLOOKUP(K432,Proposito_programa!$C$2:$E$59,2,FALSE))","v":"Gestión pública local"},{"$f":"IF(ISERROR(VLOOKUP(K432,Proposito_programa!$C$2:$E$59,3,FALSE)),\" \",VLOOKUP(K432,Proposito_programa!$C$2:$E$59,3,FALSE))","v":"Propósito 5: Construir Bogotá - Región con gobierno abierto, transparente y ciudadanía consciente"},"O23011605570000001697",1,1010221253,"ANDREA CAROLINA BARRETO PEREZ","Persona Natural",null,null,null,null,10800000,null,null,null,10800000,0,"2022-12-06","2022-12-09","2023-02-08",60,null,null,null,null,null,null,"Terminado",0]
[414,2022,"FDLRUU-SAMC-008-2022","https://community.secop.gov.co/Public/Tendering/OpportunityDetail/Index?noticeUID=CO1.NTC.3539099&isFromPublicArea=True&isModal=False","Contratos de prestación de servicios","Selección abreviada","Selección abreviada por menor cuantía ","CONFORMACIÓN DE ESCUELA DE GESTIÓN DE RIESGO QUE IMPLEMENTEN ACCIONES DE REDUCCIÓN DE RIESGO CONFORME CON LOS ESCENARIOS IDENTIFICADOS EN LA LOCALIDAD RAFAEL URIBE URIBE EN EL MARCO DEL PROYECTO DE INVERSIÓN 1665","Inversión","Un nuevo contrato social y ambiental para la Bogotá del Siglo XXI",30,{"$f":"IF(ISERROR(VLOOKUP(K433,Proposito_programa!$C$2:$E$59,2,FALSE)),\" \",VLOOKUP(K433,Proposito_programa!$C$2:$E$59,2,FALSE))","v":"Eficiencia en la atención de emergencias"},{"$f":"IF(ISERROR(VLOOKUP(K433,Proposito_programa!$C$2:$E$59,3,FALSE)),\" \",VLOOKUP(K433,Proposito_programa!$C$2:$E$59,3,FALSE))","v":"Propósito 2 : Cambiar Nuestros Hábitos de Vida para Reverdecer a Bogotá y Adaptarnos y Mitigar la Crisis Climática"},"O23011602300000001665",3,830083016,"PRODEPORT LTDA","Persona Jurídica",null,null,null,null,160556100,null,null,null,160556100,0,"2022-12-13","2022-12-26","2023-04-26",127,null,null,null,null,null,null,"En ejecución",0]
[415,2022,"FDLRUU-CD-415-2022","https://community.secop.gov.co/Public/Tendering/ContractNoticePhases/View?PPI=CO1.PPI.22140177&isFromPublicArea=True&isModal=False","Convenios/Contratos interadministrativos","Contratación directa","Contratos interadministrativos","AUNAR ESFUERZOS TÉCNICOS, ADMINISTRATIVOS Y FINANCIEROS INTEGRALES EN ACCIONES PARA EL FOMENTO DE LAS ACTIVIDADES RECREO – DEPORTIVAS DE LA LOCALIDAD DE RAFAEL URIBE URIBE, EN EL MARCO DEL PROYECTO DE INVERSIÓN 1646, CULTURA, DEPORTE Y RECREACIÓN PARA EL BIENESTAR DE LA CIUDADANÍA","Inversión","Un nuevo contrato social y ambiental para la Bogotá del Siglo XXI",20,{"$f":"IF(ISERROR(VLOOKUP(K434,Proposito_programa!$C$2:$E$59,2,FALSE)),\" \",VLOOKUP(K434,Proposito_programa!$C$2:$E$59,2,FALSE))","v":"Bogotá, referente en cultura, deporte, recreación y actividad física, con parques para el desarrollo y la salud"},{"$f":"IF(ISERROR(VLOOKUP(K434,Proposito_programa!$C$2:$E$59,3,FALSE)),\" \",VLOOKUP(K434,Proposito_programa!$C$2:$E$59,3,FALSE))","v":"Propósito 1: Hacer un nuevo contrato social para incrementar la inclusión social, productiva y política"},"O23011601200000001646",1,901417108,"RED SUMMA","Persona Jurídica",null,null,null,null,1338000000,null,null,null,1338000000,0,"2022-12-15","PENDIENTE",null,180,null,null,null,null,null,null,"Celebrado o por iniciar",0]
[416,2022,"FDLRUU-CD-416-2022","https://community.secop.gov.co/Public/Tendering/ContractNoticePhases/View?PPI=CO1.PPI.22143678&isFromPublicArea=True&isModal=False","Convenios/Contratos interadministrativos","Contratación directa","Contratos interadministrativos","AUNAR ESFUERZOS TÉCNICOS, ADMINISTATIVOS, Y FINANCIEROS PARA REALIZAR ACCIONES EN EL BIENESTAR ANIMAL DE LA LOCALIDAD DE RAFAEL URIBE URIBE QUE FORTALEZCAN LAS REDES LOCALES DE PROTECCIONISTAS DE ANIMALES, A TRAVÉS DE LA ATENCIÓN EN URGENCIAS, BRIGADAS MÉDICO-VETERINARIAS Y ACCIONES DE ESTERILIZACIÓN, EDUCACIÓN Y ADOPCIÓN EN EL MARCO DEL PROYECTO DE INVERSIÓN 1673","Inversión","Un nuevo contrato social y ambiental para la Bogotá del Siglo XXI",34,{"$f":"IF(ISERROR(VLOOKUP(K435,Proposito_programa!$C$2:$E$59,2,FALSE)),\" \",VLOOKUP(K435,Proposito_programa!$C$2:$E$59,2,FALSE))","v":"Bogotá protectora de los animales"},{"$f":"IF(ISERROR(VLOOKUP(K435,Proposito_programa!$C$2:$E$59,3,FALSE)),\" \",VLOOKUP(K435,Proposito_programa!$C$2:$E$59,3,FALSE))","v":"Propósito 2 : Cambiar Nuestros Hábitos de Vida para Reverdecer a Bogotá y Adaptarnos y Mitigar la Crisis Climática"},"O23011602340000001673",1,899999063,"UNIVERSIDAD NACIONAL DE COLOMBIA ","Persona Jurídica",null,null,null,null,1000000000,null,null,null,1000000000,0,"2022-12-22","2023-01-26","2023-07-25",180,null,null,null,null,null,null,"En ejecución",0]
[417,2022,"FDLRUU-CD-417-2022","https://community.secop.gov.co/Public/Tendering/ContractNoticePhases/View?PPI=CO1.PPI.22196078&isFromPublicArea=True&isModal=False","Convenios/Contratos interadministrativos","Contratación directa","Contratos interadministrativos","AUNAR ESFUERZOS TÉCNICOS, ADMINISTRATIVOS, LOGÍSTICOS Y FINANCIEROS ENTRE EL FONDO DE DESARROLLO LOCAL DE RAFAEL URIBE Y LA UNIVERSIDAD NACIONAL DE COLOMBIA, PARA LA CONSTRUCCIÓN, IMPLEMENTACIÓN Y SEGUIMIENTO DE UNA ESTRATEGIA DE FORTALECIMIENTO INSTITUCIONAL MEDIANTE EL EMPODERAMIENTO DE LA POBLACIÓN PERSONA MAYOR PARA POTENCIAR SUS HABILIDADES COMUNICACIONALES, A TRAVÉS UN PROCESO DE APROPIACIÓN SOBRE LA GESTIÓN PÚBLICA LOCAL Y FORTALER SUS COMPETENCIAS DIGITALES COMO HERRAMIENTA FUNDAMENTAL","Inversión","Un nuevo contrato social y ambiental para la Bogotá del Siglo XXI",57,{"$f":"IF(ISERROR(VLOOKUP(K436,Proposito_programa!$C$2:$E$59,2,FALSE)),\" \",VLOOKUP(K436,Proposito_programa!$C$2:$E$59,2,FALSE))","v":"Gestión pública local"},{"$f":"IF(ISERROR(VLOOKUP(K436,Proposito_programa!$C$2:$E$59,3,FALSE)),\" \",VLOOKUP(K436,Proposito_programa!$C$2:$E$59,3,FALSE))","v":"Propósito 5: Construir Bogotá - Región con gobierno abierto, transparente y ciudadanía consciente"},"O23011605570000001697",1,899999063,"UNIVERSIDAD NACIONAL DE COLOMBIA ","Persona Jurídica",null,null,null,null,251665600,null,null,null,251665600,0,"2022-12-26","2023-01-17","2023-08-16",210,null,null,null,null,null,null,"En ejecución",0]
[418,2022,"FDLRUU-SAMC-012-2022","https://community.secop.gov.co/Public/Tendering/OpportunityDetail/Index?noticeUID=CO1.NTC.3580909&isFromPublicArea=True&isModal=False","Suministro","Selección abreviada","Selección abreviada por menor cuantía ","CONTRATAR A PRECIOS UNITARIOS FIJOS Y A MONTO AGOTABLE EL SUMINISTRO DE ELEMENTOS Y SERVICIOS PARA LAS INTERVENCIONES EN EL MARCO DE LA ESTRATEGIA JUNTOS CUIDAMOS BOGOTÁ CONSERVACIÓN DEL ESPACIO PUBLICO DEL PROYECTO 1685 DEL PLAN DE DESARROLLO LOCAL DE RAFAEL URIBE URIBE 2021-2024","Inversión","Un nuevo contrato social y ambiental para la Bogotá del Siglo XXI",49,{"$f":"IF(ISERROR(VLOOKUP(K437,Proposito_programa!$C$2:$E$59,2,FALSE)),\" \",VLOOKUP(K437,Proposito_programa!$C$2:$E$59,2,FALSE))","v":"Movilidad segura, sostenible y accesible"},{"$f":"IF(ISERROR(VLOOKUP(K437,Proposito_programa!$C$2:$E$59,3,FALSE)),\" \",VLOOKUP(K437,Proposito_programa!$C$2:$E$59,3,FALSE))","v":"Propósito 4: Hacer de Bogotá Región un modelo de movilidad multimodal, incluyente y sostenible"},"O23011604490000001685",2,900300970,"Induhotel S.A.S.","Persona Jurídica",null,null,null,null,146756757,null,null,null,146756757,0,"2022-12-19","2022-12-23","2023-06-22",180,null,null,null,null,null,null,"En ejecución",0]
[419,2022,"FDLRUU-MIC-009-2022","https://community.secop.gov.co/Public/Tendering/ContractNoticePhases/View?PPI=CO1.PPI.21967682&isFromPublicArea=True&isModal=False","Contratos de prestación de servicios","Contratación mínima cuantia","No aplica","REALIZAR EL MANTENIMIENTO PREVENTIVO Y CORRECTIVO DE LOS EQUIPOS DE CÓMPUTO, SERVIDORES, UPS, ESCÁNERES, SISTEMA DE PLENARIA, VIDEO BEAM Y DEMÁS EQUIPOS TECNOLOGICOS PROPIEDAD DE LA ALCALDÍA LOCAL DE RAFAEL URIBE URIBE, INCLUYENDO EL SUMINISTRO DE REPUESTOS Y MANO DE OBRA","Inversión","Un nuevo contrato social y ambiental para la Bogotá del Siglo XXI",57,{"$f":"IF(ISERROR(VLOOKUP(K438,Proposito_programa!$C$2:$E$59,2,FALSE)),\" \",VLOOKUP(K438,Proposito_programa!$C$2:$E$59,2,FALSE))","v":"Gestión pública local"},{"$f":"IF(ISERROR(VLOOKUP(K438,Proposito_programa!$C$2:$E$59,3,FALSE)),\" \",VLOOKUP(K438,Proposito_programa!$C$2:$E$59,3,FALSE))","v":"Propósito 5: Construir Bogotá - Región con gobierno abierto, transparente y ciudadanía consciente"},"O23011605570000001697",1,901158838,"DISTRIBUIDORA RED COMPUTO SAS","Persona Jurídica",null,null,null,null,44790067,null,null,null,44790067,0,"2022-12-16","2023-01-10","2024-01-09",365,null,null,null,null,null,null,"En ejecución",0]
[420,2022,"FDLRUU-SASI-002-2022","https://community.secop.gov.co/Public/Tendering/ContractNoticePhases/View?PPI=CO1.PPI.21713796&isFromPublicArea=True&isModal=False","Compraventa de bienes muebles","Selección abreviada","Subasta inversa ","PROMOVER EL FORTALECIMIENTO DE ESPACIOS FÍSICOS Y VIRTUALES DEL CENTRO CRECER RUU, LAS SEDES DE LAS IED, LA ESTACION 18 DE POLICIA RUU, EL CENTRO DE RESERVA PARA EMERGENCIAS Y DESASTRES, LAS JUNTAS DE ACCION COMUNAL DE LA LOCALIDAD Y LOS ACUERDOS PARA EL USO, ACCESO Y APROVECHAMIENTO DEL ESPACIO PUBLICO EN EL MARCO DE LOS PROYECTO DE INVERSIÓN 1656 \"PREVENCION DE VIOLENCIA INTRAFAMILIAR Y SEXUAL EN RAFAEL URIBE URIBE\", 1640 \"CALIDAD Y PERMANENCIA EN LOS COLEGIOS EN RAFAEL URIBE URIBE\" Y 1639 \"E","Inversión","Un nuevo contrato social y ambiental para la Bogotá del Siglo XXI",6,{"$f":"IF(ISERROR(VLOOKUP(K439,Proposito_programa!$C$2:$E$59,2,FALSE)),\" \",VLOOKUP(K439,Proposito_programa!$C$2:$E$59,2,FALSE))","v":"Sistema Distrital de Cuidado"},{"$f":"IF(ISERROR(VLOOKUP(K439,Proposito_programa!$C$2:$E$59,3,FALSE)),\" \",VLOOKUP(K439,Proposito_programa!$C$2:$E$59,3,FALSE))","v":"Propósito 1: Hacer un nuevo contrato social para incrementar la inclusión social, productiva y política"},"O23011601060000001656",2,830029017,"AMERICANA CORP SAS","Persona Jurídica",null,null,null,null,200000000,null,null,null,200000000,0,"2022-12-21","Celebrado o por iniciar","Celebrado o por iniciar",120,null,null,null,null,null,null,"Celebrado o por iniciar",0]
[420,2022,"FDLRUU-SASI-002-2022","https://community.secop.gov.co/Public/Tendering/OpportunityDetail/Index?noticeUID=CO1.NTC.3581709&isFromPublicArea=True&isModal=False","Compraventa de bienes muebles","Selección abreviada","Subasta inversa ","PROMOVER EL FORTALECIMIENTO DE ESPACIOS FÍSICOS Y VIRTUALES DEL CENTRO CRECER RUU, LAS SEDES DE LAS IED, LA ESTACION 18 DE POLICIA RUU, EL CENTRO DE RESERVA PARA EMERGENCIAS Y DESASTRES, LAS JUNTAS DE ACCION COMUNAL DE LA LOCALIDAD Y LOS ACUERDOS PARA EL USO, ACCESO Y APROVECHAMIENTO DEL ESPACIO PUBLICO EN EL MARCO DE LOS PROYECTO DE INVERSIÓN 1656 \"PREVENCION DE VIOLENCIA INTRAFAMILIAR Y SEXUAL EN RAFAEL URIBE URIBE\", 1640 \"CALIDAD Y PERMANENCIA EN LOS COLEGIOS EN RAFAEL URIBE URIBE\" Y 1639 \"E","Inversión","Un nuevo contrato social y ambiental para la Bogotá del Siglo XXI",12,{"$f":"IF(ISERROR(VLOOKUP(K440,Proposito_programa!$C$2:$E$59,2,FALSE)),\" \",VLOOKUP(K440,Proposito_programa!$C$2:$E$59,2,FALSE))","v":"Educación inicial: Bases sólidas para la vida."},{"$f":"IF(ISERROR(VLOOKUP(K440,Proposito_programa!$C$2:$E$59,3,FALSE)),\" \",VLOOKUP(K440,Proposito_programa!$C$2:$E$59,3,FALSE))","v":"Propósito 1: Hacer un nuevo contrato social para incrementar la inclusión social, productiva y política"},"O23011601120000001639",2,830029017,"AMERICANA CORP SAS","Persona Jurídica",null,null,null,null,1847233274,null,null,null,1847233274,0,"2022-12-21","Celebrado o por iniciar","Celebrado o por iniciar",120,null,null,null,null,null,null,"Celebrado o por iniciar",0]
[420,2022,"FDLRUU-SASI-002-2022","https://community.secop.gov.co/Public/Tendering/OpportunityDetail/Index?noticeUID=CO1.NTC.3581709&isFromPublicArea=True&isModal=False","Compraventa de bienes muebles","Selección abreviada","Subasta inversa ","PROMOVER EL FORTALECIMIENTO DE ESPACIOS FÍSICOS Y VIRTUALES DEL CENTRO CRECER RUU, LAS SEDES DE LAS IED, LA ESTACION 18 DE POLICIA RUU, EL CENTRO DE RESERVA PARA EMERGENCIAS Y DESASTRES, LAS JUNTAS DE ACCION COMUNAL DE LA LOCALIDAD Y LOS ACUERDOS PARA EL USO, ACCESO Y APROVECHAMIENTO DEL ESPACIO PUBLICO EN EL MARCO DE LOS PROYECTO DE INVERSIÓN 1656 \"PREVENCION DE VIOLENCIA INTRAFAMILIAR Y SEXUAL EN RAFAEL URIBE URIBE\", 1640 \"CALIDAD Y PERMANENCIA EN LOS COLEGIOS EN RAFAEL URIBE URIBE\" Y 1639 \"E","Inversión","Un nuevo contrato social y ambiental para la Bogotá del Siglo XXI",14,{"$f":"IF(ISERROR(VLOOKUP(K441,Proposito_programa!$C$2:$E$59,2,FALSE)),\" \",VLOOKUP(K441,Proposito_programa!$C$2:$E$59,2,FALSE))","v":"Formación integral: más y mejor tiempo en los colegios"},{"$f":"IF(ISERROR(VLOOKUP(K441,Proposito_programa!$C$2:$E$59,3,FALSE)),\" \",VLOOKUP(K441,Proposito_programa!$C$2:$E$59,3,FALSE))","v":"Propósito 1: Hacer un nuevo contrato social para incrementar la inclusión social, productiva y política"},"O23011601140000001640",2,830029017,"AMERICANA CORP SAS","Persona Jurídica",null,null,null,null,698000000,null,null,null,698000000,0,"2022-12-21","Celebrado o por iniciar","Celebrado o por iniciar",120,null,null,null,null,null,null,"Celebrado o por iniciar",0]
[420,2022,"FDLRUU-SASI-002-2022","https://community.secop.gov.co/Public/Tendering/OpportunityDetail/Index?noticeUID=CO1.NTC.3581709&isFromPublicArea=True&isModal=False","Compraventa de bienes muebles","Selección abreviada","Subasta inversa ","PROMOVER EL FORTALECIMIENTO DE ESPACIOS FÍSICOS Y VIRTUALES DEL CENTRO CRECER RUU, LAS SEDES DE LAS IED, LA ESTACION 18 DE POLICIA RUU, EL CENTRO DE RESERVA PARA EMERGENCIAS Y DESASTRES, LAS JUNTAS DE ACCION COMUNAL DE LA LOCALIDAD Y LOS ACUERDOS PARA EL USO, ACCESO Y APROVECHAMIENTO DEL ESPACIO PUBLICO EN EL MARCO DE LOS PROYECTO DE INVERSIÓN 1656 \"PREVENCION DE VIOLENCIA INTRAFAMILIAR Y SEXUAL EN RAFAEL URIBE URIBE\", 1640 \"CALIDAD Y PERMANENCIA EN LOS COLEGIOS EN RAFAEL URIBE URIBE\" Y 1639 \"E","Inversión","Un nuevo contrato social y ambiental para la Bogotá del Siglo XXI",30,{"$f":"IF(ISERROR(VLOOKUP(K442,Proposito_programa!$C$2:$E$59,2,FALSE)),\" \",VLOOKUP(K442,Proposito_programa!$C$2:$E$59,2,FALSE))","v":"Eficiencia en la atención de emergencias"},{"$f":"IF(ISERROR(VLOOKUP(K442,Proposito_programa!$C$2:$E$59,3,FALSE)),\" \",VLOOKUP(K442,Proposito_programa!$C$2:$E$59,3,FALSE))","v":"Propósito 2 : Cambiar Nuestros Hábitos de Vida para Reverdecer a Bogotá y Adaptarnos y Mitigar la Crisis Climática"},"O23011602300000001665",2,830029017,"AMERICANA CORP SAS","Persona Jurídica",null,null,null,null,28282727,null,null,null,28282727,0,"2022-12-21","Celebrado o por iniciar","Celebrado o por iniciar",120,null,null,null,null,null,null,"Celebrado o por iniciar",0]
[420,2022,"FDLRUU-SASI-002-2022","https://community.secop.gov.co/Public/Tendering/OpportunityDetail/Index?noticeUID=CO1.NTC.3581709&isFromPublicArea=True&isModal=False","Compraventa de bienes muebles","Selección abreviada","Subasta inversa ","PROMOVER EL FORTALECIMIENTO DE ESPACIOS FÍSICOS Y VIRTUALES DEL CENTRO CRECER RUU, LAS SEDES DE LAS IED, LA ESTACION 18 DE POLICIA RUU, EL CENTRO DE RESERVA PARA EMERGENCIAS Y DESASTRES, LAS JUNTAS DE ACCION COMUNAL DE LA LOCALIDAD Y LOS ACUERDOS PARA EL USO, ACCESO Y APROVECHAMIENTO DEL ESPACIO PUBLICO EN EL MARCO DE LOS PROYECTO DE INVERSIÓN 1656 \"PREVENCION DE VIOLENCIA INTRAFAMILIAR Y SEXUAL EN RAFAEL URIBE URIBE\", 1640 \"CALIDAD Y PERMANENCIA EN LOS COLEGIOS EN RAFAEL URIBE URIBE\" Y 1639 \"E","Inversión","Un nuevo contrato social y ambiental para la Bogotá del Siglo XXI",45,{"$f":"IF(ISERROR(VLOOKUP(K443,Proposito_programa!$C$2:$E$59,2,FALSE)),\" \",VLOOKUP(K443,Proposito_programa!$C$2:$E$59,2,FALSE))","v":"Espacio público más seguro y construido colectivamente"},{"$f":"IF(ISERROR(VLOOKUP(K443,Proposito_programa!$C$2:$E$59,3,FALSE)),\" \",VLOOKUP(K443,Proposito_programa!$C$2:$E$59,3,FALSE))","v":"Propósito 3: Inspirar confianza y legitimidad para vivir sin miedo y ser epicentro de cultura ciudadana, paz y reconciliación"},"O23011603450000001681",2,830029017,"AMERICANA CORP SAS","Persona Jurídica",null,null,null,null,223264542,null,null,null,223264542,0,"2022-12-21","Celebrado o por iniciar","Celebrado o por iniciar",120,null,null,null,null,null,null,"Celebrado o por iniciar",0]
[420,2022,"FDLRUU-SASI-002-2022","https://community.secop.gov.co/Public/Tendering/OpportunityDetail/Index?noticeUID=CO1.NTC.3581709&isFromPublicArea=True&isModal=False","Compraventa de bienes muebles","Selección abreviada","Subasta inversa ","PROMOVER EL FORTALECIMIENTO DE ESPACIOS FÍSICOS Y VIRTUALES DEL CENTRO CRECER RUU, LAS SEDES DE LAS IED, LA ESTACION 18 DE POLICIA RUU, EL CENTRO DE RESERVA PARA EMERGENCIAS Y DESASTRES, LAS JUNTAS DE ACCION COMUNAL DE LA LOCALIDAD Y LOS ACUERDOS PARA EL USO, ACCESO Y APROVECHAMIENTO DEL ESPACIO PUBLICO EN EL MARCO DE LOS PROYECTO DE INVERSIÓN 1656 \"PREVENCION DE VIOLENCIA INTRAFAMILIAR Y SEXUAL EN RAFAEL URIBE URIBE\", 1640 \"CALIDAD Y PERMANENCIA EN LOS COLEGIOS EN RAFAEL URIBE URIBE\" Y 1639 \"E","Inversión","Un nuevo contrato social y ambiental para la Bogotá del Siglo XXI",48,{"$f":"IF(ISERROR(VLOOKUP(K444,Proposito_programa!$C$2:$E$59,2,FALSE)),\" \",VLOOKUP(K444,Proposito_programa!$C$2:$E$59,2,FALSE))","v":"Plataforma institucional para la seguridad y justicia"},{"$f":"IF(ISERROR(VLOOKUP(K444,Proposito_programa!$C$2:$E$59,3,FALSE)),\" \",VLOOKUP(K444,Proposito_programa!$C$2:$E$59,3,FALSE))","v":"Propósito 3: Inspirar confianza y legitimidad para vivir sin miedo y ser epicentro de cultura ciudadana, paz y reconciliación"},"O23011603480000001684",2,830029017,"AMERICANA CORP SAS","Persona Jurídica",null,null,null,null,59984390,null,null,null,59984390,0,"2022-12-21","Celebrado o por iniciar","Celebrado o por iniciar",120,null,null,null,null,null,null,"Celebrado o por iniciar",0]
[420,2022,"FDLRUU-SASI-002-2022","https://community.secop.gov.co/Public/Tendering/OpportunityDetail/Index?noticeUID=CO1.NTC.3581709&isFromPublicArea=True&isModal=False","Compraventa de bienes muebles","Selección abreviada","Subasta inversa ","PROMOVER EL FORTALECIMIENTO DE ESPACIOS FÍSICOS Y VIRTUALES DEL CENTRO CRECER RUU, LAS SEDES DE LAS IED, LA ESTACION 18 DE POLICIA RUU, EL CENTRO DE RESERVA PARA EMERGENCIAS Y DESASTRES, LAS JUNTAS DE ACCION COMUNAL DE LA LOCALIDAD Y LOS ACUERDOS PARA EL USO, ACCESO Y APROVECHAMIENTO DEL ESPACIO PUBLICO EN EL MARCO DE LOS PROYECTO DE INVERSIÓN 1656 \"PREVENCION DE VIOLENCIA INTRAFAMILIAR Y SEXUAL EN RAFAEL URIBE URIBE\", 1640 \"CALIDAD Y PERMANENCIA EN LOS COLEGIOS EN RAFAEL URIBE URIBE\" Y 1639 \"E","Inversión","Un nuevo contrato social y ambiental para la Bogotá del Siglo XXI",55,{"$f":"IF(ISERROR(VLOOKUP(K445,Proposito_programa!$C$2:$E$59,2,FALSE)),\" \",VLOOKUP(K445,Proposito_programa!$C$2:$E$59,2,FALSE))","v":"Fortalecimiento de cultura ciudadana y su institucionalidad"},{"$f":"IF(ISERROR(VLOOKUP(K445,Proposito_programa!$C$2:$E$59,3,FALSE)),\" \",VLOOKUP(K445,Proposito_programa!$C$2:$E$59,3,FALSE))","v":"Propósito 5: Construir Bogotá - Región con gobierno abierto, transparente y ciudadanía consciente"},"O23011605550000001689",2,830029017,"AMERICANA CORP SAS","Persona Jurídica",null,null,null,null,193799931,null,null,null,193799931,0,"2022-12-21","Celebrado o por iniciar","Celebrado o por iniciar",120,null,null,null,null,null,null,"Celebrado o por iniciar",0]
[421,2022,"FDLRUU-SAMC-010-2022","https://community.secop.gov.co/Public/Tendering/OpportunityDetail/Index?noticeUID=CO1.NTC.3551457&isFromPublicArea=True&isModal=False","Obra pública","Selección abreviada","Selección abreviada por menor cuantía ","EJECUTAR LAS OBRAS Y ACTIVIDADES PARA LA CONSERVACIÓN DE LA MALLA VIAL Y ESPACIO PÚBLICO DE LA LOCALIDAD DE RAFAEL URIBE URIBE A PRECIOS UNITARIOS FIJOS, SIN FORMULA DE REAJUSTE Y A MONTO AGOTABLE EN LA CIUDAD DE BOGOTÁ, D. C","Inversión","Un nuevo contrato social y ambiental para la Bogotá del Siglo XXI",49,{"$f":"IF(ISERROR(VLOOKUP(K446,Proposito_programa!$C$2:$E$59,2,FALSE)),\" \",VLOOKUP(K446,Proposito_programa!$C$2:$E$59,2,FALSE))","v":"Movilidad segura, sostenible y accesible"},{"$f":"IF(ISERROR(VLOOKUP(K446,Proposito_programa!$C$2:$E$59,3,FALSE)),\" \",VLOOKUP(K446,Proposito_programa!$C$2:$E$59,3,FALSE))","v":"Propósito 4: Hacer de Bogotá Región un modelo de movilidad multimodal, incluyente y sostenible"},"O23011604490000001685",11,901663598,"CONSORCIO DIAMENTE 2022","Consorcio","ARM CONSULTORIA Y CONSTRUCCIONES S.A.S.\nSIS ORGANIZATION S.A.S. ",null,"5%\n95%",null,1759684520,null,null,null,1759684520,0,"2022-12-21","PENDIENTE",null,120,null,null,null,null,null,null,"Celebrado o por iniciar",0]
[422,2022,"FDLRUU-MIC-008-2022","https://community.secop.gov.co/Public/Tendering/ContractNoticePhases/View?PPI=CO1.PPI.22088561&isFromPublicArea=True&isModal=False","Contratos de prestación de servicios","Contratación mínima cuantia","No aplica","\tPRESTACIÓN DEL SERVICIO DE LAVADO Y DESINFECCIÓN DE LOS TANQUES DE ALMACENAMIENTO DE AGUA POTABLE DE LAS SEDES DE LA ALCALDÍA LOCAL DE RAFAEL URIBE URIBE","Funcionamiento","Un nuevo contrato social y ambiental para la Bogotá del Siglo XXI","No aplica",{"$f":"IF(ISERROR(VLOOKUP(K447,Proposito_programa!$C$2:$E$59,2,FALSE)),\" \",VLOOKUP(K447,Proposito_programa!$C$2:$E$59,2,FALSE))","v":" "},{"$f":"IF(ISERROR(VLOOKUP(K447,Proposito_programa!$C$2:$E$59,3,FALSE)),\" \",VLOOKUP(K447,Proposito_programa!$C$2:$E$59,3,FALSE))","v":" "},"O21202020080585330",null,900976208,"GESTION - AMBIENTAL SOCIEDAD S A S","Persona Jurídica",null,null,null,null,2451400,null,null,null,2451400,0,"2022-12-22","2022-12-30","2023-07-29",210,null,null,null,null,null,null,"En ejecución",0]
[423,2022,"FDLRUU-SAMC 011","https://community.secop.gov.co/Public/Tendering/OpportunityDetail/Index?noticeUID=CO1.NTC.3580526&isFromPublicArea=True&isModal=False","Contratos de prestación de servicios","Selección abreviada","Selección abreviada por menor cuantía ","IMPLEMENTAR UN PROCESO INTEGRAL PARA LA PREVENCIÓN DE LA COMISIÓN DE DELITOS ENTRE POBLACIONES DE ALTO RIESGO, MEDIANTE LA EJECUCIÓN DE PROCESOS FORMATIVOS PARA EL FORTALECIMIENTO DE ACCIONES PEDAGOGICAS TERRITORIALES EN EL MARCO DEL PROYECTO DE INVERSIÓN 1680 CIUDADANOS MÁS SEGUROS Y CON CONFIANZA EN LA JUSTICIA EN RUU","Inversión","Un nuevo contrato social y ambiental para la Bogotá del Siglo XXI",43,{"$f":"IF(ISERROR(VLOOKUP(K448,Proposito_programa!$C$2:$E$59,2,FALSE)),\" \",VLOOKUP(K448,Proposito_programa!$C$2:$E$59,2,FALSE))","v":"Cultura ciudadana para la confianza, la convivencia y la participación desde la vida cotidiana"},{"$f":"IF(ISERROR(VLOOKUP(K448,Proposito_programa!$C$2:$E$59,3,FALSE)),\" \",VLOOKUP(K448,Proposito_programa!$C$2:$E$59,3,FALSE))","v":"Propósito 3: Inspirar confianza y legitimidad para vivir sin miedo y ser epicentro de cultura ciudadana, paz y reconciliación"},"O23011603430000001680",5,901352122,"DIRECCION Y GESTION DE PROYECTOS SAS","Persona Jurídica",null,null,null,null,424357600,null,null,null,424357600,0,"2022-12-26","2023-01-18","2023-07-17",180,null,null,null,null,null,null,"En ejecución",0]
[424,2022,"FDLRUU-CMA-005-2022","https://community.secop.gov.co/Public/Tendering/OpportunityDetail/Index?noticeUID=CO1.NTC.3645054&isFromPublicArea=True&isModal=False","Interventoría","Concurso de méritos","No aplica","REALIZAR LA INTERVENTORÍA TÉCNICA, ADMINISTRATIVA, LEGAL, FINANCIERA, SOCIAL, AMBIENTAL Y DE SEGURIDAD Y SALUD EN EL TRABAJO (SST), DEL CONTRATO DE OBRA PÚBLICA QUE TIENE POR OBJETO: \"EJECUTAR LAS OBRAS Y ACTIVIDADES PARA LA CONSTRUCCION DE LA MALLA VIAL Y ESPACIO PÚBLICO DE LA LOCALIDAD DE RAFAEL URIBE URIBE A PRECIOS UNITARIOS FIJOS, SIN FORMULA DE REAJUSTE Y A MONTO AGOTABLE EN LA CIUDAD DE BOGOTÁ, D. C.\" DERIVADO DEL PROCESO DE LA LICITACIÓN PUBLICA No. FDLRUU-LP-005-2022","Inversión","Un nuevo contrato social y ambiental para la Bogotá del Siglo XXI",49,{"$f":"IF(ISERROR(VLOOKUP(K449,Proposito_programa!$C$2:$E$59,2,FALSE)),\" \",VLOOKUP(K449,Proposito_programa!$C$2:$E$59,2,FALSE))","v":"Movilidad segura, sostenible y accesible"},{"$f":"IF(ISERROR(VLOOKUP(K449,Proposito_programa!$C$2:$E$59,3,FALSE)),\" \",VLOOKUP(K449,Proposito_programa!$C$2:$E$59,3,FALSE))","v":"Propósito 4: Hacer de Bogotá Región un modelo de movilidad multimodal, incluyente y sostenible"},"O23011604490000001685",2,900107376,"INTERVENTORIA Y CONSTRUCIVILES SAS","Persona Jurídica",null,null,null,null,727336120,null,null,null,727336120,0,"2022-12-27","2023-01-30","2023-10-29",240,null,null,null,null,null,null,"En ejecución",0]
[425,2022,"FDLRUU-SAMC-013-2022 ","https://community.secop.gov.co/Public/Tendering/OpportunityDetail/Index?noticeUID=CO1.NTC.3625018&isFromPublicArea=True&isModal=False","Suministro","Selección abreviada","Selección abreviada por menor cuantía ","CONTRATAR EL SUMINISTRO DE INSUMOS, REFRIGERIOS Y ELEMENTOS DE MERCHANDISING REQUERIDOS PARA EL DESARROLLO LOGISTICO Y OPERATIVO DEL PROGRAMA \"RETO LOCAL JOVENES Y ENTORNOS SEGUROS\" \"PARCEROS POR BOGOTA\" EN LA LOCALIDAD DE RAFAEL URIBE URIBE","Inversión","Un nuevo contrato social y ambiental para la Bogotá del Siglo XXI",1,{"$f":"IF(ISERROR(VLOOKUP(K450,Proposito_programa!$C$2:$E$59,2,FALSE)),\" \",VLOOKUP(K450,Proposito_programa!$C$2:$E$59,2,FALSE))","v":"Subsidios y transferencias para la equidad"},{"$f":"IF(ISERROR(VLOOKUP(K450,Proposito_programa!$C$2:$E$59,3,FALSE)),\" \",VLOOKUP(K450,Proposito_programa!$C$2:$E$59,3,FALSE))","v":"Propósito 1: Hacer un nuevo contrato social para incrementar la inclusión social, productiva y política"},"O23011601010000002213",4,900572437,"FUNDACIÓN PAÍS HUMANO","Persona Jurídica",null,null,null,null,135007382,null,null,null,135007382,null,"2022-12-28","2023-01-23","2023-05-22",120,null,null,null,null,null,null,"En ejecución",0]
[426,2022,"FDLRUU-MIC-010-2022","https://community.secop.gov.co/Public/Tendering/ContractNoticePhases/View?PPI=CO1.PPI.22142141&isFromPublicArea=True&isModal=False","Contratos de prestación de servicios","Contratación mínima cuantia","No aplica","PRESTACIÓN DEL SERVICIO DE MONITOREO DE GPS Y MEDICIÓN DE VARIABLES DE OPERACIÓN DE LOS VEHÍCULOS LIVIANOS Y MAQUINARIA PESADA DEL FONDO DE DESARROLLO LOCAL RAFAEL URIBE URIBE","Funcionamiento","Un nuevo contrato social y ambiental para la Bogotá del Siglo XXI","No aplica",{"$f":"IF(ISERROR(VLOOKUP(K451,Proposito_programa!$C$2:$E$59,2,FALSE)),\" \",VLOOKUP(K451,Proposito_programa!$C$2:$E$59,2,FALSE))","v":" "},{"$f":"IF(ISERROR(VLOOKUP(K451,Proposito_programa!$C$2:$E$59,3,FALSE)),\" \",VLOOKUP(K451,Proposito_programa!$C$2:$E$59,3,FALSE))","v":" "},"O2120202",2,900336119,"DAR SOLUCIONES SAS","Persona Jurídica",null,null,null,null,10496000,null,null,null,10496000,0,"2022-12-28","PENDIENTE",null,365,null,null,null,null,null,null,"Celebrado o por iniciar",0]
[426,2022,"FDLRUU-MIC-010-2022","https://community.secop.gov.co/Public/Tendering/ContractNoticePhases/View?PPI=CO1.PPI.22142141&isFromPublicArea=True&isModal=False","Contratos de prestación de servicios","Contratación mínima cuantia","No aplica","PRESTACIÓN DEL SERVICIO DE MONITOREO DE GPS Y MEDICIÓN DE VARIABLES DE OPERACIÓN DE LOS VEHÍCULOS LIVIANOS Y MAQUINARIA PESADA DEL FONDO DE DESARROLLO LOCAL RAFAEL URIBE URIBE","Inversión","Un nuevo contrato social y ambiental para la Bogotá del Siglo XXI",49,{"$f":"IF(ISERROR(VLOOKUP(K452,Proposito_programa!$C$2:$E$59,2,FALSE)),\" \",VLOOKUP(K452,Proposito_programa!$C$2:$E$59,2,FALSE))","v":"Movilidad segura, sostenible y accesible"},{"$f":"IF(ISERROR(VLOOKUP(K452,Proposito_programa!$C$2:$E$59,3,FALSE)),\" \",VLOOKUP(K452,Proposito_programa!$C$2:$E$59,3,FALSE))","v":"Propósito 4: Hacer de Bogotá Región un modelo de movilidad multimodal, incluyente y sostenible"},"O23011604490000001685",2,900336119,"DAR SOLUCIONES SAS","Persona Jurídica",null,null,null,null,7000000,null,null,null,7000000,0,"2022-12-28","PENDIENTE",null,365,null,null,null,null,null,null,"Celebrado o por iniciar",0]
[427,2022,"FDLRUU-SAMC-015-2022","https://community.secop.gov.co/Public/Tendering/OpportunityDetail/Index?noticeUID=CO1.NTC.3659141&isFromPublicArea=True&isModal=False","Contratos de prestación de servicios","Selección abreviada","Selección abreviada por menor cuantía ","FOMENTAR EL EMPRENDIMIENTO EN PROYECTOS DE CULTURA TENIENDO EN CUENTA EL ENFOQUE DIFERECIAL PARA LA IGUALDAD DE OPORTUNIDADES EN EL MARCO DEL PROYECTO No. 1650, CULTURA Y EMPRENDIMIENTO CON IGUALDAD DE OPORTUNIDADES EN RAFAEL URIBE URIBE","Inversión","Un nuevo contrato social y ambiental para la Bogotá del Siglo XXI",24,{"$f":"IF(ISERROR(VLOOKUP(K453,Proposito_programa!$C$2:$E$59,2,FALSE)),\" \",VLOOKUP(K453,Proposito_programa!$C$2:$E$59,2,FALSE))","v":"Bogotá región emprendedora e innovadora"},{"$f":"IF(ISERROR(VLOOKUP(K453,Proposito_programa!$C$2:$E$59,3,FALSE)),\" \",VLOOKUP(K453,Proposito_programa!$C$2:$E$59,3,FALSE))","v":"Propósito 1: Hacer un nuevo contrato social para incrementar la inclusión social, productiva y política"},"O23011601240000001650",2,8300956140,"FUNVIVE 2.0","Persona Jurídica",null,null,null,null,445954860,null,null,null,445954860,0,"2022-12-29","PENDIENTE",null,150,null,null,null,null,null,null,"Celebrado o por iniciar",{"$f":"SUM(AN1:AN452)","v":311.00545776859684}]
[428,2022,"FDLRUU-CMA-004-2022","https://community.secop.gov.co/Public/Tendering/OpportunityDetail/Index?noticeUID=CO1.NTC.3574685&isFromPublicArea=True&isModal=False","Interventoría","Concurso de méritos","No aplica","REALIZAR LA INTERVENTORÍA TÉCNICA, ADMINISTRATIVA, LEGAL, FINANCIERA, SOCIAL, AMBIENTAL Y DE SEGURIDAD Y SALUD EN EL TRABAJO (SST), DEL CONTRATO DE OBRA PÚBLICA QUE TIENE POR OBJETO: \"EJECUTAR LAS OBRAS Y ACTIVIDADES PARA LA CONSERVACIÓN DE LA MALLA VIAL Y ESPACIO PÚBLICO DE LA LOCALIDAD DE RAFAEL URIBE URIBE A PRECIOS UNITARIOS FIJOS, SIN FORMULA DE REAJUSTE Y A MONTO AGOTABLE EN LA CIUDAD DE BOGOTÁ, D. C.\" DERIVADO DEL PROCESO DE SELECCIÓN ABREVIADA DE MENOR CUANTIA No. FDLRUU-SAMC-010-2022","Inversión","Un nuevo contrato social y ambiental para la Bogotá del Siglo XXI",49,{"$f":"IF(ISERROR(VLOOKUP(K454,Proposito_programa!$C$2:$E$59,2,FALSE)),\" \",VLOOKUP(K454,Proposito_programa!$C$2:$E$59,2,FALSE))","v":"Movilidad segura, sostenible y accesible"},{"$f":"IF(ISERROR(VLOOKUP(K454,Proposito_programa!$C$2:$E$59,3,FALSE)),\" \",VLOOKUP(K454,Proposito_programa!$C$2:$E$59,3,FALSE))","v":"Propósito 4: Hacer de Bogotá Región un modelo de movilidad multimodal, incluyente y sostenible"},"O23011604490000001685",41,830028126,"R&M CONSTRUCCIONES E INTERVENTORIAS S.A.S","Persona Jurídica",null," "," ",null,240000000,null,null,null,240000000,0,"2022-12-29","PENDIENTE",null,120," "," "," "," "," "," ","Celebrado o por iniciar",{"$f":"IF(ISERROR(AB454/AA454),\"-\",(AB454/AA454))","v":0}]
[461,2020,"FDLRUU-SAMC-354-2020","https://community.secop.gov.co/Public/Tendering/OpportunityDetail/Index?noticeUID=CO1.NTC.1592323&isFromPublicArea=True&isModal=False\n","Contratos de prestación de servicios","Selección abreviada","Selección abreviada por menor cuantía ","CONTRATAR A MONTO AGOTABLE EL DIAGNÓSTICO, MANTENIMIENTO PREVENTIVO Y CORRECTIVO INCLUYENDO MANO DE OBRA Y/O SUMINISTRO DE REPUESTOS ORIGINALES, KITS DE ELEMENTOS, LUBRICANTES, SUMINISTRO DE LLANTAS Y DESPINCHES PARA LOS VEHÍCULOS LIVIANOS DEL FONDO DE DESARROLLO LOCAL RAFAEL URIBE URIBE","Funcionamiento","Un nuevo contrato social y ambiental para la Bogotá del Siglo XXI","No aplica",{"$f":"IF(ISERROR(VLOOKUP(K455,Proposito_programa!$C$2:$E$59,2,FALSE)),\" \",VLOOKUP(K455,Proposito_programa!$C$2:$E$59,2,FALSE))","v":" "},{"$f":"IF(ISERROR(VLOOKUP(K455,Proposito_programa!$C$2:$E$59,3,FALSE)),\" \",VLOOKUP(K455,Proposito_programa!$C$2:$E$59,3,FALSE))","v":" "},1310202010203,1,860076670,"AMERICANA AUTOMOTRIZ S.AS","Persona Jurídica",null,null,null,null,0,null,2,25505260,25505260,13595531,"2021-07-30","2021-07-30","2022-03-04",420,2,240,null,null,null,null,"Terminado",0.53304812419085323]
[90293,2022,90293,"https://colombiacompra.gov.co/tienda-virtual-del-estado-colombiano/ordenes-compra/90293","Suministro","Selección abreviada","Acuerdo marco de precios ","ADQUISICION DE ELEMENTOS Y/O ARTICULOS DE PAPELERIA Y OFICINA PARA EL FONDO DE DESARROLLO LOCAL DE RAFAEL URIBE URIBE","Funcionamiento","Un nuevo contrato social y ambiental para la Bogotá del Siglo XXI","No aplica",{"$f":"IF(ISERROR(VLOOKUP(K456,Proposito_programa!$C$2:$E$59,2,FALSE)),\" \",VLOOKUP(K456,Proposito_programa!$C$2:$E$59,2,FALSE))","v":" "},{"$f":"IF(ISERROR(VLOOKUP(K456,Proposito_programa!$C$2:$E$59,3,FALSE)),\" \",VLOOKUP(K456,Proposito_programa!$C$2:$E$59,3,FALSE))","v":" "},"O2120201003023212801\nO2120201003023219997\nO2120201003053514002\nO2120201003053542006\nO2120201003063692002\nO2120201003063692007\nO2120201003063699002\nO2120201003083891102\nO2120201003083891104\nO2120201003083891106\nO2120201003083891207\nO2120201003083899998\nO2120201004024299502\nO2120201004024299504\nO2120201004024299989",1,830037946,"PANAMERICANA LIBRERÍA Y PAPELERÍA S.A.","Persona Jurídica",null,null,null,null,20845357,null,null,null,20845357,20845357,"2022-05-23","2022-05-23","2022-06-27",35,null,null,null,null,null,null,"Terminado",1]
[90293,2022,90293,"https://colombiacompra.gov.co/tienda-virtual-del-estado-colombiano/ordenes-compra/90293","Suministro","Selección abreviada","Acuerdo marco de precios ","ADQUISICION DE ELEMENTOS Y/O ARTICULOS DE PAPELERIA Y OFICINA PARA EL FONDO DE DESARROLLO LOCAL DE RAFAEL URIBE URIBE","Inversión","Un nuevo contrato social y ambiental para la Bogotá del Siglo XXI",1,{"$f":"IF(ISERROR(VLOOKUP(K457,Proposito_programa!$C$2:$E$59,2,FALSE)),\" \",VLOOKUP(K457,Proposito_programa!$C$2:$E$59,2,FALSE))","v":"Subsidios y transferencias para la equidad"},{"$f":"IF(ISERROR(VLOOKUP(K457,Proposito_programa!$C$2:$E$59,3,FALSE)),\" \",VLOOKUP(K457,Proposito_programa!$C$2:$E$59,3,FALSE))","v":"Propósito 1: Hacer un nuevo contrato social para incrementar la inclusión social, productiva y política"},"O23011601010000001636",1,830037946,"PANAMERICANA LIBRERÍA Y PAPELERÍA S.A.","Persona Jurídica",null,null,null,null,15831560,null,null,null,15831560,15831560,"2022-05-23","2022-05-23","2022-06-27",35,null,null,null,null,null,null,"Terminado",1]
[91851,2022,91851,"https://colombiacompra.gov.co/tienda-virtual-del-estado-colombiano/ordenes-compra/?number_order=91851&state=&entity=ALCALDIA%20LOCAL%20RAFAEL%20URIBE%20URIBE%20-%20ALRUU&tool=&date_to&date_from","Otros","Selección abreviada","Acuerdo marco de precios ","CONTRATAR EL SERVICIO DE ALQUILER DE IMPRESORAS PARA EL FUNCIONAMIENTO DE LA ALCALDIA LOCAL DE RAFAEL URIBE URIBE","Funcionamiento","Un nuevo contrato social y ambiental para la Bogotá del Siglo XXI","No aplica",{"$f":"IF(ISERROR(VLOOKUP(K458,Proposito_programa!$C$2:$E$59,2,FALSE)),\" \",VLOOKUP(K458,Proposito_programa!$C$2:$E$59,2,FALSE))","v":" "},{"$f":"IF(ISERROR(VLOOKUP(K458,Proposito_programa!$C$2:$E$59,3,FALSE)),\" \",VLOOKUP(K458,Proposito_programa!$C$2:$E$59,3,FALSE))","v":" "},0,1,830037278,"NUEVA ERA SOLUCIONES SAS\n","Persona Jurídica",null,null,null,null,27857337,null,null,null,27857337,0,"2022-06-15","2022-06-15","2023-04-20",305,null,null,null,null,null,null,"En ejecución",0]
[92728,2022,92728,"https://colombiacompra.gov.co/tienda-virtual-del-estado-colombiano/ordenes-compra/92728","Otros","Selección abreviada","Acuerdo marco de precios ","CONTRATAR LA ADQUISICION DE SUSCRIPCION MENSUAL DE LAS LICENCIAS OFFICE 365-HERRAMIENTA COLABORATIVA Y DE CORREO ELECTRONICO PARA LA ALCALDIA LOCAL DE RAFAEL URIBE URIBE","Inversión","Un nuevo contrato social y ambiental para la Bogotá del Siglo XXI",57,{"$f":"IF(ISERROR(VLOOKUP(K459,Proposito_programa!$C$2:$E$59,2,FALSE)),\" \",VLOOKUP(K459,Proposito_programa!$C$2:$E$59,2,FALSE))","v":"Gestión pública local"},{"$f":"IF(ISERROR(VLOOKUP(K459,Proposito_programa!$C$2:$E$59,3,FALSE)),\" \",VLOOKUP(K459,Proposito_programa!$C$2:$E$59,3,FALSE))","v":"Propósito 5: Construir Bogotá - Región con gobierno abierto, transparente y ciudadanía consciente"},"O23011605570000001697",1,800015583,"COLSOF SAS","Persona Jurídica",null,null,null,null,91809799,null,null,null,91809799,91809798,"2022-06-30","2022-06-30","2022-08-04",35,null,null,null,null,null,null,"Terminado",0.99999998910791643]
[93015,2022,93015,"https://colombiacompra.gov.co/tienda-virtual-del-estado-colombiano/ordenes-compra/93015","Otros","Selección abreviada","Acuerdo marco de precios ","ADQUISICION E INSTALACION DE EQUIPOS DE COMPUTO EN LA ALCALDIA LOCAL DE RAFAEL URIBE URIBE","Inversión","Un nuevo contrato social y ambiental para la Bogotá del Siglo XXI",57,{"$f":"IF(ISERROR(VLOOKUP(K460,Proposito_programa!$C$2:$E$59,2,FALSE)),\" \",VLOOKUP(K460,Proposito_programa!$C$2:$E$59,2,FALSE))","v":"Gestión pública local"},{"$f":"IF(ISERROR(VLOOKUP(K460,Proposito_programa!$C$2:$E$59,3,FALSE)),\" \",VLOOKUP(K460,Proposito_programa!$C$2:$E$59,3,FALSE))","v":"Propósito 5: Construir Bogotá - Región con gobierno abierto, transparente y ciudadanía consciente"},"O23011605570000001697",null,800230829,"SISTETRONICS SAS","Persona Jurídica",null,null,null,null,299888274,null,null,null,299888274,299888273,"2022-07-07","2022-07-07","2022-12-23",166,null,null,null,null,null,null,"Terminado",0.99999999666542483]
[93047,2022,93047,"https://colombiacompra.gov.co/tienda-virtual-del-estado-colombiano/ordenes-compra/93047","Contratos de prestación de servicios","Selección abreviada","Acuerdo marco de precios ","PRESTAR EL SERVICIO INTEGRAL DE ASEO Y CAFETERIA INCLUIDO EL MANTENIMIENTO LOCATIVO BASICO LOS EQUIPOS NECESARIOS PARA EL DESARROLLO DE ESTE Y EL SUMINISTRO DE INSUMOS PARA LAS DEPENDENCIAS DE LA ALCALDIA LOCAL RAFAEL URIBE URIBE Y LA JUNTA ADMINISTRADORA LOCAL","Inversión","Un nuevo contrato social y ambiental para la Bogotá del Siglo XXI",57,{"$f":"IF(ISERROR(VLOOKUP(K461,Proposito_programa!$C$2:$E$59,2,FALSE)),\" \",VLOOKUP(K461,Proposito_programa!$C$2:$E$59,2,FALSE))","v":"Gestión pública local"},{"$f":"IF(ISERROR(VLOOKUP(K461,Proposito_programa!$C$2:$E$59,3,FALSE)),\" \",VLOOKUP(K461,Proposito_programa!$C$2:$E$59,3,FALSE))","v":"Propósito 5: Construir Bogotá - Región con gobierno abierto, transparente y ciudadanía consciente"},"O23011605570000001697",1,900229503,"SERVICIOS DE ASEO, CAFETERIA Y MANTENIMIENTO INSTITUCIONAL OUTSOURCING SEASIN LIMITADA","Persona Jurídica",null,null,null,null,16349859,null,null,null,{"$f":"+W461+X461+Z461","v":16349859},6600499,"2022-07-08","2022-07-08","2023-05-10",303,null,null,null,null,null,null,"En ejecución",0.40370372612999295]
[93047,2022,93047,"https://colombiacompra.gov.co/tienda-virtual-del-estado-colombiano/ordenes-compra/93047","Contratos de prestación de servicios","Selección abreviada","Acuerdo marco de precios ","PRESTAR EL SERVICIO INTEGRAL DE ASEO Y CAFETERIA INCLUIDO EL MANTENIMIENTO LOCATIVO BASICO LOS EQUIPOS NECESARIOS PARA EL DESARROLLO DE ESTE Y EL SUMINISTRO DE INSUMOS PARA LAS DEPENDENCIAS DE LA ALCALDIA LOCAL RAFAEL URIBE URIBE Y LA JUNTA ADMINISTRADORA LOCAL","Funcionamiento","Un nuevo contrato social y ambiental para la Bogotá del Siglo XXI","No aplica",{"$f":"IF(ISERROR(VLOOKUP(K462,Proposito_programa!$C$2:$E$59,2,FALSE)),\" \",VLOOKUP(K462,Proposito_programa!$C$2:$E$59,2,FALSE))","v":" "},{"$f":"IF(ISERROR(VLOOKUP(K462,Proposito_programa!$C$2:$E$59,3,FALSE)),\" \",VLOOKUP(K462,Proposito_programa!$C$2:$E$59,3,FALSE))","v":" "},"O23011605570000001697",1,900229503,"SERVICIOS DE ASEO, CAFETERIA Y MANTENIMIENTO INSTITUCIONAL OUTSOURCING SEASIN LIMITADA","Persona Jurídica",null,null,null,null,103612934,null,null,null,103612934,37943399,"2022-07-08","2022-07-08","2023-05-10",303,null,null,null,null,null,null,"En ejecución",0.36620330623974029]
[95907,2022,95907,"https://colombiacompra.gov.co/tienda-virtual-del-estado-colombiano/ordenes-compra/95907","Compraventa de bienes muebles","Selección abreviada","Acuerdo marco de precios ","ADQUIRIR ELEMENTOS DE PRODUCCION AUDIOVISUAL Y LA RENOVACION DE UNA LICENCIA DE SOFWARE, PARA EL FORTALECIMIENTO TECNICO DE LAS COMUNICACIONES EN LA ALCALDIA LOCAL DE RAFAEL URIBE URIBE","Inversión","Un nuevo contrato social y ambiental para la Bogotá del Siglo XXI",57,{"$f":"IF(ISERROR(VLOOKUP(K463,Proposito_programa!$C$2:$E$59,2,FALSE)),\" \",VLOOKUP(K463,Proposito_programa!$C$2:$E$59,2,FALSE))","v":"Gestión pública local"},{"$f":"IF(ISERROR(VLOOKUP(K463,Proposito_programa!$C$2:$E$59,3,FALSE)),\" \",VLOOKUP(K463,Proposito_programa!$C$2:$E$59,3,FALSE))","v":"Propósito 5: Construir Bogotá - Región con gobierno abierto, transparente y ciudadanía consciente"},"O23011605570000001697",1,830037946,"PANAMERICANA LIBRERIA Y PAPELERIA SA","Persona Jurídica",null,null,null,null,4393000,null,null,null,{"$f":"+W463+X463+Z463","v":4393000},4393000,"2022-09-12","2022-09-12","2022-11-20",38,1,30,null,null,null,null,"Terminado",{"$f":"IF(ISERROR(AB463/AA463),\"-\",(AB463/AA463))","v":1}]
[95907,2022,95907,"https://colombiacompra.gov.co/tienda-virtual-del-estado-colombiano/ordenes-compra/95907","Compraventa de bienes muebles","Selección abreviada","Acuerdo marco de precios ","ADQUIRIR ELEMENTOS DE PRODUCCION AUDIOVISUAL Y LA RENOVACION DE UNA LICENCIA DE SOFWARE, PARA EL FORTALECIMIENTO TECNICO DE LAS COMUNICACIONES EN LA ALCALDIA LOCAL DE RAFAEL URIBE URIBE","Funcionamiento","Un nuevo contrato social y ambiental para la Bogotá del Siglo XXI","No aplica",{"$f":"IF(ISERROR(VLOOKUP(K464,Proposito_programa!$C$2:$E$59,2,FALSE)),\" \",VLOOKUP(K464,Proposito_programa!$C$2:$E$59,2,FALSE))","v":" "},{"$f":"IF(ISERROR(VLOOKUP(K464,Proposito_programa!$C$2:$E$59,3,FALSE)),\" \",VLOOKUP(K464,Proposito_programa!$C$2:$E$59,3,FALSE))","v":" "},"O23011605570000001697",1,830037946,"PANAMERICANA LIBRERIA Y PAPELERIA SA","Persona Jurídica",null,null,null,null,7944440,null,null,null,7944440,7944440,"2022-09-12","2022-09-12","2022-11-20",38,1,30,null,null,null,null,"Terminado",1]
[95974,2022,95974,"https://colombiacompra.gov.co/tienda-virtual-del-estado-colombiano/ordenes-compra/95974","Compraventa de bienes muebles","Selección abreviada","Acuerdo marco de precios ","ADQUIRIR ELEMENTOS DE PRODUCCION AUDIOVISUAL Y LA RENOVACION DE UNA LICENCIA DE SOFWARE, PARA EL FORTALECIMIENTO TECNICO DE LAS COMUNICACIONES EN LA ALCALDIA LOCAL DE RAFAEL URIBE URIBE","Funcionamiento","Un nuevo contrato social y ambiental para la Bogotá del Siglo XXI","No aplica",{"$f":"IF(ISERROR(VLOOKUP(K465,Proposito_programa!$C$2:$E$59,2,FALSE)),\" \",VLOOKUP(K465,Proposito_programa!$C$2:$E$59,2,FALSE))","v":" "},{"$f":"IF(ISERROR(VLOOKUP(K465,Proposito_programa!$C$2:$E$59,3,FALSE)),\" \",VLOOKUP(K465,Proposito_programa!$C$2:$E$59,3,FALSE))","v":" "},"O21201010030502\nO21201010030603",null,900155107,"CENCOSUD COLOMBIA S.A.","Persona Jurídica",null,null,null,null,0,null,null,null,0,0,"2022-09-13","2022-09-13","2022-10-21",38,null,null,null,null,null,null,"Terminado","-"]
[95992,2022,95992,"https://colombiacompra.gov.co/tienda-virtual-del-estado-colombiano/ordenes-compra/95992","Otros","Selección abreviada","Acuerdo marco de precios ","TRANSFORMACION Y DOTACION DE AMBIENTES PEDAGOGICOS FISICOS Y VIRTUALES PARA EDUCACION INICIAL EVENTO DE COTIZACION 136074","Inversión","Un nuevo contrato social y ambiental para la Bogotá del Siglo XXI",12,{"$f":"IF(ISERROR(VLOOKUP(K466,Proposito_programa!$C$2:$E$59,2,FALSE)),\" \",VLOOKUP(K466,Proposito_programa!$C$2:$E$59,2,FALSE))","v":"Educación inicial: Bases sólidas para la vida."},{"$f":"IF(ISERROR(VLOOKUP(K466,Proposito_programa!$C$2:$E$59,3,FALSE)),\" \",VLOOKUP(K466,Proposito_programa!$C$2:$E$59,3,FALSE))","v":"Propósito 1: Hacer un nuevo contrato social para incrementar la inclusión social, productiva y política"},"O23011601120000001639",1,804000673,"HARDWARE ASESORIAS SOFTWARE LTDA","Persona Jurídica",null,null,null,null,480288.76,null,null,null,480288.76,480289,"2022-09-13","2022-09-13","2022-12-20",97,null,null,null,null,null,null,"Terminado",1.0000004996993892]
[95993,2022,95993,"https://colombiacompra.gov.co/tienda-virtual-del-estado-colombiano/ordenes-compra/95993","Otros","Selección abreviada","Acuerdo marco de precios ","TRANSFORMACION Y DOTACION DE AMBIENTES PEDAGOGICOS FISICOS Y VIRTUALES PARA EDUCACION INICIAL EVENTO DE COTIZACION 136074","Inversión","Un nuevo contrato social y ambiental para la Bogotá del Siglo XXI",12,{"$f":"IF(ISERROR(VLOOKUP(K467,Proposito_programa!$C$2:$E$59,2,FALSE)),\" \",VLOOKUP(K467,Proposito_programa!$C$2:$E$59,2,FALSE))","v":"Educación inicial: Bases sólidas para la vida."},{"$f":"IF(ISERROR(VLOOKUP(K467,Proposito_programa!$C$2:$E$59,3,FALSE)),\" \",VLOOKUP(K467,Proposito_programa!$C$2:$E$59,3,FALSE))","v":"Propósito 1: Hacer un nuevo contrato social para incrementar la inclusión social, productiva y política"},"O23011601120000001639",1,830001338,"Sumimas S.A.S","Persona Jurídica",null,null,null,null,85694654,null,null,null,85694654,0,"2022-09-13","2022-09-13","2023-03-21",97,null,null,null,null,null,null,"En ejecución",0]
[95994,2022,95994,"https://colombiacompra.gov.co/tienda-virtual-del-estado-colombiano/ordenes-compra/95994","Otros","Selección abreviada","Acuerdo marco de precios ","TRANSFORMACION Y DOTACION DE AMBIENTES PEDAGOGICOS FISICOS Y VIRTUALES PARA EDUCACION INICIAL EVENTO DE COTIZACION 136074","Inversión","Un nuevo contrato social y ambiental para la Bogotá del Siglo XXI",12,{"$f":"IF(ISERROR(VLOOKUP(K468,Proposito_programa!$C$2:$E$59,2,FALSE)),\" \",VLOOKUP(K468,Proposito_programa!$C$2:$E$59,2,FALSE))","v":"Educación inicial: Bases sólidas para la vida."},{"$f":"IF(ISERROR(VLOOKUP(K468,Proposito_programa!$C$2:$E$59,3,FALSE)),\" \",VLOOKUP(K468,Proposito_programa!$C$2:$E$59,3,FALSE))","v":"Propósito 1: Hacer un nuevo contrato social para incrementar la inclusión social, productiva y política"},"O23011601120000001639",1,900156826,"OFIX SAS","Persona Jurídica",null,null,null,null,129680607.48,null,null,null,129680607.48,0,"2022-09-13","2022-09-13","2022-12-20",97,null,null,null,null,null,null,"Terminado",0]
[95995,2022,95995,"https://colombiacompra.gov.co/tienda-virtual-del-estado-colombiano/ordenes-compra/95995","Otros","Selección abreviada","Acuerdo marco de precios ","TRANSFORMACION Y DOTACION DE AMBIENTES PEDAGOGICOS FISICOS Y VIRTUALES PARA EDUCACION INICIAL EVENTO DE COTIZACION 136074","Inversión","Un nuevo contrato social y ambiental para la Bogotá del Siglo XXI",12,{"$f":"IF(ISERROR(VLOOKUP(K469,Proposito_programa!$C$2:$E$59,2,FALSE)),\" \",VLOOKUP(K469,Proposito_programa!$C$2:$E$59,2,FALSE))","v":"Educación inicial: Bases sólidas para la vida."},{"$f":"IF(ISERROR(VLOOKUP(K469,Proposito_programa!$C$2:$E$59,3,FALSE)),\" \",VLOOKUP(K469,Proposito_programa!$C$2:$E$59,3,FALSE))","v":"Propósito 1: Hacer un nuevo contrato social para incrementar la inclusión social, productiva y política"},"O23011601120000001639",1,805018905,"YUBARTA S.A.S","Persona Jurídica",null,null,null,null,35672418.18,null,null,null,35672418.18,0,"2022-09-13","2022-09-13","2023-01-31",97,null,null,null,null,null,null,"Terminado",0]
[95997,2022,95997,"https://colombiacompra.gov.co/tienda-virtual-del-estado-colombiano/ordenes-compra/95997","Otros","Selección abreviada","Acuerdo marco de precios ","TRANSFORMACION Y DOTACION DE AMBIENTES PEDAGOGICOS FISICOS Y VIRTUALES PARA EDUCACION INICIAL EVENTO DE COTIZACION 136074","Inversión","Un nuevo contrato social y ambiental para la Bogotá del Siglo XXI",12,{"$f":"IF(ISERROR(VLOOKUP(K470,Proposito_programa!$C$2:$E$59,2,FALSE)),\" \",VLOOKUP(K470,Proposito_programa!$C$2:$E$59,2,FALSE))","v":"Educación inicial: Bases sólidas para la vida."},{"$f":"IF(ISERROR(VLOOKUP(K470,Proposito_programa!$C$2:$E$59,3,FALSE)),\" \",VLOOKUP(K470,Proposito_programa!$C$2:$E$59,3,FALSE))","v":"Propósito 1: Hacer un nuevo contrato social para incrementar la inclusión social, productiva y política"},"O23011601120000001639",1,900405496,"COMERCIALIZADORA LA GEMA SAS","Persona Jurídica",null,null,null,null,42200146,null,null,null,42200146,0,"2022-09-13","2022-09-13","2023-03-21",97,null,null,null,null,null,null,"En ejecución",0]
[95998,2022,95998,"https://colombiacompra.gov.co/tienda-virtual-del-estado-colombiano/ordenes-compra/95998","Otros","Selección abreviada","Acuerdo marco de precios ","TRANSFORMACION Y DOTACION DE AMBIENTES PEDAGOGICOS FISICOS Y VIRTUALES PARA EDUCACION INICIAL EVENTO DE COTIZACION 136074","Inversión","Un nuevo contrato social y ambiental para la Bogotá del Siglo XXI",12,{"$f":"IF(ISERROR(VLOOKUP(K471,Proposito_programa!$C$2:$E$59,2,FALSE)),\" \",VLOOKUP(K471,Proposito_programa!$C$2:$E$59,2,FALSE))","v":"Educación inicial: Bases sólidas para la vida."},{"$f":"IF(ISERROR(VLOOKUP(K471,Proposito_programa!$C$2:$E$59,3,FALSE)),\" \",VLOOKUP(K471,Proposito_programa!$C$2:$E$59,3,FALSE))","v":"Propósito 1: Hacer un nuevo contrato social para incrementar la inclusión social, productiva y política"},"O23011601120000001639",1,59706955,"DEICY BRAVO JOJOA","Persona Jurídica",null,null,null,null,1859041.8,null,null,null,1859041.8,0,"2022-09-13","2022-09-13","2022-12-20",97,null,null,null,null,null,null,"Terminado",0]
[95999,2022,95999,"https://colombiacompra.gov.co/tienda-virtual-del-estado-colombiano/ordenes-compra/95999","Otros","Selección abreviada","Acuerdo marco de precios ","TRANSFORMACION Y DOTACION DE AMBIENTES PEDAGOGICOS FISICOS Y VIRTUALES PARA EDUCACION INICIAL EVENTO DE COTIZACION 136074","Inversión","Un nuevo contrato social y ambiental para la Bogotá del Siglo XXI",12,{"$f":"IF(ISERROR(VLOOKUP(K472,Proposito_programa!$C$2:$E$59,2,FALSE)),\" \",VLOOKUP(K472,Proposito_programa!$C$2:$E$59,2,FALSE))","v":"Educación inicial: Bases sólidas para la vida."},{"$f":"IF(ISERROR(VLOOKUP(K472,Proposito_programa!$C$2:$E$59,3,FALSE)),\" \",VLOOKUP(K472,Proposito_programa!$C$2:$E$59,3,FALSE))","v":"Propósito 1: Hacer un nuevo contrato social para incrementar la inclusión social, productiva y política"},"O23011601120000001639",1,800209890,"Comercializadora Vinarta S.A.S","Persona Jurídica",null,null,null,null,59093187,null,null,null,59093187,0,"2022-09-13","2022-09-13","2023-03-31",97,null,null,null,null,null,null,"En ejecución",0]
[96000,2022,96000,"https://colombiacompra.gov.co/tienda-virtual-del-estado-colombiano/ordenes-compra/96000","Otros","Selección abreviada","Acuerdo marco de precios ","TRANSFORMACION Y DOTACION DE AMBIENTES PEDAGOGICOS FISICOS Y VIRTUALES PARA EDUCACION INICIAL EVENTO DE COTIZACION 136074","Inversión","Un nuevo contrato social y ambiental para la Bogotá del Siglo XXI",12,{"$f":"IF(ISERROR(VLOOKUP(K473,Proposito_programa!$C$2:$E$59,2,FALSE)),\" \",VLOOKUP(K473,Proposito_programa!$C$2:$E$59,2,FALSE))","v":"Educación inicial: Bases sólidas para la vida."},{"$f":"IF(ISERROR(VLOOKUP(K473,Proposito_programa!$C$2:$E$59,3,FALSE)),\" \",VLOOKUP(K473,Proposito_programa!$C$2:$E$59,3,FALSE))","v":"Propósito 1: Hacer un nuevo contrato social para incrementar la inclusión social, productiva y política"},"O23011601120000001639",1,900552715,"GRUPO EMPRESARIAL MADEX S.A.S.","Persona Jurídica",null,null,null,null,715824306,null,null,null,715824306,0,"2022-09-13","2022-09-13","2023-03-20",97,null,null,null,null,null,null,"En ejecución",0]
[96162,2022,96162,"https://colombiacompra.gov.co/tienda-virtual-del-estado-colombiano/ordenes-compra/96162","Suministro","Selección abreviada","Acuerdo marco de precios ","“Contratar Suministro de Combustible a monto agotable de ACPM para el parque automotor (vehículos livianos y Maquinaria Amarilla) a cargo del Fondo de Desarrollo Local de Rafael Uribe Uribe a través del Acuerdo Marco de precios de suministro de combustible con sistema de control EDS en Bogotá","Funcionamiento","Un nuevo contrato social y ambiental para la Bogotá del Siglo XXI","No aplica",{"$f":"IF(ISERROR(VLOOKUP(K474,Proposito_programa!$C$2:$E$59,2,FALSE)),\" \",VLOOKUP(K474,Proposito_programa!$C$2:$E$59,2,FALSE))","v":" "},{"$f":"IF(ISERROR(VLOOKUP(K474,Proposito_programa!$C$2:$E$59,3,FALSE)),\" \",VLOOKUP(K474,Proposito_programa!$C$2:$E$59,3,FALSE))","v":" "},"O2120201003033336103",1,830095213,"Organización Terpel S.A.","Persona Jurídica",null,null,null,null,22000000,null,null,null,22000000,5021550,"2022-09-16","2022-09-16","2023-04-20",214,null,null,null,null,null,null,"En ejecución",0.22825227272727272]
[96162,2022,96162,"https://colombiacompra.gov.co/tienda-virtual-del-estado-colombiano/ordenes-compra/96162","Suministro","Selección abreviada","Acuerdo marco de precios ","“Contratar Suministro de Combustible a monto agotable de ACPM para el parque automotor (vehículos livianos y Maquinaria Amarilla) a cargo del Fondo de Desarrollo Local de Rafael Uribe Uribe a través del Acuerdo Marco de precios de suministro de combustible con sistema de control EDS en Bogotá","Inversión","Un nuevo contrato social y ambiental para la Bogotá del Siglo XXI",49,{"$f":"IF(ISERROR(VLOOKUP(K475,Proposito_programa!$C$2:$E$59,2,FALSE)),\" \",VLOOKUP(K475,Proposito_programa!$C$2:$E$59,2,FALSE))","v":"Movilidad segura, sostenible y accesible"},{"$f":"IF(ISERROR(VLOOKUP(K475,Proposito_programa!$C$2:$E$59,3,FALSE)),\" \",VLOOKUP(K475,Proposito_programa!$C$2:$E$59,3,FALSE))","v":"Propósito 4: Hacer de Bogotá Región un modelo de movilidad multimodal, incluyente y sostenible"},"O23011604490000001685",1,830095213,"Organización Terpel S.A.","Persona Jurídica",null,null,null,null,20000000,null,null,null,20000000,5703198,"2022-09-16","2022-09-16","2023-04-20",214,null,null,null,null,null,null,"En ejecución",0.28515990000000002]
[97569,2022,97569,"https://colombiacompra.gov.co/tienda-virtual-del-estado-colombiano/ordenes-compra/97569","Otros","Selección abreviada","Acuerdo marco de precios ","CONTRATAR LA ADQUISICION DE LA SUSCRIPCION MENSUAL DE LAS LICENCIAS OFFICE 365 - HERRAMIENTA COLABORATIVA Y DE CORREO ELECTRONICO PARA LA ALCALDIA LOCAL DE RAFAEL URIBE URIBE","Inversión","Un nuevo contrato social y ambiental para la Bogotá del Siglo XXI",57,{"$f":"IF(ISERROR(VLOOKUP(K476,Proposito_programa!$C$2:$E$59,2,FALSE)),\" \",VLOOKUP(K476,Proposito_programa!$C$2:$E$59,2,FALSE))","v":"Gestión pública local"},{"$f":"IF(ISERROR(VLOOKUP(K476,Proposito_programa!$C$2:$E$59,3,FALSE)),\" \",VLOOKUP(K476,Proposito_programa!$C$2:$E$59,3,FALSE))","v":"Propósito 5: Construir Bogotá - Región con gobierno abierto, transparente y ciudadanía consciente"},"O23011605570000001697",1,901010523,"SOLUCIONES ORION SUCURSAL COLOMBIA","Persona Jurídica",null,null,null,null,35929332,null,null,null,35929332,35929332,"2022-10-18","2022-10-18","2022-11-20",32,null,null,null,null,null,null,"Terminado",1]
[102020,2022,102020,"https://colombiacompra.gov.co/tienda-virtual-del-estado-colombiano/ordenes-compra/102020","Compraventa de bienes muebles","Selección abreviada","Acuerdo marco de precios ","COMPRA DE ELEMENTOS PARA LA ATENCION A LA CIUDADANIA EN EL MARCO DEL PROYECTO DE INVERSION 1697 \"GESTION PUBLICA TRANSPARENTE Y QUE RINDE CUENTAS A LA CIUDADANIA EN RAFAEL URIBE URIBE","Inversión","Un nuevo contrato social y ambiental para la Bogotá del Siglo XXI",57,{"$f":"IF(ISERROR(VLOOKUP(K477,Proposito_programa!$C$2:$E$59,2,FALSE)),\" \",VLOOKUP(K477,Proposito_programa!$C$2:$E$59,2,FALSE))","v":"Gestión pública local"},{"$f":"IF(ISERROR(VLOOKUP(K477,Proposito_programa!$C$2:$E$59,3,FALSE)),\" \",VLOOKUP(K477,Proposito_programa!$C$2:$E$59,3,FALSE))","v":"Propósito 5: Construir Bogotá - Región con gobierno abierto, transparente y ciudadanía consciente"},"O23011605570000001697",1,830037946,"PANAMERICANA LIBRERÍA Y PAPELERÍA S.A.","Persona Jurídica",null,null,null,null,29219498,null,null,null,29219498,0,"2022-12-13","2022-12-13","2023-02-20",67,null,null,null,null,null,null,"En ejecución",0]
[102201,2022,102201,"https://colombiacompra.gov.co/tienda-virtual-del-estado-colombiano/ordenes-compra/102201","Compraventa de bienes muebles","Selección abreviada","Acuerdo marco de precios ","ADQUISICION DE INSUMOS PARA IMPLEMENTACIÓN DE LA SALA AMIGA DE LA FAMILIA LACTANTE EN LA ALCALDÍA LOCAL DE RAFAEL URIBE URIBE\"","Inversión","Un nuevo contrato social y ambiental para la Bogotá del Siglo XXI",57,{"$f":"IF(ISERROR(VLOOKUP(K478,Proposito_programa!$C$2:$E$59,2,FALSE)),\" \",VLOOKUP(K478,Proposito_programa!$C$2:$E$59,2,FALSE))","v":"Gestión pública local"},{"$f":"IF(ISERROR(VLOOKUP(K478,Proposito_programa!$C$2:$E$59,3,FALSE)),\" \",VLOOKUP(K478,Proposito_programa!$C$2:$E$59,3,FALSE))","v":"Propósito 5: Construir Bogotá - Región con gobierno abierto, transparente y ciudadanía consciente"},"O23011605570000001697",1,860007336,"CAJA COLOMBIANA DE SUBSIDIO FAMILIAR COLSUBSIDIO","Persona Jurídica",null,null,null,null,2135900,null,null,null,2135900,0,"2022-12-15","2022-12-15","2023-02-17",62,null,null,null,null,null,null,"En ejecución",0]
[102202,2022,102202,"https://colombiacompra.gov.co/tienda-virtual-del-estado-colombiano/ordenes-compra/102202","Compraventa de bienes muebles","Selección abreviada","Acuerdo marco de precios ","ADQUISICION DE INSUMOS PARA IMPLEMENTACIÓN DE LA SALA AMIGA DE LA FAMILIA LACTANTE EN LA ALCALDÍA LOCAL DE RAFAEL URIBE URIBE","Inversión","Un nuevo contrato social y ambiental para la Bogotá del Siglo XXI",57,{"$f":"IF(ISERROR(VLOOKUP(K479,Proposito_programa!$C$2:$E$59,2,FALSE)),\" \",VLOOKUP(K479,Proposito_programa!$C$2:$E$59,2,FALSE))","v":"Gestión pública local"},{"$f":"IF(ISERROR(VLOOKUP(K479,Proposito_programa!$C$2:$E$59,3,FALSE)),\" \",VLOOKUP(K479,Proposito_programa!$C$2:$E$59,3,FALSE))","v":"Propósito 5: Construir Bogotá - Región con gobierno abierto, transparente y ciudadanía consciente"},"O23011605570000001697",1,900365660,"PROVEER INSTITUCIONAL SAS","Persona Jurídica",null,null,null,null,104000,null,null,null,104000,0,"2022-12-15","2022-12-15","2023-02-17",62,null,null,null,null,null,null,"En ejecución",0]
[102883,2022,102883,"https://colombiacompra.gov.co/tienda-virtual-del-estado-colombiano/ordenes-compra/102883","Compraventa de bienes muebles","Selección abreviada","Acuerdo marco de precios ","ADQUISICIÓN DE SILLAS ERGONOMICAS PARA LA ALCALDÍA LOCAL DE RAFAEL URIBE URIBE”","Inversión","Un nuevo contrato social y ambiental para la Bogotá del Siglo XXI",57,{"$f":"IF(ISERROR(VLOOKUP(K480,Proposito_programa!$C$2:$E$59,2,FALSE)),\" \",VLOOKUP(K480,Proposito_programa!$C$2:$E$59,2,FALSE))","v":"Gestión pública local"},{"$f":"IF(ISERROR(VLOOKUP(K480,Proposito_programa!$C$2:$E$59,3,FALSE)),\" \",VLOOKUP(K480,Proposito_programa!$C$2:$E$59,3,FALSE))","v":"Propósito 5: Construir Bogotá - Región con gobierno abierto, transparente y ciudadanía consciente"},"O23011605570000001697",1,800028446,"Manufacturas Sumapaz S.A","Persona Jurídica",null,null,null,null,112634343,null,null,null,112634343,0,"2022-12-22","2022-12-22","2023-02-28",66,null,null,null,null,null,null,"En ejecución",0]
[63094,2020,63094,"https://www.colombiacompra.gov.co/tienda-virtual-del-estado-colombiano/ordenes-compra/63094","Suministro","Selección abreviada","Acuerdo marco de precios ","CONTRATAR EL SERVICIO DE IMPRESORAS PARA EL FUNCIONAMIENTO DE LA ALCALDIA LOCAL RAFAEL URIBE URIBE","Funcionamiento","Un nuevo contrato social y ambiental para la Bogotá del Siglo XXI","No aplica",{"$f":"IF(ISERROR(VLOOKUP(K481,Proposito_programa!$C$2:$E$59,2,FALSE)),\" \",VLOOKUP(K481,Proposito_programa!$C$2:$E$59,2,FALSE))","v":" "},{"$f":"IF(ISERROR(VLOOKUP(K481,Proposito_programa!$C$2:$E$59,3,FALSE)),\" \",VLOOKUP(K481,Proposito_programa!$C$2:$E$59,3,FALSE))","v":" "},"O23011604490000001685",1,830053669,"SOLUCION COPY LTDA.","Persona Jurídica",null,null,null,null,0,null,1,7443450,{"$f":"+W481+X481+Z481","v":7443450},7443450,"2021-07-31","2021-07-31","2022-11-04",390,1,68,null,null,null,null,"Terminado",{"$f":"IF(ISERROR(AB481/AA481),\"-\",(AB481/AA481))","v":1}]
[70180,2021,70180,"https://colombiacompra.gov.co/tienda-virtual-del-estado-colombiano/ordenes-compra/70180","Contratos de prestación de servicios","Selección abreviada","Acuerdo marco de precios "," PRESTAR EL SERVICIO INTEGRAL DE ASEO Y CAFETERÍA INCLUIDO EL MANTENIMIENTO LOCATIVO BÁSICO, LOS EQUIPOS NECESARIOS PARA EL DESARROLLO DEL MISMO Y EL SUMINISTRO DE INSUMOS PARA LAS DEPENDENCIAS DE LA ALCALDÍA LOCAL DE RAFAEL URIBE URIBE Y LA JUNTA ADMINISTRADORA LOCAL","Funcionamiento","Un nuevo contrato social y ambiental para la Bogotá del Siglo XXI","No aplica",{"$f":"IF(ISERROR(VLOOKUP(K482,Proposito_programa!$C$2:$E$59,2,FALSE)),\" \",VLOOKUP(K482,Proposito_programa!$C$2:$E$59,2,FALSE))","v":" "},{"$f":"IF(ISERROR(VLOOKUP(K482,Proposito_programa!$C$2:$E$59,3,FALSE)),\" \",VLOOKUP(K482,Proposito_programa!$C$2:$E$59,3,FALSE))","v":" "},"O23011604490000001685",1,811044253,"ASEAR S.A. E.S.P","Persona Jurídica",null,null,null,null,0,null,1,12000000,12000000,11529017,"2021-06-02","2021-06-04","2022-06-03",360,null,null,null,null,null,null,"Terminado",0.96075141666666664]
["No aplica",2022,"No aplica","No aplica","Otros gastos","Otros","No aplica","FACTURAS RECIBOS PUBLICOS","Funcionamiento","Un nuevo contrato social y ambiental para la Bogotá del Siglo XXI","No aplica",{"$f":"IF(ISERROR(VLOOKUP(K483,Proposito_programa!$C$2:$E$59,2,FALSE)),\" \",VLOOKUP(K483,Proposito_programa!$C$2:$E$59,2,FALSE))","v":" "},{"$f":"IF(ISERROR(VLOOKUP(K483,Proposito_programa!$C$2:$E$59,3,FALSE)),\" \",VLOOKUP(K483,Proposito_programa!$C$2:$E$59,3,FALSE))","v":" "},"O2120202","No aplica",null,"FACTURAS RECIBOS PUBLICOS","Persona Jurídica",null,null,null,null,133090861,null,null,null,{"$f":"+W483+X483+Z483","v":133090861},120749035,"2022-01-01","2022-01-01","2022-12-31",360,null,null,null,null,null,null,"Terminado",{"$f":"IF(ISERROR(AB483/AA483),\"-\",(AB483/AA483))","v":0.90726766731188246}]
["No aplica",2022,"No aplica","No aplica","Otros gastos","Otros","No aplica","CAJA MENOR","Funcionamiento","Un nuevo contrato social y ambiental para la Bogotá del Siglo XXI","No aplica",{"$f":"IF(ISERROR(VLOOKUP(K484,Proposito_programa!$C$2:$E$59,2,FALSE)),\" \",VLOOKUP(K484,Proposito_programa!$C$2:$E$59,2,FALSE))","v":" "},{"$f":"IF(ISERROR(VLOOKUP(K484,Proposito_programa!$C$2:$E$59,3,FALSE)),\" \",VLOOKUP(K484,Proposito_programa!$C$2:$E$59,3,FALSE))","v":" "},"O2120202","No aplica",null,"CAJA MENOR","Persona Jurídica",null,null,null,null,6318850,null,null,null,6318850,6318850,"2022-01-01","2022-01-01","2022-12-31",360,null,null,null,null,null,null,"Terminado",1]
["No aplica",2022,"No aplica","No aplica","Otros gastos","Otros","No aplica","PAGO DE LA PLANILLA INTEGRADA DE AUTOLIQUIDACIÓN DE APORTES DE LA VIGENCIA 2022, DE LOS CONTRATISTAS DE PRESTACIÓN DE SERVICIOS CLASIFICADOS EN RIESGO IV Y V DE ARL VINCULADOS A LA ALCALDÍA LOCAL DE RAFAEL URIBE URIBE CON CONTRATOS SUPERIORES A UN MES  2022","Inversión","Un nuevo contrato social y ambiental para la Bogotá del Siglo XXI",30,{"$f":"IF(ISERROR(VLOOKUP(K485,Proposito_programa!$C$2:$E$59,2,FALSE)),\" \",VLOOKUP(K485,Proposito_programa!$C$2:$E$59,2,FALSE))","v":"Eficiencia en la atención de emergencias"},{"$f":"IF(ISERROR(VLOOKUP(K485,Proposito_programa!$C$2:$E$59,3,FALSE)),\" \",VLOOKUP(K485,Proposito_programa!$C$2:$E$59,3,FALSE))","v":"Propósito 2 : Cambiar Nuestros Hábitos de Vida para Reverdecer a Bogotá y Adaptarnos y Mitigar la Crisis Climática"},"O23011602300000001665",1,860011153,"POSITIVA COMPAÑIA DE SEGUROS SA","Persona Jurídica",null,null,null,null,10170342,null,null,null,10170342,7097700,null,"2022-01-01","2022-12-31",360,null,null,null,null,null,null,"Terminado",0.69788213611695649]
["No aplica",2022,"No aplica","No aplica","Otros gastos","Otros","No aplica","PAGO DE LA PLANILLA INTEGRADA DE AUTOLIQUIDACIÓN DE APORTES DE LA VIGENCIA 2022, DE LOS CONTRATISTAS DE PRESTACIÓN DE SERVICIOS CLASIFICADOS EN RIESGO IV Y V DE ARL VINCULADOS A LA ALCALDÍA LOCAL DE RAFAEL URIBE URIBE CON CONTRATOS SUPERIORES A UN MES.  2022","Inversión","Un nuevo contrato social y ambiental para la Bogotá del Siglo XXI",57,{"$f":"IF(ISERROR(VLOOKUP(K486,Proposito_programa!$C$2:$E$59,2,FALSE)),\" \",VLOOKUP(K486,Proposito_programa!$C$2:$E$59,2,FALSE))","v":"Gestión pública local"},{"$f":"IF(ISERROR(VLOOKUP(K486,Proposito_programa!$C$2:$E$59,3,FALSE)),\" \",VLOOKUP(K486,Proposito_programa!$C$2:$E$59,3,FALSE))","v":"Propósito 5: Construir Bogotá - Región con gobierno abierto, transparente y ciudadanía consciente"},"O23011605570000001697",1,860011153,"POSITIVA COMPAÑIA DE SEGUROS SA","Persona Jurídica",null,null,null,null,7882980,null,null,null,7882980,6702800,"2022-01-01","2022-01-01","2022-12-31",360,null,null,null,null,null,null,"Terminado",0.85028758159985185]
["No aplica",2022,"No aplica","No aplica","Otros gastos","Otros","No aplica","PAGO DE LA PLANILLA INTEGRADA DE AUTOLIQUIDACIÓN DE APORTES DE LA VIGENCIA 2022, DE LOS CONTRATISTAS DE PRESTACIÓN DE SERVICIOS CLASIFICADOS EN RIESGO IV Y V DE ARL VINCULADOS A LA ALCALDÍA LOCAL DE RAFAEL URIBE URIBE CON CONTRATOS SUPERIORES A UN MES.  2022","Inversión","Un nuevo contrato social y ambiental para la Bogotá del Siglo XXI",57,{"$f":"IF(ISERROR(VLOOKUP(K487,Proposito_programa!$C$2:$E$59,2,FALSE)),\" \",VLOOKUP(K487,Proposito_programa!$C$2:$E$59,2,FALSE))","v":"Gestión pública local"},{"$f":"IF(ISERROR(VLOOKUP(K487,Proposito_programa!$C$2:$E$59,3,FALSE)),\" \",VLOOKUP(K487,Proposito_programa!$C$2:$E$59,3,FALSE))","v":"Propósito 5: Construir Bogotá - Región con gobierno abierto, transparente y ciudadanía consciente"},"O23011605570000001698",1,860011153,"POSITIVA COMPAÑIA DE SEGUROS SA","Persona Jurídica",null,null,null,null,4070100,null,null,null,4070100,2774500,"2022-01-01","2022-01-01","2022-12-31",360,null,null,null,null,null,null,"Terminado",0.68167858283580252]
["No aplica",2022,"No aplica","No aplica","Otros gastos","Otros","No aplica","PAGO DE LA PLANILLA INTEGRADA DE AUTOLIQUIDACIÓN DE APORTES DE LA VIGENCIA 2022, DE LOS CONTRATISTAS DE PRESTACIÓN DE SERVICIOS CLASIFICADOS EN RIESGO IV Y V DE ARL VINCULADOS A LA ALCALDÍA LOCAL DE RAFAEL URIBE URIBE CON CONTRATOS SUPERIORES A UN MES.  2022","Inversión","Un nuevo contrato social y ambiental para la Bogotá del Siglo XXI",43,{"$f":"IF(ISERROR(VLOOKUP(K488,Proposito_programa!$C$2:$E$59,2,FALSE)),\" \",VLOOKUP(K488,Proposito_programa!$C$2:$E$59,2,FALSE))","v":"Cultura ciudadana para la confianza, la convivencia y la participación desde la vida cotidiana"},{"$f":"IF(ISERROR(VLOOKUP(K488,Proposito_programa!$C$2:$E$59,3,FALSE)),\" \",VLOOKUP(K488,Proposito_programa!$C$2:$E$59,3,FALSE))","v":"Propósito 3: Inspirar confianza y legitimidad para vivir sin miedo y ser epicentro de cultura ciudadana, paz y reconciliación"},"O23011603430000001680",1,860011153,"POSITIVA COMPAÑIA DE SEGUROS SA","Persona Jurídica",null,null,null,null,23525856,null,null,null,23525856,19713800,"2022-01-01","2022-01-01","2022-12-31",360,null,null,null,null,null,null,"Terminado",0.83796313298865721]
["No aplica",2022,"No aplica","No aplica","Otros gastos","Otros","No aplica","POR MEDIO DE LA CUAL SE ORDENA EL PAGO DEL GASTO Y PAGO QUE SE CAUSEN EN DESARROLLO  DEL PROYECTO NO. 1636: “MEJORAMIENTO DE LA CALIDAD DE VIDA DEL ADULTO MAYOR EN RAFAEL URIBE URIBE” EN SU COMPONENTE: ENTREGA DE APOYOS ECONÓMICOS TIPO C A PERSONAS MAYORES DE LA LOCALIDAD RAFAEL URIBE URIBE DE LA VIGENCIA 2022","Inversión","Un nuevo contrato social y ambiental para la Bogotá del Siglo XXI",1,{"$f":"IF(ISERROR(VLOOKUP(K489,Proposito_programa!$C$2:$E$59,2,FALSE)),\" \",VLOOKUP(K489,Proposito_programa!$C$2:$E$59,2,FALSE))","v":"Subsidios y transferencias para la equidad"},{"$f":"IF(ISERROR(VLOOKUP(K489,Proposito_programa!$C$2:$E$59,3,FALSE)),\" \",VLOOKUP(K489,Proposito_programa!$C$2:$E$59,3,FALSE))","v":"Propósito 1: Hacer un nuevo contrato social para incrementar la inclusión social, productiva y política"},"O23011601010000001636","No aplica","860066942","CAJA DE COMPENSACION FAMILIAR COMPENSAR","Persona Jurídica",null,null,null,null,10284000000,null,null,null,10284000000,10255762271,"2022-01-01","2022-01-01","2022-12-31",360,null,null,null,null,null,null,"Terminado",0.99725420760404515]
["No aplica",2022,"No aplica","No aplica","Otros gastos","Otros","No aplica","SALUD EDILES","Funcionamiento","Un nuevo contrato social y ambiental para la Bogotá del Siglo XXI","No aplica",{"$f":"IF(ISERROR(VLOOKUP(K490,Proposito_programa!$C$2:$E$59,2,FALSE)),\" \",VLOOKUP(K490,Proposito_programa!$C$2:$E$59,2,FALSE))","v":" "},{"$f":"IF(ISERROR(VLOOKUP(K490,Proposito_programa!$C$2:$E$59,3,FALSE)),\" \",VLOOKUP(K490,Proposito_programa!$C$2:$E$59,3,FALSE))","v":" "},"O2120202","No aplica",null,"SALUD EDILES","Persona Jurídica",null,null,null,null,137000000,null,null,null,137000000,122660200,"2022-01-01","2022-01-01","2022-12-31",360,null,null,null,null,null,null,"Terminado",0.8953299270072993]
["No aplica",2022,"No aplica","No aplica","Otros gastos","Otros","No aplica","PAGO DE HONORARIOS DE LOS EDILES DE LA LOCALIDAD DE RAFAEL URIBE URIBE","Funcionamiento","Un nuevo contrato social y ambiental para la Bogotá del Siglo XXI","No aplica",{"$f":"IF(ISERROR(VLOOKUP(K491,Proposito_programa!$C$2:$E$59,2,FALSE)),\" \",VLOOKUP(K491,Proposito_programa!$C$2:$E$59,2,FALSE))","v":" "},{"$f":"IF(ISERROR(VLOOKUP(K491,Proposito_programa!$C$2:$E$59,3,FALSE)),\" \",VLOOKUP(K491,Proposito_programa!$C$2:$E$59,3,FALSE))","v":" "},"O2120202","No aplica",null,"PAGO DE HONORARIOS DE LOS EDILES DE LA LOCALIDAD DE RAFAEL URIBE URIBE","Persona Natural",null,null,null,null,1093957000,null,null,null,1093957000,992897696,"2022-01-01","2022-01-01","2022-12-31",360,null,null,null,null,null,null,"Terminado",0.90762040555524581]
["No aplica",2022,"No aplica","No aplica","Otros gastos","Otros","No aplica","POR EL CUAL SE AUTORIZA LA TRANSFERENCIA DE RECURSOS DEL FONDO DE DESARROLLO LOCAL DE RAFAEL URIBE URIBE, CON DESTINO AL SISTEMA DISTRITAL BOGOTA SOLIDARIA A TRAVES DE LA DIRECCION DISTRITAL DE TESORERIA SECRETARIA DE HACIENDA DISTRITAL PARA ENTREGAR APOYOS QUE CONTRIBUYAN AL INGRESO MINIMO GARANTIZADO A LOS HOGARES POBRES DE LA LOCALIDAD.","Inversión","Un nuevo contrato social y ambiental para la Bogotá del Siglo XXI",1,{"$f":"IF(ISERROR(VLOOKUP(K492,Proposito_programa!$C$2:$E$59,2,FALSE)),\" \",VLOOKUP(K492,Proposito_programa!$C$2:$E$59,2,FALSE))","v":"Subsidios y transferencias para la equidad"},{"$f":"IF(ISERROR(VLOOKUP(K492,Proposito_programa!$C$2:$E$59,3,FALSE)),\" \",VLOOKUP(K492,Proposito_programa!$C$2:$E$59,3,FALSE))","v":"Propósito 1: Hacer un nuevo contrato social para incrementar la inclusión social, productiva y política"},"O23011601010000002213","No aplica",null,"FONDO DE DESARROLLO LOCAL DE RAFAEL URIB E","Persona Jurídica",null,null,null,null,2326482000,null,null,null,2326482000,2326482000,"2022-01-01","2022-01-01","2022-12-31",360,null,null,null,null,null,null,"Terminado",1]
["No aplica",2022,"No aplica","No aplica","Otros gastos","Otros","No aplica",null,"Funcionamiento",null,"No aplica",{"$f":"IF(ISERROR(VLOOKUP(K493,Proposito_programa!$C$2:$E$59,2,FALSE)),\" \",VLOOKUP(K493,Proposito_programa!$C$2:$E$59,2,FALSE))","v":" "},{"$f":"IF(ISERROR(VLOOKUP(K493,Proposito_programa!$C$2:$E$59,3,FALSE)),\" \",VLOOKUP(K493,Proposito_programa!$C$2:$E$59,3,FALSE))","v":" "},"O2120202","No aplica",null,"OBLIGACIONES POR PAGAR VIGENCIAS ANTERIORES ","Persona Jurídica",null,null,null,null,0,null,null,null,0,null,"2022-01-01","2022-01-01","2022-12-31",360,null,null,null,null,null,null,"Terminado","-"]
["No aplica",2022,"No aplica","No aplica","Otros gastos","Otros gastos","Otros gastos","FIRMAS ELECTRONICAS","Funcionamiento","Un Nuevo Contrato Social y Ambiental para la Bogotá del Siglo XXI","No aplica"," "," ",1310201010102,null,900204272,"GESTION DE SEGURIDAD ELECTRONICA S.A","Persona Jurídica",null,null,null,null,226100,null,null,null,226100,226100,"2022-01-01","2022-01-01","2022-12-31",360,null,null,null,null,null,null,"Terminado",1]
[null,null,null,null,null,null,null,null,null,null,null,null,null,null,null,null,null,null,null,null,null,null,null,{"$f":"SUM(X14:X494)","v":0},{"$f":"SUM(Y14:Y494)","v":244},5932765999]
[null,null,null,null,null,null,null,null,null,null,null,null,null,null,null,null,null,null,null,null,null,null,null,null,null,null,{"$f":"SUBTOTAL(9,AA14:AA495)","v":72394714028.220001},{"$f":"SUBTOTAL(9,AB14:AB495)","v":29679677041}]
[]
[]
[null,null,null,null,null,null,null,null,null,null,null,null,null,null,null,null,null,null,null,null,null,null,null,null,null,null,{"$f":"SUBTOTAL(9,AA211:AA494)","v":63339919694.220009},{"$f":"SUBTOTAL(9,AB211:AB494)","v":21848116040}]
[null,null,null,null,null,null,null,null,null,null,null,null,null,null,null,null,null,null,null,null,null,null,null,null,null,null,2735816993,2060328771]
[null,null,null,null,null,null,null,null,null,null,null,null,null,null,null,null,null,null,null,null,null,null,null,null,null,null,{"$f":"+AA499-AA500","v":60604102701.220009},{"$f":"+AB499-AB500","v":19787787269}]

{"sheet":"Proposito_programa","index":3,"n_rows":59,"n_cols":5,"rows_kept":59,"cut":false,"hidden":false,"merged":[]}
[]
[null,"PDD","No. Programa","Programa","Propósito"]
["Acuerdo 761 2020","Un Nuevo Contrato Social y Ambiental para la Bogotá del Siglo XXI",1,"Subsidios y transferencias para la equidad","Propósito 1: Hacer un nuevo contrato social para incrementar la inclusión social, productiva y política"]
["Pag. 51","Un Nuevo Contrato Social y Ambiental para la Bogotá del Siglo XXI",{"$f":"+C3+1","v":2},"Igualdad de oportunidades y desarrollo de capacidades para las mujeres","Propósito 1: Hacer un nuevo contrato social para incrementar la inclusión social, productiva y política"]
[null,"Un Nuevo Contrato Social y Ambiental para la Bogotá del Siglo XXI",{"$f":"+C4+1","v":3},"Movilidad social integral","Propósito 1: Hacer un nuevo contrato social para incrementar la inclusión social, productiva y política"]
[null,"Un Nuevo Contrato Social y Ambiental para la Bogotá del Siglo XXI",4,"Prevención de la exclusión por razones étnicas, religiosas, sociales, políticas y de orientación sexual","Propósito 1: Hacer un nuevo contrato social para incrementar la inclusión social, productiva y política"]
[null,"Un Nuevo Contrato Social y Ambiental para la Bogotá del Siglo XXI",5,"Promoción de la igualdad, el desarrollo de capacidades y el reconocimiento de las mujeres","Propósito 1: Hacer un nuevo contrato social para incrementar la inclusión social, productiva y política"]
[null,"Un Nuevo Contrato Social y Ambiental para la Bogotá del Siglo XXI",6,"Sistema Distrital de Cuidado","Propósito 1: Hacer un nuevo contrato social para incrementar la inclusión social, productiva y política"]
[null,"Un Nuevo Contrato Social y Ambiental para la Bogotá del Siglo XXI",7,"Mejora de la gestión de instituciones de salud","Propósito 1: Hacer un nuevo contrato social para incrementar la inclusión social, productiva y política"]
[null,"Un Nuevo Contrato Social y Ambiental para la Bogotá del Siglo XXI",8,"Prevención y atención de maternidad temprana","Propósito 1: Hacer un nuevo contrato social para incrementar la inclusión social, productiva y política"]
[null,"Un Nuevo Contrato Social y Ambiental para la Bogotá del Siglo XXI",9,"Prevención y cambios para mejorar la salud de la población","Propósito 1: Hacer un nuevo contrato social para incrementar la inclusión social, productiva y política"]
[null,"Un Nuevo Contrato Social y Ambiental para la Bogotá del Siglo XXI",10,"Salud para la vida y el bienestar","Propósito 1: Hacer un nuevo contrato social para incrementar la inclusión social, productiva y política"]
[null,"Un Nuevo Contrato Social y Ambiental para la Bogotá del Siglo XXI",11,"Salud y bienestar para niñas y niños","Propósito 1: Hacer un nuevo contrato social para incrementar la inclusión social, productiva y política"]
[null,"Un Nuevo Contrato Social y Ambiental para la Bogotá del Siglo XXI",12,"Educación inicial: Bases sólidas para la vida.","Propósito 1: Hacer un nuevo contrato social para incrementar la inclusión social, productiva y política"]
[null,"Un Nuevo Contrato Social y Ambiental para la Bogotá del Siglo XXI",13,"Educación para todos y todas: acceso y permanencia con equidad y énfasis en educación rural","Propósito 1: Hacer un nuevo contrato social para incrementar la inclusión social, productiva y política"]
[null,"Un Nuevo Contrato Social y Ambiental para la Bogotá del Siglo XXI",14,"Formación integral: más y mejor tiempo en los colegios","Propósito 1: Hacer un nuevo contrato social para incrementar la inclusión social, productiva y política"]
[null,"Un Nuevo Contrato Social y Ambiental para la Bogotá del Siglo XXI",15,"Plan Distrital de Lectura, Escritura y Oralidad: \"Leer para la vida\"","Propósito 1: Hacer un nuevo contrato social para incrementar la inclusión social, productiva y política"]
[null,"Un Nuevo Contrato Social y Ambiental para la Bogotá del Siglo XXI",16,"Transformación pedagógica y mejoramiento de la gestión educativa. Es con los maestros y maestras.","Propósito 1: Hacer un nuevo contrato social para incrementar la inclusión social, productiva y política"]
[null,"Un Nuevo Contrato Social y Ambiental para la Bogotá del Siglo XXI",17,"Jóvenes con capacidades: Proyecto de vida para la ciudadanía, la innovación y el trabajo del siglo XXI","Propósito 1: Hacer un nuevo contrato social para incrementar la inclusión social, productiva y política"]
[null,"Un Nuevo Contrato Social y Ambiental para la Bogotá del Siglo XXI",18,"Cierre de brechas para la inclusión productiva urbano rural","Propósito 1: Hacer un nuevo contrato social para incrementar la inclusión social, productiva y política"]
[null,"Un Nuevo Contrato Social y Ambiental para la Bogotá del Siglo XXI",19,"Vivienda y entornos dignos en el territorio urbano y rural","Propósito 1: Hacer un nuevo contrato social para incrementar la inclusión social, productiva y política"]
[null,"Un Nuevo Contrato Social y Ambiental para la Bogotá del Siglo XXI",20,"Bogotá, referente en cultura, deporte, recreación y actividad física, con parques para el desarrollo y la salud","Propósito 1: Hacer un nuevo contrato social para incrementar la inclusión social, productiva y política"]
[null,"Un Nuevo Contrato Social y Ambiental para la Bogotá del Siglo XXI",21,"Creación y vida cotidiana: Apropiación ciudadana del arte, la cultura y el patrimonio, para la democracia cultural","Propósito 1: Hacer un nuevo contrato social para incrementar la inclusión social, productiva y política"]
[null,"Un Nuevo Contrato Social y Ambiental para la Bogotá del Siglo XXI",22,"Transformación cultural para la conciencia ambiental y el cuidado de la fauna doméstica","Propósito 1: Hacer un nuevo contrato social para incrementar la inclusión social, productiva y política"]
[null,"Un Nuevo Contrato Social y Ambiental para la Bogotá del Siglo XXI",23,"Bogotá rural","Propósito 1: Hacer un nuevo contrato social para incrementar la inclusión social, productiva y política"]
[null,"Un Nuevo Contrato Social y Ambiental para la Bogotá del Siglo XXI",24,"Bogotá región emprendedora e innovadora","Propósito 1: Hacer un nuevo contrato social para incrementar la inclusión social, productiva y política"]
[null,"Un Nuevo Contrato Social y Ambiental para la Bogotá del Siglo XXI",25,"Bogotá región productiva y competitiva","Propósito 1: Hacer un nuevo contrato social para incrementar la inclusión social, productiva y política"]
[null,"Un Nuevo Contrato Social y Ambiental para la Bogotá del Siglo XXI",26,"Bogotá - región, el mejor destino para visitar","Propósito 1: Hacer un nuevo contrato social para incrementar la inclusión social, productiva y política"]
[null,"Un Nuevo Contrato Social y Ambiental para la Bogotá del Siglo XXI",27,"Cambio cultural para la gestión de la crisis climática","Propósito 2 : Cambiar Nuestros Hábitos de Vida para Reverdecer a Bogotá y Adaptarnos y Mitigar la Crisis Climática"]
[null,"Un Nuevo Contrato Social y Ambiental para la Bogotá del Siglo XXI",{"$f":"+C29+1","v":28},"Bogotá protectora de sus recursos naturales","Propósito 2 : Cambiar Nuestros Hábitos de Vida para Reverdecer a Bogotá y Adaptarnos y Mitigar la Crisis Climática"]
[null,"Un Nuevo Contrato Social y Ambiental para la Bogotá del Siglo XXI",{"$f":"+C30+1","v":29},"Asentamientos y entornos protectores","Propósito 2 : Cambiar Nuestros Hábitos de Vida para Reverdecer a Bogotá y Adaptarnos y Mitigar la Crisis Climática"]
[null,"Un Nuevo Contrato Social y Ambiental para la Bogotá del Siglo XXI",30,"Eficiencia en la atención de emergencias","Propósito 2 : Cambiar Nuestros Hábitos de Vida para Reverdecer a Bogotá y Adaptarnos y Mitigar la Crisis Climática"]
[null,"Un Nuevo Contrato Social y Ambiental para la Bogotá del Siglo XXI",31," Protección y valoración del patrimonio tangible e intangible en Bogotá y la región","Propósito 2 : Cambiar Nuestros Hábitos de Vida para Reverdecer a Bogotá y Adaptarnos y Mitigar la Crisis Climática"]
[null,"Un Nuevo Contrato Social y Ambiental para la Bogotá del Siglo XXI",32,"Revitalización urbana para la competitividad","Propósito 2 : Cambiar Nuestros Hábitos de Vida para Reverdecer a Bogotá y Adaptarnos y Mitigar la Crisis Climática"]
[null,"Un Nuevo Contrato Social y Ambiental para la Bogotá del Siglo XXI",33,"Más árboles y más y mejor espacio público","Propósito 2 : Cambiar Nuestros Hábitos de Vida para Reverdecer a Bogotá y Adaptarnos y Mitigar la Crisis Climática"]
[null,"Un Nuevo Contrato Social y Ambiental para la Bogotá del Siglo XXI",34,"Bogotá protectora de los animales","Propósito 2 : Cambiar Nuestros Hábitos de Vida para Reverdecer a Bogotá y Adaptarnos y Mitigar la Crisis Climática"]
[null,"Un Nuevo Contrato Social y Ambiental para la Bogotá del Siglo XXI",35,"Manejo y prevención de contaminación","Propósito 2 : Cambiar Nuestros Hábitos de Vida para Reverdecer a Bogotá y Adaptarnos y Mitigar la Crisis Climática"]
[null,"Un Nuevo Contrato Social y Ambiental para la Bogotá del Siglo XXI",36,"Manejo y saneamiento de los cuerpos de agua","Propósito 2 : Cambiar Nuestros Hábitos de Vida para Reverdecer a Bogotá y Adaptarnos y Mitigar la Crisis Climática"]
[null,"Un Nuevo Contrato Social y Ambiental para la Bogotá del Siglo XXI",37,"Provisión y mejoramiento de servicios públicos","Propósito 2 : Cambiar Nuestros Hábitos de Vida para Reverdecer a Bogotá y Adaptarnos y Mitigar la Crisis Climática"]
[null,"Un Nuevo Contrato Social y Ambiental para la Bogotá del Siglo XXI",38,"Ecoeficiencia, reciclaje, manejo de residuos e inclusión de la población recicladora","Propósito 2 : Cambiar Nuestros Hábitos de Vida para Reverdecer a Bogotá y Adaptarnos y Mitigar la Crisis Climática"]
[null,"Un Nuevo Contrato Social y Ambiental para la Bogotá del Siglo XXI",39,"Bogotá territorio de paz y atención integral a las víctimas del conflicto armado","Propósito 3: Inspirar confianza y legitimidad para vivir sin miedo y ser epicentro de cultura ciudadana, paz y reconciliación"]
[null,"Un Nuevo Contrato Social y Ambiental para la Bogotá del Siglo XXI",{"$f":"+C41+1","v":40},"Más mujeres viven una vida libre de violencias, se sienten seguras y acceden con confianza al sistema de justicia","Propósito 3: Inspirar confianza y legitimidad para vivir sin miedo y ser epicentro de cultura ciudadana, paz y reconciliación"]
[null,"Un Nuevo Contrato Social y Ambiental para la Bogotá del Siglo XXI",{"$f":"+C42+1","v":41},"Sin machismo ni violencias contra las mujeres, las niñas y los niños","Propósito 3: Inspirar confianza y legitimidad para vivir sin miedo y ser epicentro de cultura ciudadana, paz y reconciliación"]
[null,"Un Nuevo Contrato Social y Ambiental para la Bogotá del Siglo XXI",42,"Conciencia y cultura ciudadana para la seguridad, la convivencia y la construcción de confianza","Propósito 3: Inspirar confianza y legitimidad para vivir sin miedo y ser epicentro de cultura ciudadana, paz y reconciliación"]
[null,"Un Nuevo Contrato Social y Ambiental para la Bogotá del Siglo XXI",43,"Cultura ciudadana para la confianza, la convivencia y la participación desde la vida cotidiana","Propósito 3: Inspirar confianza y legitimidad para vivir sin miedo y ser epicentro de cultura ciudadana, paz y reconciliación"]
[null,"Un Nuevo Contrato Social y Ambiental para la Bogotá del Siglo XXI",44,"Autoconciencia, respeto y cuidado en el espacio público","Propósito 3: Inspirar confianza y legitimidad para vivir sin miedo y ser epicentro de cultura ciudadana, paz y reconciliación"]
[null,"Un Nuevo Contrato Social y Ambiental para la Bogotá del Siglo XXI",45,"Espacio público más seguro y construido colectivamente","Propósito 3: Inspirar confianza y legitimidad para vivir sin miedo y ser epicentro de cultura ciudadana, paz y reconciliación"]
[null,"Un Nuevo Contrato Social y Ambiental para la Bogotá del Siglo XXI",46,"Atención a jóvenes y adultos infractores con impacto en su proyecto de vida","Propósito 3: Inspirar confianza y legitimidad para vivir sin miedo y ser epicentro de cultura ciudadana, paz y reconciliación"]
[null,"Un Nuevo Contrato Social y Ambiental para la Bogotá del Siglo XXI",47,"Calidad de Vida y Derechos de la Población privada de la libertad","Propósito 3: Inspirar confianza y legitimidad para vivir sin miedo y ser epicentro de cultura ciudadana, paz y reconciliación"]
[null,"Un Nuevo Contrato Social y Ambiental para la Bogotá del Siglo XXI",48,"Plataforma institucional para la seguridad y justicia","Propósito 3: Inspirar confianza y legitimidad para vivir sin miedo y ser epicentro de cultura ciudadana, paz y reconciliación"]
[null,"Un Nuevo Contrato Social y Ambiental para la Bogotá del Siglo XXI",49,"Movilidad segura, sostenible y accesible","Propósito 4: Hacer de Bogotá Región un modelo de movilidad multimodal, incluyente y sostenible"]
[null,"Un Nuevo Contrato Social y Ambiental para la Bogotá del Siglo XXI",{"$f":"+C51+1","v":50},"Red de metros","Propósito 4: Hacer de Bogotá Región un modelo de movilidad multimodal, incluyente y sostenible"]
[null,"Un Nuevo Contrato Social y Ambiental para la Bogotá del Siglo XXI",51,"Gobierno Abierto","Propósito 5: Construir Bogotá - Región con gobierno abierto, transparente y ciudadanía consciente"]
[null,"Un Nuevo Contrato Social y Ambiental para la Bogotá del Siglo XXI",{"$f":"+C53+1","v":52},"Integración regional, distrital y local","Propósito 5: Construir Bogotá - Región con gobierno abierto, transparente y ciudadanía consciente"]
[null,"Un Nuevo Contrato Social y Ambiental para la Bogotá del Siglo XXI",{"$f":"+C54+1","v":53},"Información para la toma de decisiones","Propósito 5: Construir Bogotá - Región con gobierno abierto, transparente y ciudadanía consciente"]
[null,"Un Nuevo Contrato Social y Ambiental para la Bogotá del Siglo XXI",54,"Transformación digital y gestión de TIC para un territorio inteligente","Propósito 5: Construir Bogotá - Región con gobierno abierto, transparente y ciudadanía consciente"]
[null,"Un Nuevo Contrato Social y Ambiental para la Bogotá del Siglo XXI",55,"Fortalecimiento de cultura ciudadana y su institucionalidad","Propósito 5: Construir Bogotá - Región con gobierno abierto, transparente y ciudadanía consciente"]
[null,"Un Nuevo Contrato Social y Ambiental para la Bogotá del Siglo XXI",56,"Gestión pública efectiva","Propósito 5: Construir Bogotá - Región con gobierno abierto, transparente y ciudadanía consciente"]
[null,"Un Nuevo Contrato Social y Ambiental para la Bogotá del Siglo XXI",57,"Gestión pública local","Propósito 5: Construir Bogotá - Región con gobierno abierto, transparente y ciudadanía consciente"]

{"sheet":"Tipo","index":4,"n_rows":67,"n_cols":5,"rows_kept":67,"cut":false,"hidden":true,"merged":[]}
[null,null,"Modalidad de Selección","afectacion","Naturaleza Jurídica"]
[1,null,"Concurso de méritos","Funcionamiento","Persona Natural"]
[2,null,"Contratación directa","Inversión","Persona Jurídica"]
[3,null,"Contratación mínima cuantia","Operación","Unión Temporal"]
[4,null,"Selección abreviada",null,"Consorcio"]
[5,null,"Licitación pública",null,"Sociedad con objeto único"]
[6,null,"Otros",null,"Persona jurídica extranjera"]
[7,null,"Régimen especial",null,"Sin ánimo de lucro"]
[8,null,null,null,"Cabildo indígena"]
[9,null,null,null,"Consejo comunitario de las comunidades negras"]
[10,null,"Selección abreviada",null,"Organizaciones de segundo nivel"]
[11,null,"Subasta inversa ",null,"Formas o expresiones organizativas, afrocolombianas, raizales y palenqueras"]
[12,null,"Bolsas de productos",null,"Organizaciones de base de comunidades negras "]
[13,null,"Acuerdo marco de precios ",null,"Asociaciones de autoridades tradicionales indígenas"]
[14,null,"Selección abreviada por menor cuantía "]
[15]
[16,null,"contratacion directa"]
[17,null,"Urgencia manifiesta"]
[18,null,"Contratación de empréstitos"]
[19,null,"Contratos interadministrativos"]
[20,null,"Contratación de bienes y servicios en el sector Defensa "]
[null,"SECTOR","Contratos para el desarrollo de actividades científicas y tecnológicas"]
[1,"Gestión Pública","Contratos de encargo fiduciario que celebren las entidades territoriales cuando inician el Acuerdo de Reestructuración de Pasivos"]
[{"$f":"+A23+1","v":2},"Gobierno","Cuando no exista pluralidad de oferentes en el mercado"]
[{"$f":"+A24+1","v":3},"Hacienda","Prestación de servicios profesionales y de apoyo a la gestión, o para la ejecución de trabajos artísticos que sólo puedan encomendarse a determinadas personas naturales"]
[4,"Planeación","El arrendamiento o adquisición de inmuebles"]
[5,"Desarrollo Económico, Industria y Turismo","Contratación de bienes y servicios de la Dirección Nacional de Inteligencia (DNI)"]
[6,"Educación"]
[7,"Salud"]
[8,"Integración Social","Decreto 92 de 2017"]
[9,"Cultura, Recreación y Deporte","No aplica"]
[10,"Ambiente"]
[11,"Movilidad","SECOP I"]
[12,"Hábitat","SECOP II"]
[13,"Mujeres"]
[14,"Seguridad, Convivencia y Justicia","Bogotá Mejor para Todos"]
[15,"Gestión Juridíca","Un Nuevo Contrato Social y Ambiental para la Bogotá del Siglo XXI"]
[16,"descentralizado territorialmente"]
[]
[null,"16 - AL","Estado"]
[null,null,"Celebrado o por iniciar"]
[null,"Plan de desarrollo distrital","En ejecución"]
[null,"Un nuevo contrato social y ambiental para la Bogotá del Siglo XXI","Terminado"]
[null,null,"Liquidado"]
[]
[null,"Tipo"]
[null,"Obra pública"]
[null,"Consultoría"]
[null,"Interventoría"]
[null,"Contratos de prestación de servicios"]
[null,"Contratos de prestación de servicios profesionales y de apoyo a la gestión"]
[null,"Compraventa de bienes muebles"]
[null,"Compraventa de bienes inmuebles"]
[null,"Arrendamiento de bienes muebles"]
[null,"Arrendamiento de bienes inmuebles"]
[null,"Seguro"]
[null,"Suministro"]
[null,"Empréstitos"]
[null,"Fiducia mercantil o encargo fiduciario"]
[null,"Concesión "]
[null,"Convenios de cooperacion"]
[null,"Convenios/Contratos interadministrativos"]
[null,"Convenios de apoyo o convenios de asociación "]
[null,"Convenios solidarios"]
[null,"Asociaciones Público Privadas"]
[null,"Otros"]
[null,"Otros gastos"]