{"text_format":"1","workbook":"xlsx","n_sheets":5,"sheets":["1. INFORMACION ACUMULADA","BOGDATA VS FORMATO ","BOGDATA ","Proposito_programa","Tipo"],"not_rendered":{"charts":0,"images":1,"macros":1,"external_links":0,"defined_names":14,"comments":0,"pivot_tables":0},"unopened":[],"bounds":{"document_bytes":16777216,"sheet_cells":100000,"rows_first":2000,"rows_last":500,"rows_between":2000,"halvings":0,"cell_chars":16384,"cell_head_chars":4096},"cells_cut":0,"cells_raw":0,"read":"whole","date_system":"1900"}

{"sheet":"1. INFORMACION ACUMULADA","index":0,"n_rows":432,"n_cols":40,"rows_kept":432,"cut":false,"hidden":false,"merged":[[11,2,11,3],[11,8,11,12],[11,15,11,20],[10,0,10,20],[8,34,8,35],[9,34,9,35],[10,28,10,33],[10,34,10,37],[10,21,10,27],[6,36,6,39],[7,36,7,39],[8,36,8,39],[9,36,9,39],[1,0,1,38],[2,0,2,38],[4,0,4,3],[4,8,4,10],[5,0,5,3],[5,8,5,10],[5,34,5,35],[5,36,5,39],[6,0,6,3],[6,8,6,10],[6,34,6,35],[7,34,7,35]]}
[]
["VEEDURIA DISTRITAL - INFORMACIÓN GESTION CONTRACTUAL"]
["DEL 1 DE ENERO AL 31 DE DICIEMBRE DE 2022"]
[]
["1. Entidad",null,null,null,"FONDO DE DESARROLLO LOCAL DE SANTE FDLSF",null,null,"2. Sector","Gestión Pública"]
["3. Presupuesto Disponible Inversión Directa PREDIS (BOGDATA)",null,null,null,36562415330,null,null,"5. Presupuesto Disponible Funcionamiento PREDIS (BOGDATA)",2205669571,null,null,null,null,null,null,null,null,null,null,null,null,null,null,null,null,null,null,null,null,null,null,null,null,null,"7. Nombre de quien diligencia el formato",null,"María Camila López Fernández"]
["4. Presupuesto Comprometido de Inversión Directa según PREDIS (BOGDATA)",null,null,null,36034301606,null,null,"6. Presupuesto Comprometido Funcionamiento según PREDIS (BOGDATA)",2123634614,null,null,null,null,null,null,null,null,null,null,null,null,null,null,null,null,null,null,null,null,null,null,null,null,null,"Cargo",null,"Contratista"]
[null,null,null,null,null,null,null,null,null,null,null,null,null,null,null,null,null,null,null,null,null,null,null,null,null,null,null,null,null,null,null,null,null,null,"Dependencia",null,"Contratación"]
[null,null,null,null,null,null,null,null,null,null,null,null,null,null,null,null,null,null,null,null,null,null,null,null,null,null,null,null,null,null,null,null,null,null,"Teléfono"]
[null,null,null,null,null,null,null,null,null,null,null,null,null,null,null,null,null,null,null,null,null,null,null,null,null,null,null,null,null,null,null,null,null,null,"Correo Electrónico",null,"camila.lopez@gobiernobogota.gov.co"]
["1- INFORMACION GENERAL",null,null,null,null,null,null,null,null,null,null,null,null,null,null,null,null,null,null,null,null,"2- INFORMACION FINANCIERA",null,null,null,null,null,null,"3 - PLAZOS ",null,null,null,null,null,"4. CESION",null,null,null,"5. ESTADO","6. %  Avance y/o cumplimiento"]
[1,2,3,null,4,5,6,7,8,null,null,null,null,9,10,11,null,null,null,null,null,12,13,14,15,16,17,18,19,20,21,22,23,24,25,26,27,28,29,30]
["Número Contrato","Año","Número de proceso contractual \nSECOP","Link proceso SECOP","Tipo de contrato ","Modalidad de Selección","Procedimiento o causal","Objeto","Afectación","Plan de Desarrollo Distrital","Número Programa","Equivalencia número de programa","Propósito","Número Proyecto","Número de proponentes","Número  de Identificación del contratista\n(Cédula o NIT sin puntos, comas ni caracteres especiales y sin digito de verificación)","Nombre del contratista\n  (según el caso: nombres y apellidos o Razón social y Tipo societario)","Naturaleza Jurídica","Número  de Identificación del integrante del Consorcio o U.T.\n(Cédula o NIT sin puntos, comas ni caracteres especiales y sin digito de verificación)","Nombre del Integrante del Consorcio o U.T. y Tipo societario\n (Según el caso: nombres y apellidos o razón social y tipo societario)","% Participación (indicar solo el numero del porcentaje, sin caracteres especiales)","Vigencias futuras","Valor Inicial del contrato","Valor total reducciones \n(En valor negativo)","Número de adiciones","Valor total de adiciones ","Valor Final ","Giros (Valor en pesos)","Fecha de suscripción (DD/MM/AAAA)","Fecha de inicio (DD/MM/AAAA)","Fecha de terminación (DD/MM/AAAA)","Plazo en días","Número de prórrogas","Prorroga en días","Número  de Identificación del cesionario\n(NIT sin digito de verificación)","Nombre cesionario","Fecha cesión\n(DD/MM/AAAA)","Valor cesión","Estado","% Avance y/o Cumplimiento"]
["FDLSF-CPS-001-2022",2022,"FDLSF-CD-017-2022","FDLSF-CPS-001-2022","Contratos de prestación de servicios profesionales y de apoyo a la gestión","Contratación directa","Prestación de servicios profesionales y de apoyo a la gestión, o para la ejecución de trabajos artísticos que sólo puedan encomendarse a determinadas personas naturales","PRESTAR SERVICIOS PROFESIONALES EN EL ÁREA DE GESTIÓN POLÍCIVA DE LA ALCALDÍA LOCAL DE SANTA FE EN LO REFERENTE A LAS ACTUACIONES Y REGISTROS DE LAS VISITAS REALIZADAS A LOS CERROS ORIENTALES, EN CUMPLIMENTO DE LA ACCIÓN POPULAR N° 25000232500020050066203 ","Inversión","Un nuevo contrato social y ambiental para la Bogotá del Siglo XXI",57,{"$f":"IF(ISERROR(VLOOKUP(K14,Proposito_programa!$C$2:$E$59,2,FALSE)),\" \",VLOOKUP(K14,Proposito_programa!$C$2:$E$59,2,FALSE))","v":"Gestión pública local"},{"$f":"IF(ISERROR(VLOOKUP(K14,Proposito_programa!$C$2:$E$59,3,FALSE)),\" \",VLOOKUP(K14,Proposito_programa!$C$2:$E$59,3,FALSE))","v":"Propósito 5: Construir Bogotá - Región con gobierno abierto, transparente y ciudadanía consciente"},2105,1,1000971218,"MATEO ANDRES FELIPE EMILIO DUQUE CALDERÓN ","Persona Natural",null,null,null,null,58850000,null,null,0,{"$f":"+W14+X14+Z14","v":58850000},54570000,"2022-01-24","2022-01-25","2023-01-24",11,1,30,null,null,null,null,"Terminado",{"$f":"IF(ISERROR(AB14/AA14),\"-\",(AB14/AA14))","v":0.92727272727272725}]
["FDLSF-CPS-002-2022",2022,"FDLSF-CD-036-2022","FDLSF-CPS-002-2022","Contratos de prestación de servicios profesionales y de apoyo a la gestión","Contratación directa","Prestación de servicios profesionales y de apoyo a la gestión, o para la ejecución de trabajos artísticos que sólo puedan encomendarse a determinadas personas naturales","PRESTAR LOS SERVICIOS DE APOYO EN LA DISTRIBUCIÓN DE CORRESPONDENCIA PRODUCIDA EN LAS DIFERENTES ÁREAS DE LA ALCALDÍA LOCAL DE SANTA FE","Inversión","Un nuevo contrato social y ambiental para la Bogotá del Siglo XXI",57,{"$f":"IF(ISERROR(VLOOKUP(K15,Proposito_programa!$C$2:$E$59,2,FALSE)),\" \",VLOOKUP(K15,Proposito_programa!$C$2:$E$59,2,FALSE))","v":"Gestión pública local"},{"$f":"IF(ISERROR(VLOOKUP(K15,Proposito_programa!$C$2:$E$59,3,FALSE)),\" \",VLOOKUP(K15,Proposito_programa!$C$2:$E$59,3,FALSE))","v":"Propósito 5: Construir Bogotá - Región con gobierno abierto, transparente y ciudadanía consciente"},2105,1,80242806,"ELKIN NICOLAS PEÑA VARGAS","Persona Natural",null,null,null,null,25850000,null,1,2350000,{"$f":"+W15+X15+Z15","v":28200000},24910000,"2022-01-12","2022-01-13","2023-01-23",11,1,30,null,null,null,null,"Terminado",{"$f":"IF(ISERROR(AB15/AA15),\"-\",(AB15/AA15))","v":0.8833333333333333}]
{"$rows_left_out":418}
{"sheet":"BOGDATA VS FORMATO ","index":1,"n_rows":128,"n_cols":6,"rows_kept":128,"cut":false,"hidden":false,"merged":[[0,0,0,5],[3,2,3,3],[3,4,3,5],[5,2,5,3],[5,4,5,5],[7,2,7,3],[7,4,7,5],[15,2,15,3],[15,4,15,5],[17,2,17,3],[17,4,17,5],[19,2,19,3],[19,4,19,5],[9,2,9,3],[9,4,9,5],[11,2,11,3],[11,4,11,5],[13,2,13,3],[13,4,13,5],[27,2,27,3],[27,4,27,5],[29,2,29,3],[29,4,29,5],[31,2,31,3],[31,4,31,5],[21,2,21,3],[21,4,21,5],[23,2,23,3],[23,4,23,5],[25,2,25,3],[25,4,25,5],[39,2,39,3],[39,4,39,5],[41,2,41,3],[41,4,41,5],[43,2,43,3],[43,4,43,5],[33,2,33,3],[33,4,33,5],[35,2,35,3],[35,4,35,5],[37,2,37,3],[37,4,37,5],[51,2,51,3],[51,4,51,5],[53,2,53,3],[53,4,53,5],[55,2,55,3],[55,4,55,5],[45,2,45,3],[45,4,45,5],[47,2,47,3],[47,4,47,5],[49,2,49,3],[49,4,49,5],[63,2,63,3],[63,4,63,5],[65,2,65,3],[65,4,65,5],[67,2,67,3],[67,4,67,5],[57,2,57,3],[57,4,57,5],[59,2,59,3],[59,4,59,5],[61,2,61,3],[61,4,61,5],[75,2,75,3],[75,4,75,5],[77,2,77,3],[77,4,77,5],[79,2,79,3],[79,4,79,5],[69,2,69,3],[69,4,69,5],[71,2,71,3],[71,4,71,5],[73,2,73,3],[73,4,73,5],[87,2,87,3],[87,4,87,5],[89,2,89,3],[89,4,89,5],[91,2,91,3],[91,4,91,5],[81,2,81,3],[81,4,81,5],[83,2,83,3],[83,4,83,5],[85,2,85,3],[85,4,85,5],[99,2,99,3],[99,4,99,5],[101,2,101,3],[101,4,101,5],[103,2,103,3],[103,4,103,5],[93,2,93,3],[93,4,93,5],[95,2,95,3],[95,4,95,5],[97,2,97,3],[97,4,97,5],[111,2,111,3],[111,4,111,5],[113,2,113,3],[113,4,113,5],[115,2,115,3],[115,4,115,5],[105,2,105,3],[105,4,105,5],[107,2,107,3],[107,4,107,5],[109,2,109,3],[109,4,109,5],[123,2,123,3],[123,4,123,5],[125,2,125,3],[125,4,125,5],[127,2,127,3],[127,4,127,5],[117,2,117,3],[117,4,117,5],[119,2,119,3],[119,4,119,5],[121,2,121,3],[121,4,121,5]]}
["BOGDATA- CUADRO ANALISIS - Santa Fé"]
[null,null,"COMPROMISOS ACUMULADOS BOGDATA","VALOR FINAL","ACUMULADO GIROS BOGDATA","GIROS"]
[null,"FUNCIONAMIENTO",2123634614,null,1736301757]
[null,"DIFERENCIAS",{"$f":"+C3-D3","v":2123634614},null,{"$f":"+E3-F3","v":1736301757}]
[null,"INVERSION (Comprometido)",36034301606,null,16515005677]
[null,"DIFERENCIAS",{"$f":"+C5-D5","v":36034301606},null,{"$f":"+E5-F5","v":16515005677}]
[null,"Un nuevo contrato social y ambiental para la Bogotá del Siglo XXI",36034301606,null,16515005677]
[null,"DIFERENCIAS",{"$f":"+C7-D7","v":36034301606},null,{"$f":"+E7-F7","v":16515005677}]
[null,"Propósito 1 - Hacer un nuevo contrato social con igualdad de oportunidades para la inclusión social, productiva y política.",17197723212,null,10739439746]
[null,"DIFERENCIAS",{"$f":"+C9-D9","v":17197723212},null,{"$f":"+E9-F9","v":10739439746}]
[null,"Programa 1 - Subsidios y transferencias para la equidad",6294000000,null,6151631720]
[null,"DIFERENCIAS",{"$f":"+C11-D11","v":6294000000},null,{"$f":"+E11-F11","v":6151631720}]
[null,"Proyecto 2081",6294000000,null,6151631720]
[null,"DIFERENCIAS",{"$f":"+C13-D13","v":6294000000},null,{"$f":"+E13-F13","v":6151631720}]
[null,"Programa 6 - Sistema Distrital del Cuidado",3559311709,null,1120202428]
{"$rows_left_out":114}
{"sheet":"BOGDATA ","index":2,"n_rows":187,"n_cols":20,"rows_kept":187,"cut":false,"hidden":false,"merged":[]}
["ENTIDAD","FECHA DE CORTE","CODIGO","NOMBRE","APROPIACION INICIAL","MODIFICACIONES MES","MODIFICACIONES ACUMULADAS","APROPIACION VIGENTE","SUSPENSION APROPIACION","APROPIACION DISPONIBLE","TOTAL COMPROMISOS MES","TOTAL COMPROMISOS ACUMULADO","% EJEC PRESUP","AMORTIZACION GIROS MES","AMORTIZACION GIROS ACUMULADOS","PORCENTAJE EJECUCION AUTORIZADO GIRO","AREA FUNCIONAL","NOMBRE AREA FUNCIONAL","SECTOR","NOMBRE SECTOR"]
[3,"2022-12-31","O2","GASTOS",57244756000,0,-2555075819,54689680181,0,54689680181,9164868448,53521189776,98,3299664572,27882178526,50.98,"0004-016","FDL-LOCALIDADES",16,"LOCALIDADES"]
[3,"2022-12-31","O21","Funcionamiento",2417686000,0,-212016429,2205669571,0,2205669571,94120788,2123634614,96,239645242,1736301757,78.72,"0004-016","FDL-LOCALIDADES",16,"LOCALIDADES"]
[3,"2022-12-31","O211","Gastos de personal",698715000,0,-9000000,689715000,0,689715000,-1200052,688299948,100,114716658,688299948,99.79,"0004-016","FDL-LOCALIDADES",16,"LOCALIDADES"]
[3,"2022-12-31","O21101","Planta de personal permanente",698715000,0,-9000000,689715000,0,689715000,-1200052,688299948,100,114716658,688299948,99.79,"0004-016","FDL-LOCALIDADES",16,"LOCALIDADES"]
[3,"2022-12-31","O2110103","Remuneraciones no constitutivas de factor salarial",698715000,0,-9000000,689715000,0,689715000,-1200052,688299948,100,114716658,688299948,99.79,"0004-016","FDL-LOCALIDADES",16,"LOCALIDADES"]
[3,"2022-12-31","O2110103007","Honorarios Ediles",698715000,0,-9000000,689715000,0,689715000,-1200052,688299948,100,114716658,688299948,99.79,"0004-016","FDL-LOCALIDADES",16,"LOCALIDADES"]
[3,"2022-12-31","O212","Adquisición de bienes y servicios",1207458000,0,9000000,1216458000,0,1216458000,95320840,1179749186,97,98917233,890975570,73.239999999999995,"0004-016","FDL-LOCALIDADES",16,"LOCALIDADES"]
[3,"2022-12-31","O21202","Adquisiciones diferentes de activos",1207458000,0,9000000,1216458000,0,1216458000,95320840,1179749186,97,98917233,890975570,73.239999999999995,"0004-016","FDL-LOCALIDADES",16,"LOCALIDADES"]
[3,"2022-12-31","O2120201","Materiales y suministros",72958000,0,17476978,90434978,0,90434978,20133918,86015596,95,4244678,16419944,18.16,"0004-016","FDL-LOCALIDADES",16,"LOCALIDADES"]
[3,"2022-12-31","O2120201003","Otros bienes transportables (excepto productos metálicos, maquinaria y equipo)",49458000,0,17476978,66934978,0,66934978,20133918,62536904,93,2544339,11261271,16.82,"0004-016","FDL-LOCALIDADES",16,"LOCALIDADES"]
[3,"2022-12-31","O212020100302","Pasta o pulpa, papel y productos de papel"]
[3,"2022-12-31","O2120201003023219999","Artículos n.c.p. de pulpa de papel o cartón",2000000,0,0,2000000,0,2000000,0,0,0,0,0,0,"0004-016","FDL-LOCALIDADES",16,"LOCALIDADES"]
[3,"2022-12-31","O212020100303","Productos de hornos de coque"]
[3,"2022-12-31","O2120201003033331101","Gasolina motor corriente",25000000,0,16676978,41676978,0,41676978,0,41676978,100,1818331,10535263,25.28,"0004-016","FDL-LOCALIDADES",16,"LOCALIDADES"]
{"$rows_left_out":173}
{"sheet":"Proposito_programa","index":3,"n_rows":59,"n_cols":5,"rows_kept":59,"cut":false,"hidden":false,"merged":[]}
[]
[null,"PDD","No. Programa","Programa","Propósito"]
["Acuerdo 761 2020","Un Nuevo Contrato Social y Ambiental para la Bogotá del Siglo XXI",1,"Subsidios y transferencias para la equidad","Propósito 1: Hacer un nuevo contrato social para incrementar la inclusión social, productiva y política"]
["Pag. 51","Un Nuevo Contrato Social y Ambiental para la Bogotá del Siglo XXI",{"$f":"+C3+1","v":2},"Igualdad de oportunidades y desarrollo de capacidades para las mujeres","Propósito 1: Hacer un nuevo contrato social para incrementar la inclusión social, productiva y política"]
[null,"Un Nuevo Contrato Social y Ambiental para la Bogotá del Siglo XXI",{"$f":"+C4+1","v":3},"Movilidad social integral","Propósito 1: Hacer un nuevo contrato social para incrementar la inclusión social, productiva y política"]
[null,"Un Nuevo Contrato Social y Ambiental para la Bogotá del Siglo XXI",4,"Prevención de la exclusión por razones étnicas, religiosas, sociales, políticas y de orientación sexual","Propósito 1: Hacer un nuevo contrato social para incrementar la inclusión social, productiva y política"]
[null,"Un Nuevo Contrato Social y Ambiental para la Bogotá del Siglo XXI",5,"Promoción de la igualdad, el desarrollo de capacidades y el reconocimiento de las mujeres","Propósito 1: Hacer un nuevo contrato social para incrementar la inclusión social, productiva y política"]
[null,"Un Nuevo Contrato Social y Ambiental para la Bogotá del Siglo XXI",6,"Sistema Distrital de Cuidado","Propósito 1: Hacer un nuevo contrato social para incrementar la inclusión social, productiva y política"]
[null,"Un Nuevo Contrato Social y Ambiental para la Bogotá del Siglo XXI",7,"Mejora de la gestión de instituciones de salud","Propósito 1: Hacer un nuevo contrato social para incrementar la inclusión social, productiva y política"]
[null,"Un Nuevo Contrato Social y Ambiental para la Bogotá del Siglo XXI",8,"Prevención y atención de maternidad temprana","Propósito 1: Hacer un nuevo contrato social para incrementar la inclusión social, productiva y política"]
[null,"Un Nuevo Contrato Social y Ambiental para la Bogotá del Siglo XXI",9,"Prevención y cambios para mejorar la salud de la población","Propósito 1: Hacer un nuevo contrato social para incrementar la inclusión social, productiva y política"]
[null,"Un Nuevo Contrato Social y Ambiental para la Bogotá del Siglo XXI",10,"Salud para la vida y el bienestar","Propósito 1: Hacer un nuevo contrato social para incrementar la inclusión social, productiva y política"]
[null,"Un Nuevo Contrato Social y Ambiental para la Bogotá del Siglo XXI",11,"Salud y bienestar para niñas y niños","Propósito 1: Hacer un nuevo contrato social para incrementar la inclusión social, productiva y política"]
[null,"Un Nuevo Contrato Social y Ambiental para la Bogotá del Siglo XXI",12,"Educación inicial: Bases sólidas para la vida.","Propósito 1: Hacer un nuevo contrato social para incrementar la inclusión social, productiva y política"]
[null,"Un Nuevo Contrato Social y Ambiental para la Bogotá del Siglo XXI",13,"Educación para todos y todas: acceso y permanencia con equidad y énfasis en educación rural","Propósito 1: Hacer un nuevo contrato social para incrementar la inclusión social, productiva y política"]
{"$rows_left_out":45}
{"sheet":"Tipo","index":4,"n_rows":67,"n_cols":5,"rows_kept":67,"cut":false,"hidden":true,"merged":[]}
[null,null,"Modalidad de Selección","afectacion","Naturaleza Jurídica"]
[1,null,"Concurso de méritos","Funcionamiento","Persona Natural"]
[2,null,"Contratación directa","Inversión","Persona Jurídica"]
[3,null,"Contratación mínima cuantia","Operación","Unión Temporal"]
[4,null,"Selección abreviada",null,"Consorcio"]
[5,null,"Licitación pública",null,"Sociedad con objeto único"]
[6,null,"Otros",null,"Persona jurídica extranjera"]
[7,null,"Régimen especial",null,"Sin ánimo de lucro"]
[8,null,null,null,"Cabildo indígena"]
[9,null,null,null,"Consejo comunitario de las comunidades negras"]
[10,null,"Selección abreviada",null,"Organizaciones de segundo nivel"]
[11,null,"Subasta inversa ",null,"Formas o expresiones organizativas, afrocolombianas, raizales y palenqueras"]
[12,null,"Bolsas de productos",null,"Organizaciones de base de comunidades negras "]
[13,null,"Acuerdo marco de precios ",null,"Asociaciones de autoridades tradicionales indígenas"]
[14,null,"Selección abreviada por menor cuantía "]
{"$rows_left_out":52}