{"text_format":"1","workbook":"xlsx","n_sheets":5,"sheets":["1. INFORMACION ACUMULADA","BOGDATA VS FORMATO ","BOGDATA ","Proposito_programa","Tipo"],"not_rendered":{"charts":0,"images":1,"macros":1,"external_links":0,"defined_names":14,"comments":0,"pivot_tables":0},"unopened":[],"bounds":{"document_bytes":16777216,"sheet_cells":100000,"rows_first":2000,"rows_last":500,"rows_between":2000,"halvings":0,"cell_chars":16384,"cell_head_chars":4096},"cells_cut":0,"cells_raw":0,"read":"whole","date_system":"1900"}

{"sheet":"1. INFORMACION ACUMULADA","index":0,"n_rows":432,"n_cols":40,"rows_kept":432,"cut":false,"hidden":false,"merged":[[11,2,11,3],[11,8,11,12],[11,15,11,20],[10,0,10,20],[8,34,8,35],[9,34,9,35],[10,28,10,33],[10,34,10,37],[10,21,10,27],[6,36,6,39],[7,36,7,39],[8,36,8,39],[9,36,9,39],[1,0,1,38],[2,0,2,38],[4,0,4,3],[4,8,4,10],[5,0,5,3],[5,8,5,10],[5,34,5,35],[5,36,5,39],[6,0,6,3],[6,8,6,10],[6,34,6,35],[7,34,7,35]]}
[]
["VEEDURIA DISTRITAL - INFORMACIÓN GESTION CONTRACTUAL"]
["DEL 1 DE ENERO AL 31 DE DICIEMBRE DE 2022"]
[]
["1. Entidad",null,null,null,"FONDO DE DESARROLLO LOCAL DE SANTE FDLSF",null,null,"2. Sector","Gestión Pública"]
["3. Presupuesto Disponible Inversión Directa PREDIS (BOGDATA)",null,null,null,36562415330,null,null,"5. Presupuesto Disponible Funcionamiento PREDIS (BOGDATA)",2205669571,null,null,null,null,null,null,null,null,null,null,null,null,null,null,null,null,null,null,null,null,null,null,null,null,null,"7. Nombre de quien diligencia el formato",null,"María Camila López Fernández"]
["4. Presupuesto Comprometido de Inversión Directa según PREDIS (BOGDATA)",null,null,null,36034301606,null,null,"6. Presupuesto Comprometido Funcionamiento según PREDIS (BOGDATA)",2123634614,null,null,null,null,null,null,null,null,null,null,null,null,null,null,null,null,null,null,null,null,null,null,null,null,null,"Cargo",null,"Contratista"]
[null,null,null,null,null,null,null,null,null,null,null,null,null,null,null,null,null,null,null,null,null,null,null,null,null,null,null,null,null,null,null,null,null,null,"Dependencia",null,"Contratación"]
[null,null,null,null,null,null,null,null,null,null,null,null,null,null,null,null,null,null,null,null,null,null,null,null,null,null,null,null,null,null,null,null,null,null,"Teléfono"]
[null,null,null,null,null,null,null,null,null,null,null,null,null,null,null,null,null,null,null,null,null,null,null,null,null,null,null,null,null,null,null,null,null,null,"Correo Electrónico",null,"camila.lopez@gobiernobogota.gov.co"]
["1- INFORMACION GENERAL",null,null,null,null,null,null,null,null,null,null,null,null,null,null,null,null,null,null,null,null,"2- INFORMACION FINANCIERA",null,null,null,null,null,null,"3 - PLAZOS ",null,null,null,null,null,"4. CESION",null,null,null,"5. ESTADO","6. %  Avance y/o cumplimiento"]
[1,2,3,null,4,5,6,7,8,null,null,null,null,9,10,11,null,null,null,null,null,12,13,14,15,16,17,18,19,20,21,22,23,24,25,26,27,28,29,30]
["Número Contrato","Año","Número de proceso contractual \nSECOP","Link proceso SECOP","Tipo de contrato ","Modalidad de Selección","Procedimiento o causal","Objeto","Afectación","Plan de Desarrollo Distrital","Número Programa","Equivalencia número de programa","Propósito","Número Proyecto","Número de proponentes","Número  de Identificación del contratista\n(Cédula o NIT sin puntos, comas ni caracteres especiales y sin digito de verificación)","Nombre del contratista\n  (según el caso: nombres y apellidos o Razón social y Tipo societario)","Naturaleza Jurídica","Número  de Identificación del integrante del Consorcio o U.T.\n(Cédula o NIT sin puntos, comas ni caracteres especiales y sin digito de verificación)","Nombre del Integrante del Consorcio o U.T. y Tipo societario\n (Según el caso: nombres y apellidos o razón social y tipo societario)","% Participación (indicar solo el numero del porcentaje, sin caracteres especiales)","Vigencias futuras","Valor Inicial del contrato","Valor total reducciones \n(En valor negativo)","Número de adiciones","Valor total de adiciones ","Valor Final ","Giros (Valor en pesos)","Fecha de suscripción (DD/MM/AAAA)","Fecha de inicio (DD/MM/AAAA)","Fecha de terminación (DD/MM/AAAA)","Plazo en días","Número de prórrogas","Prorroga en días","Número  de Identificación del cesionario\n(NIT sin digito de verificación)","Nombre cesionario","Fecha cesión\n(DD/MM/AAAA)","Valor cesión","Estado","% Avance y/o Cumplimiento"]
["FDLSF-CPS-001-2022",2022,"FDLSF-CD-017-2022","FDLSF-CPS-001-2022","Contratos de prestación de servicios profesionales y de apoyo a la gestión","Contratación directa","Prestación de servicios profesionales y de apoyo a la gestión, o para la ejecución de trabajos artísticos que sólo puedan encomendarse a determinadas personas naturales","PRESTAR SERVICIOS PROFESIONALES EN EL ÁREA DE GESTIÓN POLÍCIVA DE LA ALCALDÍA LOCAL DE SANTA FE EN LO REFERENTE A LAS ACTUACIONES Y REGISTROS DE LAS VISITAS REALIZADAS A LOS CERROS ORIENTALES, EN CUMPLIMENTO DE LA ACCIÓN POPULAR N° 25000232500020050066203 ","Inversión","Un nuevo contrato social y ambiental para la Bogotá del Siglo XXI",57,{"$f":"IF(ISERROR(VLOOKUP(K14,Proposito_programa!$C$2:$E$59,2,FALSE)),\" \",VLOOKUP(K14,Proposito_programa!$C$2:$E$59,2,FALSE))","v":"Gestión pública local"},{"$f":"IF(ISERROR(VLOOKUP(K14,Proposito_programa!$C$2:$E$59,3,FALSE)),\" \",VLOOKUP(K14,Proposito_programa!$C$2:$E$59,3,FALSE))","v":"Propósito 5: Construir Bogotá - Región con gobierno abierto, transparente y ciudadanía consciente"},2105,1,1000971218,"MATEO ANDRES FELIPE EMILIO DUQUE CALDERÓN ","Persona Natural",null,null,null,null,58850000,null,null,0,{"$f":"+W14+X14+Z14","v":58850000},54570000,"2022-01-24","2022-01-25","2023-01-24",11,1,30,null,null,null,null,"Terminado",{"$f":"IF(ISERROR(AB14/AA14),\"-\",(AB14/AA14))","v":0.92727272727272725}]
["FDLSF-CPS-002-2022",2022,"FDLSF-CD-036-2022","FDLSF-CPS-002-2022","Contratos de prestación de servicios profesionales y de apoyo a la gestión","Contratación directa","Prestación de servicios profesionales y de apoyo a la gestión, o para la ejecución de trabajos artísticos que sólo puedan encomendarse a determinadas personas naturales","PRESTAR LOS SERVICIOS DE APOYO EN LA DISTRIBUCIÓN DE CORRESPONDENCIA PRODUCIDA EN LAS DIFERENTES ÁREAS DE LA ALCALDÍA LOCAL DE SANTA FE","Inversión","Un nuevo contrato social y ambiental para la Bogotá del Siglo XXI",57,{"$f":"IF(ISERROR(VLOOKUP(K15,Proposito_programa!$C$2:$E$59,2,FALSE)),\" \",VLOOKUP(K15,Proposito_programa!$C$2:$E$59,2,FALSE))","v":"Gestión pública local"},{"$f":"IF(ISERROR(VLOOKUP(K15,Proposito_programa!$C$2:$E$59,3,FALSE)),\" \",VLOOKUP(K15,Proposito_programa!$C$2:$E$59,3,FALSE))","v":"Propósito 5: Construir Bogotá - Región con gobierno abierto, transparente y ciudadanía consciente"},2105,1,80242806,"ELKIN NICOLAS PEÑA VARGAS","Persona Natural",null,null,null,null,25850000,null,1,2350000,{"$f":"+W15+X15+Z15","v":28200000},24910000,"2022-01-12","2022-01-13","2023-01-23",11,1,30,null,null,null,null,"Terminado",{"$f":"IF(ISERROR(AB15/AA15),\"-\",(AB15/AA15))","v":0.8833333333333333}]
["FDLSF-CPS-003-2022",2022,"FDLSF-CD-035-2021","FDLSF-CPS-003-2022","Contratos de prestación de servicios profesionales y de apoyo a la gestión","Contratación directa","Prestación de servicios profesionales y de apoyo a la gestión, o para la ejecución de trabajos artísticos que sólo puedan encomendarse a determinadas personas naturales","PRESTAR LOS SERVICIOS PROFESIONALES ESPECIALIZADOS AL DESPACHO DE LA ALCALDÍA LOCAL DE SANTA FE EN LOS TEMAS RELACIONADOS CON LA GESTIÓN ADMINISTRATIVA Y FINANCIERA","Inversión","Un nuevo contrato social y ambiental para la Bogotá del Siglo XXI",57,{"$f":"IF(ISERROR(VLOOKUP(K16,Proposito_programa!$C$2:$E$59,2,FALSE)),\" \",VLOOKUP(K16,Proposito_programa!$C$2:$E$59,2,FALSE))","v":"Gestión pública local"},{"$f":"IF(ISERROR(VLOOKUP(K16,Proposito_programa!$C$2:$E$59,3,FALSE)),\" \",VLOOKUP(K16,Proposito_programa!$C$2:$E$59,3,FALSE))","v":"Propósito 5: Construir Bogotá - Región con gobierno abierto, transparente y ciudadanía consciente"},2105,1,16934608,"WILLIAM IVAN MEJIA TORRES","Persona Natural",null,null,null,null,100100000,null,null,0,100100000,97066667,"2022-01-11","2022-01-11","2022-12-10",11,0,0,null,null,null,null,"Terminado",0.969696973026973]
["FDLSF-CPS-004-2022",2022,"FDLSF-CD-051-2022","FDLSF-CPS-004-2022","Contratos de prestación de servicios profesionales y de apoyo a la gestión","Contratación directa","Prestación de servicios profesionales y de apoyo a la gestión, o para la ejecución de trabajos artísticos que sólo puedan encomendarse a determinadas personas naturales","PRESTAR SERVICIOS PROFESIONALES ESPECIALIZADOS PARA ORIENTAR, REVISAR Y CONCEPTUALIZAR SOBRE LOS ASUNTOS JURÍDICOS QUE SEAN ASIGNADOS AL DESPACHO DEL ALCALDE LOCAL","Inversión","Un nuevo contrato social y ambiental para la Bogotá del Siglo XXI",57,{"$f":"IF(ISERROR(VLOOKUP(K17,Proposito_programa!$C$2:$E$59,2,FALSE)),\" \",VLOOKUP(K17,Proposito_programa!$C$2:$E$59,2,FALSE))","v":"Gestión pública local"},{"$f":"IF(ISERROR(VLOOKUP(K17,Proposito_programa!$C$2:$E$59,3,FALSE)),\" \",VLOOKUP(K17,Proposito_programa!$C$2:$E$59,3,FALSE))","v":"Propósito 5: Construir Bogotá - Región con gobierno abierto, transparente y ciudadanía consciente"},2105,1,1112905112,"JUAN GABRIEL MARIN RAMIREZ","Persona Natural",null,null,null,null,83160000,null,1,7560000,90720000,80640000,"2022-01-11","2022-01-11","2023-01-10",11,1,30,null,null,null,null,"Terminado",0.88888888888888884]
["FDLSF-CPS-005-2022",2022,"FDLSF-CD-050-2022","FDLSF-CPS-005-2022","Contratos de prestación de servicios profesionales y de apoyo a la gestión","Contratación directa","Prestación de servicios profesionales y de apoyo a la gestión, o para la ejecución de trabajos artísticos que sólo puedan encomendarse a determinadas personas naturales","PRESTAR SERVICIOS PROFESIONALES ESPECIALIZADOS, PARA LA ARTICULACIÓN JURÍDICA EN EL SEGUIMIENTO DE LOS TEMAS RELACIONADOS CON LA ACTIVIDAD CONTRACTUAL DEL FONDO DE DESARROLLO LOCAL EN LAS ETAPAS PRECONTRACUAL, CONTRACTUAL Y POSTCONTRACTUAL DEL FDLSF.","Inversión","Un nuevo contrato social y ambiental para la Bogotá del Siglo XXI",57,{"$f":"IF(ISERROR(VLOOKUP(K18,Proposito_programa!$C$2:$E$59,2,FALSE)),\" \",VLOOKUP(K18,Proposito_programa!$C$2:$E$59,2,FALSE))","v":"Gestión pública local"},{"$f":"IF(ISERROR(VLOOKUP(K18,Proposito_programa!$C$2:$E$59,3,FALSE)),\" \",VLOOKUP(K18,Proposito_programa!$C$2:$E$59,3,FALSE))","v":"Propósito 5: Construir Bogotá - Región con gobierno abierto, transparente y ciudadanía consciente"},2105,1,1010192128,"LUISA FERNANDA PEREZ BLANCO","Persona Natural",null,null,null,null,83160000,null,null,0,83160000,78876000,"2022-01-11","2022-01-12","2022-12-17",11,0,0,null,null,null,null,"Terminado",0.94848484848484849]
["FDLSF-CPS-006-2022",2022,"FDLSF-CD-007-2022","FDLSF-CPS-006-2022","Contratos de prestación de servicios profesionales y de apoyo a la gestión","Contratación directa","Prestación de servicios profesionales y de apoyo a la gestión, o para la ejecución de trabajos artísticos que sólo puedan encomendarse a determinadas personas naturales","PRESTAR SUS SERVICIOS DE APOYO TECNICO EN LA EJECUCIÓN DE ACTIVIDADES ADMINISTRATIVAS RELACIONADAS CON LOS PROCESOS CONTRACTUALES DEL ÁREA DE GESTIÓN DE DESARROLLO LOCAL DE SANTA FE","Inversión","Un nuevo contrato social y ambiental para la Bogotá del Siglo XXI",57,{"$f":"IF(ISERROR(VLOOKUP(K19,Proposito_programa!$C$2:$E$59,2,FALSE)),\" \",VLOOKUP(K19,Proposito_programa!$C$2:$E$59,2,FALSE))","v":"Gestión pública local"},{"$f":"IF(ISERROR(VLOOKUP(K19,Proposito_programa!$C$2:$E$59,3,FALSE)),\" \",VLOOKUP(K19,Proposito_programa!$C$2:$E$59,3,FALSE))","v":"Propósito 5: Construir Bogotá - Región con gobierno abierto, transparente y ciudadanía consciente"},2105,1,79056018,"JESUS ANTONIO ANGEL TORRES","Persona Natural",null,null,null,null,40260000,null,1,2318000,42578000,38918000,"2022-01-11","2022-01-12","2022-12-31",11,0,20,null,null,null,null,"Terminado",0.91404011461318047]
["FDLSF-CPS-007-2022",2022,"FDLSF-CD-004-2022","FDLSF-CPS-007-2022","Contratos de prestación de servicios profesionales y de apoyo a la gestión","Contratación directa","Prestación de servicios profesionales y de apoyo a la gestión, o para la ejecución de trabajos artísticos que sólo puedan encomendarse a determinadas personas naturales","PRESTAR SERVICIOS PROFESIONALES AL ÁREA DE GESTIÓN DEL DESARROLLO LOCAL EN LO ATINENTE A LAS ETAPAS PRECONTRACTUALES, CONTRACTUALES Y POSTCONTRACTUALES, EN EL MARCO DE LOS PLANES, PROGRAMAS Y PROYECTOS ENCAMINADOS A LA ADQUISICIÓN DE BIENES Y SERVICIOS PARA EL FORTALECIMIENTO DE LA GESTIÓN LOCAL","Inversión","Un nuevo contrato social y ambiental para la Bogotá del Siglo XXI",57,{"$f":"IF(ISERROR(VLOOKUP(K20,Proposito_programa!$C$2:$E$59,2,FALSE)),\" \",VLOOKUP(K20,Proposito_programa!$C$2:$E$59,2,FALSE))","v":"Gestión pública local"},{"$f":"IF(ISERROR(VLOOKUP(K20,Proposito_programa!$C$2:$E$59,3,FALSE)),\" \",VLOOKUP(K20,Proposito_programa!$C$2:$E$59,3,FALSE))","v":"Propósito 5: Construir Bogotá - Región con gobierno abierto, transparente y ciudadanía consciente"},2105,1,5820325,"GUSTAVO PINTO RUBIO","Persona Natural",null,null,null,null,71720000,null,null,0,71720000,69329333,"2022-01-12","2022-01-12","2022-12-11",11,0,0,null,null,null,null,"Terminado",0.96666666201896267]
["FDLSF-CPS-008-2022",2022,"FDLSF-CD-004-2022","FDLSF-CPS-008-2022","Contratos de prestación de servicios profesionales y de apoyo a la gestión","Contratación directa","Prestación de servicios profesionales y de apoyo a la gestión, o para la ejecución de trabajos artísticos que sólo puedan encomendarse a determinadas personas naturales","PRESTAR SERVICIOS PROFESIONALES AL ÁREA DE GESTIÓN DEL DESARROLLO LOCAL EN LO ATINENTE A LAS ETAPAS PRECONTRACTUALES, CONTRACTUALES Y POSTCONTRACTUALES, EN EL MARCO DE LOS PLANES, PROGRAMAS Y PROYECTOS ENCAMINADOS A LA ADQUISICIÓN DE BIENES Y SERVICIOS PARA EL FORTALECIMIENTO DE LA GESTIÓN LOCAL","Inversión","Un nuevo contrato social y ambiental para la Bogotá del Siglo XXI",57,{"$f":"IF(ISERROR(VLOOKUP(K21,Proposito_programa!$C$2:$E$59,2,FALSE)),\" \",VLOOKUP(K21,Proposito_programa!$C$2:$E$59,2,FALSE))","v":"Gestión pública local"},{"$f":"IF(ISERROR(VLOOKUP(K21,Proposito_programa!$C$2:$E$59,3,FALSE)),\" \",VLOOKUP(K21,Proposito_programa!$C$2:$E$59,3,FALSE))","v":"Propósito 5: Construir Bogotá - Región con gobierno abierto, transparente y ciudadanía consciente"},2105,1,1014180831,"ADRIANA KATHERINE GUTIERREZ TORRES","Persona Natural",null,null,null,null,71720000,-30426667,null,0,41293333,41293333,"2022-01-12","2022-01-12","2022-12-11",11,0,0,null,null,null,null,"Terminado",1]
["FDLSF-CPS-009-2022",2022,"FDLSF-CD-004-2022","FDLSF-CPS-009-2022","Contratos de prestación de servicios profesionales y de apoyo a la gestión","Contratación directa","Prestación de servicios profesionales y de apoyo a la gestión, o para la ejecución de trabajos artísticos que sólo puedan encomendarse a determinadas personas naturales","PRESTAR SERVICIOS PROFESIONALES AL ÁREA DE GESTIÓN DEL DESARROLLO LOCAL EN LO ATINENTE A LAS ETAPAS PRECONTRACTUALES, CONTRACTUALES Y POSTCONTRACTUALES, EN EL MARCO DE LOS PLANES, PROGRAMAS Y PROYECTOS ENCAMINADOS A LA ADQUISICIÓN DE BIENES Y SERVICIOS PARA EL FORTALECIMIENTO DE LA GESTIÓN LOCAL","Inversión","Un nuevo contrato social y ambiental para la Bogotá del Siglo XXI",57,{"$f":"IF(ISERROR(VLOOKUP(K22,Proposito_programa!$C$2:$E$59,2,FALSE)),\" \",VLOOKUP(K22,Proposito_programa!$C$2:$E$59,2,FALSE))","v":"Gestión pública local"},{"$f":"IF(ISERROR(VLOOKUP(K22,Proposito_programa!$C$2:$E$59,3,FALSE)),\" \",VLOOKUP(K22,Proposito_programa!$C$2:$E$59,3,FALSE))","v":"Propósito 5: Construir Bogotá - Región con gobierno abierto, transparente y ciudadanía consciente"},2105,1,1018406237,"HELDER GERMAN PARDO BUITRAGO","Persona Natural",null,null,null,null,71720000,null,1,6302667,78022667,69111999,"2022-01-12","2022-01-12","2023-01-11",11,1,30,1018406237,"HELDER GERMAN PARDO BUITRAGO","2022-08-01",null,"Terminado",0.88579385526516285]
["FDLSF-CPS-010-2022",2022,"FDLSF-CD-037-2022","FDLSF-CPS-010-2022","Contratos de prestación de servicios profesionales y de apoyo a la gestión","Contratación directa","Prestación de servicios profesionales y de apoyo a la gestión, o para la ejecución de trabajos artísticos que sólo puedan encomendarse a determinadas personas naturales","PRESTAR SUS SERVICIOS PROFESIONALES AL ÁREA DE GESTIÓN DEL DESARROLLO LOCAL DE LA ALCALDÍA LOCAL DE SANTA FE EN LOS TRÁMITES, PROCEDIMIENTOS Y APLICATIVOS RELACIONADOS CON EL MANUAL DE POLITICAS DE OPERACIÒN CONTABLE","Inversión","Un nuevo contrato social y ambiental para la Bogotá del Siglo XXI",57,{"$f":"IF(ISERROR(VLOOKUP(K23,Proposito_programa!$C$2:$E$59,2,FALSE)),\" \",VLOOKUP(K23,Proposito_programa!$C$2:$E$59,2,FALSE))","v":"Gestión pública local"},{"$f":"IF(ISERROR(VLOOKUP(K23,Proposito_programa!$C$2:$E$59,3,FALSE)),\" \",VLOOKUP(K23,Proposito_programa!$C$2:$E$59,3,FALSE))","v":"Propósito 5: Construir Bogotá - Región con gobierno abierto, transparente y ciudadanía consciente"},2105,1,52581670,"CLAUDIA PATRICIA GOMEZ GUTIERREZ","Persona Natural",null,null,null,null,67100000,null,1,9556667,76656667,64456667,"2022-01-12","2022-01-14","2023-01-31",11,1,30,null,null,null,null,"Terminado",0.84084880705809972]
["FDLSF-CPS-011-2022",2022,"FDLSF-CD-008-2022","FDLSF-CPS-011-2022","Contratos de prestación de servicios profesionales y de apoyo a la gestión","Contratación directa","Prestación de servicios profesionales y de apoyo a la gestión, o para la ejecución de trabajos artísticos que sólo puedan encomendarse a determinadas personas naturales","PRESTAR SERVICIOS PROFESIONALES AL ÁREA DE GESTIÓN DEL DESARROLLO LOCAL EN LO ATINENTE A LAS ETAPAS PRECONTRACTUALES, CONTRACTUALES Y POSTCONTRACTUALES, EN EL MARCO DE LOS PLANES, PROGRAMAS Y PROYECTOS ENCAMINADOS A LA ADQUISICIÓN DE BIENES Y SERVICIOS PARA EL FORTALECIMIENTO DE LA GESTIÓN LOCAL","Inversión","Un nuevo contrato social y ambiental para la Bogotá del Siglo XXI",57,{"$f":"IF(ISERROR(VLOOKUP(K24,Proposito_programa!$C$2:$E$59,2,FALSE)),\" \",VLOOKUP(K24,Proposito_programa!$C$2:$E$59,2,FALSE))","v":"Gestión pública local"},{"$f":"IF(ISERROR(VLOOKUP(K24,Proposito_programa!$C$2:$E$59,3,FALSE)),\" \",VLOOKUP(K24,Proposito_programa!$C$2:$E$59,3,FALSE))","v":"Propósito 5: Construir Bogotá - Región con gobierno abierto, transparente y ciudadanía consciente"},2105,1,53119341,"MARIA CAMILA LOPEZ FERNANDEZ","Persona Natural",null,null,null,null,67100000,null,1,6100000,73200000,64863333,"2022-01-12","2022-01-12","2023-01-11",11,1,30,null,null,null,null,"Terminado",0.88611110655737702]
["FDLSF-CPS-012-2022",2022,"FDLSF-CD-052-2022","FDLSF-CPS-012-2022","Contratos de prestación de servicios profesionales y de apoyo a la gestión","Contratación directa","Prestación de servicios profesionales y de apoyo a la gestión, o para la ejecución de trabajos artísticos que sólo puedan encomendarse a determinadas personas naturales","PRESTACIÓN DE SERVICIOS PROFESIONALES ESPECIALIZADOS EN EL SEGUIMIENTO Y VERIFICACIÓN EN LA FORMULACIÓN, EVALUACIÓN Y CONTROL DE LOS PROYECTOS DE INVERSIÓN QUE COMPONEN EL PLAN DE DESARROLLO LOCAL DE SANTA FE.","Inversión","Un nuevo contrato social y ambiental para la Bogotá del Siglo XXI",57,{"$f":"IF(ISERROR(VLOOKUP(K25,Proposito_programa!$C$2:$E$59,2,FALSE)),\" \",VLOOKUP(K25,Proposito_programa!$C$2:$E$59,2,FALSE))","v":"Gestión pública local"},{"$f":"IF(ISERROR(VLOOKUP(K25,Proposito_programa!$C$2:$E$59,3,FALSE)),\" \",VLOOKUP(K25,Proposito_programa!$C$2:$E$59,3,FALSE))","v":"Propósito 5: Construir Bogotá - Región con gobierno abierto, transparente y ciudadanía consciente"},2105,1,79765033,"DAIRO JEZZID LEON ROMERO","Persona Natural",null,null,null,null,83160000,null,1,7560000,90720000,80136000,"2022-01-12","2022-01-13","2023-01-12",11,1,30,null,null,null,null,"Terminado",0.8833333333333333]
["FDLSF-CPS-013-2022",2022,"FDLSF-CD-008-2022","FDLSF-CPS-013-2022","Contratos de prestación de servicios profesionales y de apoyo a la gestión","Contratación directa","Prestación de servicios profesionales y de apoyo a la gestión, o para la ejecución de trabajos artísticos que sólo puedan encomendarse a determinadas personas naturales","PRESTAR SERVICIOS PROFESIONALES AL ÁREA DE GESTIÓN DEL DESARROLLO LOCAL EN LO ATINENTE A LAS ETAPAS PRECONTRACTUALES, CONTRACTUALES Y POSTCONTRACTUALES, EN EL MARCO DE LOS PLANES, PROGRAMAS Y PROYECTOS ENCAMINADOS A LA ADQUISICIÓN DE BIENES Y SERVICIOS PARA EL FORTALECIMIENTO DE LA GESTIÓN LOCAL","Inversión","Un nuevo contrato social y ambiental para la Bogotá del Siglo XXI",57,{"$f":"IF(ISERROR(VLOOKUP(K26,Proposito_programa!$C$2:$E$59,2,FALSE)),\" \",VLOOKUP(K26,Proposito_programa!$C$2:$E$59,2,FALSE))","v":"Gestión pública local"},{"$f":"IF(ISERROR(VLOOKUP(K26,Proposito_programa!$C$2:$E$59,3,FALSE)),\" \",VLOOKUP(K26,Proposito_programa!$C$2:$E$59,3,FALSE))","v":"Propósito 5: Construir Bogotá - Región con gobierno abierto, transparente y ciudadanía consciente"},2105,1,1019073568,"KAROL JOHANA TALERO SALAMANCA","Persona Natural",null,null,null,null,67100000,null,1,5083333,72183333,62830000,"2022-01-13","2022-01-13","2023-01-18",11,1,30,1019073568,"KAROL JOHANA TALERO SALAMANCA","2022-10-01",null,"Terminado",0.87042253923076673]
["FDLSF-CPS-014-2022",2022,"FDLSF-CD-004-2022","FDLSF-CPS-014-2022","Contratos de prestación de servicios profesionales y de apoyo a la gestión","Contratación directa","Prestación de servicios profesionales y de apoyo a la gestión, o para la ejecución de trabajos artísticos que sólo puedan encomendarse a determinadas personas naturales","PRESTAR SERVICIOS PROFESIONALES AL ÁREA DE GESTIÓN DEL DESARROLLO LOCAL EN LO ATINENTE A LAS ETAPAS PRECONTRACTUALES, CONTRACTUALES Y POSTCONTRACTUALES, EN EL MARCO DE LOS PLANES, PROGRAMAS Y PROYECTOS ENCAMINADOS A LA ADQUISICIÓN DE BIENES Y SERVICIOS PARA EL FORTALECIMIENTO DE LA GESTIÓN LOCAL.","Inversión","Un nuevo contrato social y ambiental para la Bogotá del Siglo XXI",57,{"$f":"IF(ISERROR(VLOOKUP(K27,Proposito_programa!$C$2:$E$59,2,FALSE)),\" \",VLOOKUP(K27,Proposito_programa!$C$2:$E$59,2,FALSE))","v":"Gestión pública local"},{"$f":"IF(ISERROR(VLOOKUP(K27,Proposito_programa!$C$2:$E$59,3,FALSE)),\" \",VLOOKUP(K27,Proposito_programa!$C$2:$E$59,3,FALSE))","v":"Propósito 5: Construir Bogotá - Región con gobierno abierto, transparente y ciudadanía consciente"},2105,1,1049639896,"GERMAN DANIEL BERNAL CAMACHO","Persona Natural",null,null,null,null,71720000,null,1,6085333,77805333,67808000,"2022-01-13","2022-01-13","2023-01-18",11,1,30,null,null,null,null,"Terminado",0.87150838362198124]
["FDLSF-CPS-015-2022",2022,"FDLSF-CD-043-2022","FDLSF-CPS-015-2022","Contratos de prestación de servicios profesionales y de apoyo a la gestión","Contratación directa","Prestación de servicios profesionales y de apoyo a la gestión, o para la ejecución de trabajos artísticos que sólo puedan encomendarse a determinadas personas naturales","APOYAR JURÍDICAMENTE LA EJECUCIÓN DE LAS ACCIONES REQUERIDAS PARA EL TRÁMITE E IMPULSO PROCESAL DE LAS ACTUACIONES CONTRAVENCIONALES Y/O QUERELLAS QUE CURSEN EN LAS INSPECCIONES DE POLICÍA DE LA ALCALDÍA LOCAL.","Inversión","Un nuevo contrato social y ambiental para la Bogotá del Siglo XXI",57,{"$f":"IF(ISERROR(VLOOKUP(K28,Proposito_programa!$C$2:$E$59,2,FALSE)),\" \",VLOOKUP(K28,Proposito_programa!$C$2:$E$59,2,FALSE))","v":"Gestión pública local"},{"$f":"IF(ISERROR(VLOOKUP(K28,Proposito_programa!$C$2:$E$59,3,FALSE)),\" \",VLOOKUP(K28,Proposito_programa!$C$2:$E$59,3,FALSE))","v":"Propósito 5: Construir Bogotá - Región con gobierno abierto, transparente y ciudadanía consciente"},2105,1,39657311,"DORIS DIAZ QUINTERO","Persona Natural",null,null,null,null,67100000,null,1,2643329,69743329,63643333,"2022-01-14","2022-01-18","2022-12-31",11,0,13,null,null,null,null,"Terminado",0.91253649506750678]
["FDLSF-CPS-016-2022",2022,"FDLSF-CD-043-2022","FDLSF-CPS-016-2022","Contratos de prestación de servicios profesionales y de apoyo a la gestión","Contratación directa","Prestación de servicios profesionales y de apoyo a la gestión, o para la ejecución de trabajos artísticos que sólo puedan encomendarse a determinadas personas naturales","APOYAR JURÍDICAMENTE LA EJECUCIÓN DE LAS ACCIONES REQUERIDAS PARA EL TRÁMITE E IMPULSO PROCESAL DE LAS ACTUACIONES CONTRAVENCIONALES Y/O QUERELLAS QUE CURSEN EN LAS INSPECCIONES DE POLICÍA DE LA ALCALDÍA LOCAL.","Inversión","Un nuevo contrato social y ambiental para la Bogotá del Siglo XXI",57,{"$f":"IF(ISERROR(VLOOKUP(K29,Proposito_programa!$C$2:$E$59,2,FALSE)),\" \",VLOOKUP(K29,Proposito_programa!$C$2:$E$59,2,FALSE))","v":"Gestión pública local"},{"$f":"IF(ISERROR(VLOOKUP(K29,Proposito_programa!$C$2:$E$59,3,FALSE)),\" \",VLOOKUP(K29,Proposito_programa!$C$2:$E$59,3,FALSE))","v":"Propósito 5: Construir Bogotá - Región con gobierno abierto, transparente y ciudadanía consciente"},2105,1,1152439354,"SUSANA PINEDO ARANGO","Persona Natural",null,null,null,null,67100000,null,1,2846666,69946666,63846666,"2022-01-14","2022-01-17","2022-12-31",11,0,14,null,null,null,null,"Terminado",0.91279069684322056]
["FDLSF-CPS-017-2022",2022,"FDLSF-CD-043-2022","FDLSF-CPS-017-2022","Contratos de prestación de servicios profesionales y de apoyo a la gestión","Contratación directa","Prestación de servicios profesionales y de apoyo a la gestión, o para la ejecución de trabajos artísticos que sólo puedan encomendarse a determinadas personas naturales","APOYAR JURÍDICAMENTE LA EJECUCIÓN DE LAS ACCIONES REQUERIDAS PARA EL TRÁMITE E IMPULSO PROCESAL DE LAS ACTUACIONES CONTRAVENCIONALES Y/O QUERELLAS QUE CURSEN EN LAS INSPECCIONES DE POLICÍA DE LA ALCALDÍA LOCAL.","Inversión","Un nuevo contrato social y ambiental para la Bogotá del Siglo XXI",57,{"$f":"IF(ISERROR(VLOOKUP(K30,Proposito_programa!$C$2:$E$59,2,FALSE)),\" \",VLOOKUP(K30,Proposito_programa!$C$2:$E$59,2,FALSE))","v":"Gestión pública local"},{"$f":"IF(ISERROR(VLOOKUP(K30,Proposito_programa!$C$2:$E$59,3,FALSE)),\" \",VLOOKUP(K30,Proposito_programa!$C$2:$E$59,3,FALSE))","v":"Propósito 5: Construir Bogotá - Región con gobierno abierto, transparente y ciudadanía consciente"},2105,1,51841202,"JULIA LUCIA GARCIA FORERO","Persona Natural",null,null,null,null,67100000,null,null,0,67100000,63643333,"2022-01-14","2022-01-18","2022-12-31",11,0,13,null,null,null,null,"Terminado",0.94848484351713858]
["FDLSF-CPS-018-2022",2022,"FDLSF-CD-058-2022","FDLSF-CPS-018-2022","Contratos de prestación de servicios profesionales y de apoyo a la gestión","Contratación directa","Prestación de servicios profesionales y de apoyo a la gestión, o para la ejecución de trabajos artísticos que sólo puedan encomendarse a determinadas personas naturales","PRESTAR LOS SERVICIOS PROFESIONALES PARA EL SEGUIMIENTO Y CUMPLIMIENTO DE LOS COMPROMISOS DERIVADOS DE LAS DIFERENTES ÁREAS DE LA ALCALDIA LOCAL DE SANTA FE ASI COMO PARA LA GESTIÓN Y CONTROL DE LOS REQUERIMIENTOS DE LOS ORGANOS DE CONTROL, ENTIDADES DISTRITALES, PRIVADAS Y PQRS.","Inversión","Un nuevo contrato social y ambiental para la Bogotá del Siglo XXI",57,{"$f":"IF(ISERROR(VLOOKUP(K31,Proposito_programa!$C$2:$E$59,2,FALSE)),\" \",VLOOKUP(K31,Proposito_programa!$C$2:$E$59,2,FALSE))","v":"Gestión pública local"},{"$f":"IF(ISERROR(VLOOKUP(K31,Proposito_programa!$C$2:$E$59,3,FALSE)),\" \",VLOOKUP(K31,Proposito_programa!$C$2:$E$59,3,FALSE))","v":"Propósito 5: Construir Bogotá - Región con gobierno abierto, transparente y ciudadanía consciente"},2105,1,1015434368,"VANESSA PEREA RAMIREZ","Persona Natural",null,null,null,null,67100000,null,1,6100000,73200000,64660000,"2022-01-13","2022-01-13","2023-01-12",11,1,30,null,null,null,null,"Terminado",0.8833333333333333]
["FDLSF-CPS-019-2022",2022,"FDLSF-CD-060-2022","FDLSF-CPS-019-2022","Contratos de prestación de servicios profesionales y de apoyo a la gestión","Contratación directa","Prestación de servicios profesionales y de apoyo a la gestión, o para la ejecución de trabajos artísticos que sólo puedan encomendarse a determinadas personas naturales","PRESTAR SUS SERVICIOS COMO APOYO AL ÁREA DE GESTIÓN DEL DESARROLLO LOCAL DE LA ALCALDÍA LOCAL DE SANTA FE EN LOS TRÁMITES, PROCEDIMIENTOS Y APLICATIVOS CONTABLES.","Inversión","Un nuevo contrato social y ambiental para la Bogotá del Siglo XXI",57,{"$f":"IF(ISERROR(VLOOKUP(K32,Proposito_programa!$C$2:$E$59,2,FALSE)),\" \",VLOOKUP(K32,Proposito_programa!$C$2:$E$59,2,FALSE))","v":"Gestión pública local"},{"$f":"IF(ISERROR(VLOOKUP(K32,Proposito_programa!$C$2:$E$59,3,FALSE)),\" \",VLOOKUP(K32,Proposito_programa!$C$2:$E$59,3,FALSE))","v":"Propósito 5: Construir Bogotá - Región con gobierno abierto, transparente y ciudadanía consciente"},2105,1,1101049166,"ZAYDA LORENA VILLAR BECERRA","Persona Natural",null,null,null,null,40260000,null,1,5368000,45628000,38308000,"2022-01-13","2022-01-17","2023-01-31",11,1,44,null,null,null,null,"Terminado",0.83957219251336901]
["FDLSF-CPS-020-2022",2022,"FDLSF-CD-056-2022","FDLSF-CPS-020-2022","Contratos de prestación de servicios profesionales y de apoyo a la gestión","Contratación directa","Prestación de servicios profesionales y de apoyo a la gestión, o para la ejecución de trabajos artísticos que sólo puedan encomendarse a determinadas personas naturales","PRESTAR SUS SERVICIOS PROFESIONALES PARA LA ESTRUCTURACIÓN, VIABILIZACIÓN, EVALUACIÓN Y SEGUIMIENTO DE LOS PROYECTOS DEL PRESUPUESTO DEL FONDO DE DESARROLLO LOCAL DE SANTA FE QUE LE SEAN ASIGNADOS","Inversión","Un nuevo contrato social y ambiental para la Bogotá del Siglo XXI",57,{"$f":"IF(ISERROR(VLOOKUP(K33,Proposito_programa!$C$2:$E$59,2,FALSE)),\" \",VLOOKUP(K33,Proposito_programa!$C$2:$E$59,2,FALSE))","v":"Gestión pública local"},{"$f":"IF(ISERROR(VLOOKUP(K33,Proposito_programa!$C$2:$E$59,3,FALSE)),\" \",VLOOKUP(K33,Proposito_programa!$C$2:$E$59,3,FALSE))","v":"Propósito 5: Construir Bogotá - Región con gobierno abierto, transparente y ciudadanía consciente"},2105,1,1026297550,"SERGIO DAVID ALVAREZ RODRIGUEZ","Persona Natural",null,null,null,null,52800000,null,null,0,52800000,50240000,"2022-01-13","2022-01-13","2023-01-03",11,0,18,1026297550,"SERGIO DAVID ALVAREZ RODRIGUEZ","2022-07-01",null,"Terminado",0.95151515151515154]
["FDLSF-CPS-021-2022",2022,"FDLSF-CD-042-2022","FDLSF-CPS-021-2022","Contratos de prestación de servicios profesionales y de apoyo a la gestión","Contratación directa","Prestación de servicios profesionales y de apoyo a la gestión, o para la ejecución de trabajos artísticos que sólo puedan encomendarse a determinadas personas naturales","PRESTAR LOS SERVICIOS PROFESIONALES PARA LA OPERACIÓN, PRESTACION, SEGUIMIENTO Y CUMPLIMIENTO DE LOS PROCEDIMIENTOS ADMINISTRATIVOS, OPERATIVOS Y PROGRAMÁTICOS DEL SERVICIO SOCIAL APOYO ECONÓMICO TIPO C, QUE CONTRIBUYAN A LA GARANTÍA DE LOS DERECHOS DE LA POBLACIÓN MAYOR EN EL MARCO DE LA POLÍTICA PÚBLICA SOCIAL PARA EL ENVEJECIMIENTO Y LA VEJEZ EN EL DISTRITO CAPITAL A CARGO DE LA ALCALDÍA LOCAL","Inversión","Un nuevo contrato social y ambiental para la Bogotá del Siglo XXI",1,{"$f":"IF(ISERROR(VLOOKUP(K34,Proposito_programa!$C$2:$E$59,2,FALSE)),\" \",VLOOKUP(K34,Proposito_programa!$C$2:$E$59,2,FALSE))","v":"Subsidios y transferencias para la equidad"},{"$f":"IF(ISERROR(VLOOKUP(K34,Proposito_programa!$C$2:$E$59,3,FALSE)),\" \",VLOOKUP(K34,Proposito_programa!$C$2:$E$59,3,FALSE))","v":"Propósito 1: Hacer un nuevo contrato social para incrementar la inclusión social, productiva y política"},2081,1,1026269708,"EDNA NATHALIE ARIZA RICO","Persona Natural",null,null,null,null,56320000,null,1,3584000,59904000,40618666,"2022-01-17","2022-01-18","2023-01-21",11,0,21,null,null,null,null,"Terminado",0.67806266693376072]
["FDLSF-CPS-022-2022",2022,"FDLSF-CD-042-2022","FDLSF-CPS-022-2022","Contratos de prestación de servicios profesionales y de apoyo a la gestión","Contratación directa","Prestación de servicios profesionales y de apoyo a la gestión, o para la ejecución de trabajos artísticos que sólo puedan encomendarse a determinadas personas naturales","PRESTAR LOS SERVICIOS PROFESIONALES PARA LA OPERACIÓN, PRESTACION, SEGUIMIENTO Y CUMPLIMIENTO DE LOS PROCEDIMIENTOS ADMINISTRATIVOS, OPERATIVOS Y PROGRAMÁTICOS DEL SERVICIO SOCIAL APOYO ECONÓMICO TIPO C, QUE CONTRIBUYAN A LA GARANTÍA DE LOS DERECHOS DE LA POBLACIÓN MAYOR EN EL MARCO DE LA POLÍTICA PÚBLICA SOCIAL PARA EL ENVEJECIMIENTO Y LA VEJEZ EN EL DISTRITO CAPITAL A CARGO DE LA ALCALDÍA LOCAL","Inversión","Un nuevo contrato social y ambiental para la Bogotá del Siglo XXI",1,{"$f":"IF(ISERROR(VLOOKUP(K35,Proposito_programa!$C$2:$E$59,2,FALSE)),\" \",VLOOKUP(K35,Proposito_programa!$C$2:$E$59,2,FALSE))","v":"Subsidios y transferencias para la equidad"},{"$f":"IF(ISERROR(VLOOKUP(K35,Proposito_programa!$C$2:$E$59,3,FALSE)),\" \",VLOOKUP(K35,Proposito_programa!$C$2:$E$59,3,FALSE))","v":"Propósito 1: Hacer un nuevo contrato social para incrementar la inclusión social, productiva y política"},2081,1,1022380666,"ALEKSA KATHERINE ALVAREZ VASQUEZ","Persona Natural",null,null,null,null,56320000,null,1,3925333,60245333,53589333,"2022-01-14","2022-01-17","2022-12-22",11,0,0,null,null,null,null,"Terminado",0.88951841298644663]
["FDLSF-CPS-023-2022",2022,"FDLSF-CD-042-2022","FDLSF-CPS-023-2022","Contratos de prestación de servicios profesionales y de apoyo a la gestión","Contratación directa","Prestación de servicios profesionales y de apoyo a la gestión, o para la ejecución de trabajos artísticos que sólo puedan encomendarse a determinadas personas naturales","PRESTAR LOS SERVICIOS PROFESIONALES PARA LA OPERACIÓN, PRESTACION, SEGUIMIENTO Y CUMPLIMIENTO DE LOS PROCEDIMIENTOS ADMINISTRATIVOS, OPERATIVOS Y PROGRAMÁTICOS DEL SERVICIO SOCIAL APOYO ECONÓMICO TIPO C, QUE CONTRIBUYAN A LA GARANTÍA DE LOS DERECHOS DE LA POBLACIÓN MAYOR EN EL MARCO DE LA POLÍTICA PÚBLICA SOCIAL PARA EL ENVEJECIMIENTO Y LA VEJEZ EN EL DISTRITO CAPITAL A CARGO DE LA ALCALDÍA LOCAL","Inversión","Un nuevo contrato social y ambiental para la Bogotá del Siglo XXI",1,{"$f":"IF(ISERROR(VLOOKUP(K36,Proposito_programa!$C$2:$E$59,2,FALSE)),\" \",VLOOKUP(K36,Proposito_programa!$C$2:$E$59,2,FALSE))","v":"Subsidios y transferencias para la equidad"},{"$f":"IF(ISERROR(VLOOKUP(K36,Proposito_programa!$C$2:$E$59,3,FALSE)),\" \",VLOOKUP(K36,Proposito_programa!$C$2:$E$59,3,FALSE))","v":"Propósito 1: Hacer un nuevo contrato social para incrementar la inclusión social, productiva y política"},2081,1,1030557203,"CAMILO ANDRES PEÑA CUEVAS","Persona Natural",null,null,null,null,56320000,null,1,3925333,60245333,53589333,"2022-01-14","2022-01-17","2022-12-16",11,0,0,null,null,null,null,"Terminado",0.88951841298644663]
["FDLSF-CPS-024-2022",2022,"FDLSF-CD-042-2022","FDLSF-CPS-024-2022","Contratos de prestación de servicios profesionales y de apoyo a la gestión","Contratación directa","Prestación de servicios profesionales y de apoyo a la gestión, o para la ejecución de trabajos artísticos que sólo puedan encomendarse a determinadas personas naturales","PRESTAR LOS SERVICIOS PROFESIONALES PARA LA OPERACIÓN, PRESTACION, SEGUIMIENTO Y CUMPLIMIENTO DE LOS PROCEDIMIENTOS ADMINISTRATIVOS, OPERATIVOS Y PROGRAMÁTICOS DEL SERVICIO SOCIAL APOYO ECONÓMICO TIPO C, QUE CONTRIBUYAN A LA GARANTÍA DE LOS DERECHOS DE LA POBLACIÓN MAYOR EN EL MARCO DE LA POLÍTICA PÚBLICA SOCIAL PARA EL ENVEJECIMIENTO Y LA VEJEZ EN EL DISTRITO CAPITAL A CARGO DE LA ALCALDÍA LOCAL","Inversión","Un nuevo contrato social y ambiental para la Bogotá del Siglo XXI",1,{"$f":"IF(ISERROR(VLOOKUP(K37,Proposito_programa!$C$2:$E$59,2,FALSE)),\" \",VLOOKUP(K37,Proposito_programa!$C$2:$E$59,2,FALSE))","v":"Subsidios y transferencias para la equidad"},{"$f":"IF(ISERROR(VLOOKUP(K37,Proposito_programa!$C$2:$E$59,3,FALSE)),\" \",VLOOKUP(K37,Proposito_programa!$C$2:$E$59,3,FALSE))","v":"Propósito 1: Hacer un nuevo contrato social para incrementar la inclusión social, productiva y política"},2081,1,40919591,"GEANIA SECUNDINA ROJAS DE ARMAS","Persona Natural",null,null,null,null,56320000,null,1,3925333,60245333,46591999,"2022-01-14","2022-01-17","2022-12-16",11,0,0,40919591,"GEANIA SECUNDINA ROJAS DE ARMAS","2022-03-15",null,"Terminado",0.77337109249607772]
["FDLSF-CPS-025-2022",2022,"FDLSF-CD-046-2022","FDLSF-CPS-025-2022","Contratos de prestación de servicios profesionales y de apoyo a la gestión","Contratación directa","Prestación de servicios profesionales y de apoyo a la gestión, o para la ejecución de trabajos artísticos que sólo puedan encomendarse a determinadas personas naturales","PRESTAR LOS SERVICIOS PROFESIONALES PARA LA OPERACIÓN, SEGUIMIENTO Y CUMPLIMIENTO DE LOS PROCESOS Y PROCEDIMIENTOS DEL SERVICIO APOYO ECONÓMICO TIPO C, REQUERIDOS PARA EL OPORTUNO Y ADECUADO REGISTRO, CRUCE Y REPORTE DE LOS DATOS EN EL SISTEMA MISIONAL SIRBE, QUE CONTRIBUYAN A LA GARANTÍA DE LOS DERECHOS DE LA POBLACIÓN MAYOR EN EL MARCO DE LA POLÍTICA PÚBLICA SOCIAL PARA EL ENVEJECIMIENTO Y LA VEJEZ EN EL DISTRITO CAPITAL A CARGO DE LA ALCALDÍA LOCAL","Inversión","Un nuevo contrato social y ambiental para la Bogotá del Siglo XXI",1,{"$f":"IF(ISERROR(VLOOKUP(K38,Proposito_programa!$C$2:$E$59,2,FALSE)),\" \",VLOOKUP(K38,Proposito_programa!$C$2:$E$59,2,FALSE))","v":"Subsidios y transferencias para la equidad"},{"$f":"IF(ISERROR(VLOOKUP(K38,Proposito_programa!$C$2:$E$59,3,FALSE)),\" \",VLOOKUP(K38,Proposito_programa!$C$2:$E$59,3,FALSE))","v":"Propósito 1: Hacer un nuevo contrato social para incrementar la inclusión social, productiva y política"},2081,1,1020426511,"DIANA DEL CARMEN MATURANA RENTERIA","Persona Natural",null,null,null,null,56320000,null,1,4096000,60416000,53589333,"2022-01-14","2022-01-17","2023-01-12",11,0,24,null,null,null,null,"Terminado",0.88700564420021188]
["FDLSF-CPS-026-2022",2022,"FDLSF-CD-047-2022","FDLSF-CPS-026-2022","Contratos de prestación de servicios profesionales y de apoyo a la gestión","Contratación directa","Prestación de servicios profesionales y de apoyo a la gestión, o para la ejecución de trabajos artísticos que sólo puedan encomendarse a determinadas personas naturales","PRESTAR LOS SERVICIOS TÉCNICOS PARA LA OPERACIÓN, SEGUIMIENTO Y CUMPLIMIENTO DE LOS PROCESOS Y PROCEDIMIENTOS DEL SERVICIO APOYOS ECONÓMICOS TIPO C, REQUERIDOS PARA EL OPORTUNO Y ADECUADO REGISTRO, CRUCE Y REPORTE DE LOS DATOS EN EL SISTEMA MISIONAL SIRBE, QUE CONTRIBUYAN A LA GARANTÍA DE LOS DERECHOS DE LA POBLACIÓN MAYOR EN EL MARCO DE LA POLÍTICA PÚBLICA SOCIAL PARA EL ENVEJECIMIENTO Y LA VEJEZ EN EL DISTRITO CAPITAL A CARGO DE LA ALCALDÍA LOCAL","Inversión","Un nuevo contrato social y ambiental para la Bogotá del Siglo XXI",1,{"$f":"IF(ISERROR(VLOOKUP(K39,Proposito_programa!$C$2:$E$59,2,FALSE)),\" \",VLOOKUP(K39,Proposito_programa!$C$2:$E$59,2,FALSE))","v":"Subsidios y transferencias para la equidad"},{"$f":"IF(ISERROR(VLOOKUP(K39,Proposito_programa!$C$2:$E$59,3,FALSE)),\" \",VLOOKUP(K39,Proposito_programa!$C$2:$E$59,3,FALSE))","v":"Propósito 1: Hacer un nuevo contrato social para incrementar la inclusión social, productiva y política"},2081,1,1233500040,"PAULA ANDREA DELGADO BETANCUR","Persona Natural",null,null,null,null,40260000,null,1,2318000,42578000,38064000,"2022-01-17","2022-01-19","2023-01-07",11,0,19,null,null,null,null,"Terminado",0.89398280802292263]
["FDLSF-CPS-027-2022",2022,"FDLSF-CD-049-2022","FDLSF-CPS-027-2022","Contratos de prestación de servicios profesionales y de apoyo a la gestión","Contratación directa","Prestación de servicios profesionales y de apoyo a la gestión, o para la ejecución de trabajos artísticos que sólo puedan encomendarse a determinadas personas naturales","PRESTAR SERVICIOS DE APOYO EN EL AREA DE GESTION DE DESARROLLO LOCAL DE LA ALCALDIA LOCAL DE SANTA FE","Inversión","Un nuevo contrato social y ambiental para la Bogotá del Siglo XXI",57,{"$f":"IF(ISERROR(VLOOKUP(K40,Proposito_programa!$C$2:$E$59,2,FALSE)),\" \",VLOOKUP(K40,Proposito_programa!$C$2:$E$59,2,FALSE))","v":"Gestión pública local"},{"$f":"IF(ISERROR(VLOOKUP(K40,Proposito_programa!$C$2:$E$59,3,FALSE)),\" \",VLOOKUP(K40,Proposito_programa!$C$2:$E$59,3,FALSE))","v":"Propósito 5: Construir Bogotá - Región con gobierno abierto, transparente y ciudadanía consciente"},2105,1,1103364647,"LILIA MARCELA MEJIA PEREIRA","Persona Natural",null,null,null,null,25850000,null,1,2350000,28200000,15039999,"2022-01-17","2022-01-18","2023-01-30",11,1,30,null,null,null,null,"Terminado",0.53333329787234041]
["FDLSF-CPS-028-2022",2022,"FDLSF-CD-016-2022","FDLSF-CPS-028-2022","Contratos de prestación de servicios profesionales y de apoyo a la gestión","Contratación directa","Prestación de servicios profesionales y de apoyo a la gestión, o para la ejecución de trabajos artísticos que sólo puedan encomendarse a determinadas personas naturales","PRESTAR SERVICIOS PROFESIONALES ESPECIALIZADOS EN EL ÁREA DE GESTIÓN DEL DESARROLLO LOCAL DE LA ALCALDÍA LOCAL DE SANTA FE PARA EL APOYO AL SEGUIMIENTO DE LA EJECUCIÓN DE LOS PROYECTOS DE INVERSIÓN DESTINADOS A LA INTERVENCIÓN DE INFRAESTRUCTURA DE LA LOCALIDAD DE SANTA FE","Inversión","Un nuevo contrato social y ambiental para la Bogotá del Siglo XXI",57,{"$f":"IF(ISERROR(VLOOKUP(K41,Proposito_programa!$C$2:$E$59,2,FALSE)),\" \",VLOOKUP(K41,Proposito_programa!$C$2:$E$59,2,FALSE))","v":"Gestión pública local"},{"$f":"IF(ISERROR(VLOOKUP(K41,Proposito_programa!$C$2:$E$59,3,FALSE)),\" \",VLOOKUP(K41,Proposito_programa!$C$2:$E$59,3,FALSE))","v":"Propósito 5: Construir Bogotá - Región con gobierno abierto, transparente y ciudadanía consciente"},2105,1,1022325648,"JHON JAIRO CRISPIN NIETO","Persona Natural",null,null,null,null,83160000,null,null,0,83160000,79128000,"2022-01-14","2022-01-17","2023-12-31",11,0,14,null,null,null,null,"Terminado",0.95151515151515154]
["FDLSF-CPS-029-2022",2022,"FDLSF-CD-022-2022","FDLSF-CPS-029-2022","Contratos de prestación de servicios profesionales y de apoyo a la gestión","Contratación directa","Prestación de servicios profesionales y de apoyo a la gestión, o para la ejecución de trabajos artísticos que sólo puedan encomendarse a determinadas personas naturales","PRESTAR SERVICIOS TECNICOS DE APOYO AL ÁREA DE GESTIÓN DEL DESARROLLO DE LA ALCALDÍA LOCAL DE SANTA FE, EN TEMAS RELACIONADOS CON INFRAESTRUCTURA.","Inversión","Un nuevo contrato social y ambiental para la Bogotá del Siglo XXI",57,{"$f":"IF(ISERROR(VLOOKUP(K42,Proposito_programa!$C$2:$E$59,2,FALSE)),\" \",VLOOKUP(K42,Proposito_programa!$C$2:$E$59,2,FALSE))","v":"Gestión pública local"},{"$f":"IF(ISERROR(VLOOKUP(K42,Proposito_programa!$C$2:$E$59,3,FALSE)),\" \",VLOOKUP(K42,Proposito_programa!$C$2:$E$59,3,FALSE))","v":"Propósito 5: Construir Bogotá - Región con gobierno abierto, transparente y ciudadanía consciente"},2105,1,1039457970,"JULIANA MARCELA GONZALEZ PEREZ","Persona Natural",null,null,null,null,32560000,null,null,0,32560000,30882667,"2022-01-17","2022-01-18","2022-12-17",11,0,0,null,null,null,null,"Terminado",0.94848485872235877]
["FDLSF-CPS-030-2022",2022,"FDLSF-CD-018-2022","FDLSF-CPS-030-2022","Contratos de prestación de servicios profesionales y de apoyo a la gestión","Contratación directa","Prestación de servicios profesionales y de apoyo a la gestión, o para la ejecución de trabajos artísticos que sólo puedan encomendarse a determinadas personas naturales","PRESTAR LOS SERVICIOS PROFESIONALES AL ÁREA DE GESTIÓN DEL DESARROLLO LOCAL DE LA ALCALDÍA LOCAL, PARA APOYAR LA ESTRUCTURACIÓN, EVALUACIÓN Y SEGUIMIENTO DE LOS PROYECTOS, PLANES Y PROGRAMAS RELACIONADOS CON EL MANTENIMIENTO, MEJORAMIENTO Y CONSERVACIÓN DE LA INFRAESTRUCTURA VIAL Y ESPACIO PÚBLICO DE LA LOCALIDAD DE SANTA FE","Inversión","Un nuevo contrato social y ambiental para la Bogotá del Siglo XXI",57,{"$f":"IF(ISERROR(VLOOKUP(K43,Proposito_programa!$C$2:$E$59,2,FALSE)),\" \",VLOOKUP(K43,Proposito_programa!$C$2:$E$59,2,FALSE))","v":"Gestión pública local"},{"$f":"IF(ISERROR(VLOOKUP(K43,Proposito_programa!$C$2:$E$59,3,FALSE)),\" \",VLOOKUP(K43,Proposito_programa!$C$2:$E$59,3,FALSE))","v":"Propósito 5: Construir Bogotá - Región con gobierno abierto, transparente y ciudadanía consciente"},2105,1,87491348,"HECTOR WILLINTONG ORTIZ ROSERO","Persona Natural",null,null,null,null,67100000,null,null,0,67100000,63846666,"2022-01-14","2022-01-17","2022-12-16",11,0,0,null,null,null,null,"Terminado",0.95151514157973172]
["FDLSF-CPS-031-2022",2022,"FDLSF-CD-011-2022","FDLSF-CPS-031-2022","Contratos de prestación de servicios profesionales y de apoyo a la gestión","Contratación directa","Prestación de servicios profesionales y de apoyo a la gestión, o para la ejecución de trabajos artísticos que sólo puedan encomendarse a determinadas personas naturales","PRESTAR SERVICIOS COMO APOYO A LA GESTION EN LOS TRÁMITES QUE SE SURTAN EN LA ALCALDÍA LOCAL DE SANTA FE","Inversión","Un nuevo contrato social y ambiental para la Bogotá del Siglo XXI",57,{"$f":"IF(ISERROR(VLOOKUP(K44,Proposito_programa!$C$2:$E$59,2,FALSE)),\" \",VLOOKUP(K44,Proposito_programa!$C$2:$E$59,2,FALSE))","v":"Gestión pública local"},{"$f":"IF(ISERROR(VLOOKUP(K44,Proposito_programa!$C$2:$E$59,3,FALSE)),\" \",VLOOKUP(K44,Proposito_programa!$C$2:$E$59,3,FALSE))","v":"Propósito 5: Construir Bogotá - Región con gobierno abierto, transparente y ciudadanía consciente"},2105,1,52746862,"DIANA MARITZA MIRANDA LOZADA","Persona Natural",null,null,null,null,25850000,null,null,0,25850000,24831667,"2022-01-14","2022-01-14","2022-12-18",11,0,0,52746862,"DIANA MARITZA MIRANDA LOZADA","2022-07-01",null,"Terminado",0.96060607350096716]
["FDLSF-CPS-032-2022",2022,"FDLSF-CD-029-2022","FDLSF-CPS-032-2022","Contratos de prestación de servicios profesionales y de apoyo a la gestión","Contratación directa","Prestación de servicios profesionales y de apoyo a la gestión, o para la ejecución de trabajos artísticos que sólo puedan encomendarse a determinadas personas naturales","PRESTAR SERVICIOS DE APOYO PARA EL FORTALECIMIENTO A LA GESTIÓN LOCAL DE PROCESOS INSTITUCIONALES Y SOCIALES DE INTERÉS PÚBLICO ARTICULADOS POR EL FONDO DE DESARROLLO LOCAL DE SANTA FE EN COMPAÑÍA DE SECTORES ADMINISTRATIVOS DEL DISTRITO, INSTANCIAS Y ORGANIZACIONES SOCIALES EN LA LOCALIDAD.","Inversión","Un nuevo contrato social y ambiental para la Bogotá del Siglo XXI",57,{"$f":"IF(ISERROR(VLOOKUP(K45,Proposito_programa!$C$2:$E$59,2,FALSE)),\" \",VLOOKUP(K45,Proposito_programa!$C$2:$E$59,2,FALSE))","v":"Gestión pública local"},{"$f":"IF(ISERROR(VLOOKUP(K45,Proposito_programa!$C$2:$E$59,3,FALSE)),\" \",VLOOKUP(K45,Proposito_programa!$C$2:$E$59,3,FALSE))","v":"Propósito 5: Construir Bogotá - Región con gobierno abierto, transparente y ciudadanía consciente"},2105,1,79287493,"PEDRO PABLO MALAGON GONZALEZ","Persona Natural",null,null,null,null,16450000,null,null,0,16450000,16450000,"2022-01-26","2022-02-01","2022-08-31",7,0,0,null,null,null,null,"Terminado",1]
["FDLSF-CPS-033-2022",2022,"FDLSF-CD-057-2022","FDLSF-CPS-033-2022","Contratos de prestación de servicios profesionales y de apoyo a la gestión","Contratación directa","Prestación de servicios profesionales y de apoyo a la gestión, o para la ejecución de trabajos artísticos que sólo puedan encomendarse a determinadas personas naturales","PRESTAR LOS SERVICIOS PROFESIONALES PARA LLEVAR A CABO ACTIVIDADES DE SEGUIMIENTO Y ACTUALIZACIÓN DE LOS PROYECTOS DE INVERSIÓN DIRECTA DEL FONDO DE DESARROLLO LOCAL DE SANTA FE, ASÍ COMO APOYAR LA FORMULACIÓN, VIABILIZACIÓN Y EVALUACIÓN DE LOS PROYECTOS DE INVERSIÓN Y/O FUNCIONAMIENTO QUE LE SEAN ASIGNADOS.","Inversión","Un nuevo contrato social y ambiental para la Bogotá del Siglo XXI",57,{"$f":"IF(ISERROR(VLOOKUP(K46,Proposito_programa!$C$2:$E$59,2,FALSE)),\" \",VLOOKUP(K46,Proposito_programa!$C$2:$E$59,2,FALSE))","v":"Gestión pública local"},{"$f":"IF(ISERROR(VLOOKUP(K46,Proposito_programa!$C$2:$E$59,3,FALSE)),\" \",VLOOKUP(K46,Proposito_programa!$C$2:$E$59,3,FALSE))","v":"Propósito 5: Construir Bogotá - Región con gobierno abierto, transparente y ciudadanía consciente"},2105,1,1016013382,"ISABEL CASTRO HEREDIA","Persona Natural",null,null,null,null,67100000,null,1,6100000,73200000,64456667,"2022-01-14","2022-01-14","2023-01-13",11,1,30,null,null,null,null,"Terminado",0.88055556010928959]
["FDLSF-CPS-034-2022",2022,"FDLSF-CD-067-2022","FDLSF-CPS-034-2022","Contratos de prestación de servicios profesionales y de apoyo a la gestión","Contratación directa","Prestación de servicios profesionales y de apoyo a la gestión, o para la ejecución de trabajos artísticos que sólo puedan encomendarse a determinadas personas naturales","PRESTAR SERVICIOS PROFESIONALES EN EL ÁREA DE GESTIÓN DE DESARROLLO LOCAL PARA LA PLANEACIÓN, ESTRUCTURACIÓN, VIABILIZACIÓN, EVALUACIÓN Y SEGUIMIENTO DE LOS PROYECTOS DE INVERSION Y FUNCIONAMIENTO DE LA ALCALDIA LOCAL DE SANTA FE QUE LE SEAN ASIGNADOS","Inversión","Un nuevo contrato social y ambiental para la Bogotá del Siglo XXI",57,{"$f":"IF(ISERROR(VLOOKUP(K47,Proposito_programa!$C$2:$E$59,2,FALSE)),\" \",VLOOKUP(K47,Proposito_programa!$C$2:$E$59,2,FALSE))","v":"Gestión pública local"},{"$f":"IF(ISERROR(VLOOKUP(K47,Proposito_programa!$C$2:$E$59,3,FALSE)),\" \",VLOOKUP(K47,Proposito_programa!$C$2:$E$59,3,FALSE))","v":"Propósito 5: Construir Bogotá - Región con gobierno abierto, transparente y ciudadanía consciente"},2105,1,1026559595,"ESMERALDA VELA QUINTERO","Persona Natural",null,null,null,null,67100000,null,1,2643333,69743333,63643333,"2022-01-14","2022-01-18","2022-12-17",11,0,0,null,null,null,null,"Terminado",0.91253644273066215]
["FDLSF-CPS-035-2022",2022,"FDLSF-CD-067-2022","FDLSF-CPS-035-2022","Contratos de prestación de servicios profesionales y de apoyo a la gestión","Contratación directa","Prestación de servicios profesionales y de apoyo a la gestión, o para la ejecución de trabajos artísticos que sólo puedan encomendarse a determinadas personas naturales","PRESTAR SERVICIOS PROFESIONALES EN EL ÁREA DE GESTIÓN DE DESARROLLO LOCAL PARA LA PLANEACIÓN, ESTRUCTURACIÓN, VIABILIZACIÓN, EVALUACIÓN Y SEGUIMIENTO DE LOS PROYECTOS DE INVERSION Y FUNCIONAMIENTO DE LA ALCALDIA LOCAL DE SANTA FE QUE LE SEAN ASIGNADOS","Inversión","Un nuevo contrato social y ambiental para la Bogotá del Siglo XXI",57,{"$f":"IF(ISERROR(VLOOKUP(K48,Proposito_programa!$C$2:$E$59,2,FALSE)),\" \",VLOOKUP(K48,Proposito_programa!$C$2:$E$59,2,FALSE))","v":"Gestión pública local"},{"$f":"IF(ISERROR(VLOOKUP(K48,Proposito_programa!$C$2:$E$59,3,FALSE)),\" \",VLOOKUP(K48,Proposito_programa!$C$2:$E$59,3,FALSE))","v":"Propósito 5: Construir Bogotá - Región con gobierno abierto, transparente y ciudadanía consciente"},2105,1,1128281402,"CRISTIAN DAVID LONDOÑO RUEDA","Persona Natural",null,null,null,null,67100000,null,1,3456667,70556667,64456667,"2022-01-14","2022-01-14","2023-01-04",11,0,17,null,null,null,null,"Terminado",0.91354466899634024]
["FDLSF-CPS-036-2022",2022,"FDLSF-CD-067-2022","FDLSF-CPS-036-2022","Contratos de prestación de servicios profesionales y de apoyo a la gestión","Contratación directa","Prestación de servicios profesionales y de apoyo a la gestión, o para la ejecución de trabajos artísticos que sólo puedan encomendarse a determinadas personas naturales","PRESTAR SERVICIOS PROFESIONALES EN EL ÁREA DE GESTIÓN DE DESARROLLO LOCAL PARA LA PLANEACIÓN, ESTRUCTURACIÓN, VIABILIZACIÓN, EVALUACIÓN Y SEGUIMIENTO DE LOS PROYECTOS DE INVERSION Y FUNCIONAMIENTO DE LA ALCALDIA LOCAL DE SANTA FE QUE LE SEAN ASIGNADOS","Inversión","Un nuevo contrato social y ambiental para la Bogotá del Siglo XXI",57,{"$f":"IF(ISERROR(VLOOKUP(K49,Proposito_programa!$C$2:$E$59,2,FALSE)),\" \",VLOOKUP(K49,Proposito_programa!$C$2:$E$59,2,FALSE))","v":"Gestión pública local"},{"$f":"IF(ISERROR(VLOOKUP(K49,Proposito_programa!$C$2:$E$59,3,FALSE)),\" \",VLOOKUP(K49,Proposito_programa!$C$2:$E$59,3,FALSE))","v":"Propósito 5: Construir Bogotá - Región con gobierno abierto, transparente y ciudadanía consciente"},2105,1,13275913,"FREDDY ALBERTO MARQUEZ ARIAS","Persona Natural",null,null,null,null,67100000,null,1,6100000,73200000,57746667,"2022-01-14","2022-01-17","2023-01-16",11,1,30,13275913,"FREDDY ALBERTO MARQUEZ ARIAS","2022-06-29",null,"Terminado",0.78888889344262292]
["FDLSF-CPS-037-2022",2022,"FDLSF-CD-063-2022","FDLSF-CPS-037-2022","Contratos de prestación de servicios profesionales y de apoyo a la gestión","Contratación directa","Prestación de servicios profesionales y de apoyo a la gestión, o para la ejecución de trabajos artísticos que sólo puedan encomendarse a determinadas personas naturales"," EL CONTRATO QUE SE PRETENDE CELEBRAR, TENDRÁ POR OBJETO APOYAR TÉCNICAMENTE A LOS RESPONSABLES E INTEGRANTES DE LOS PROCESOS EN LA IMPLEMENTACIÓN DE HERRAMIENTAS DE GESTIÓN, SIGUIENDO LOS LINEAMIENTOS METODOLÓGICOS ESTABLECIDOS POR LA OFICINA ASESORA DE PLANEACIÓN DE LA SECRETARÍA DISTRITAL DE GOBIERNO. ","Inversión","Un nuevo contrato social y ambiental para la Bogotá del Siglo XXI",57,{"$f":"IF(ISERROR(VLOOKUP(K50,Proposito_programa!$C$2:$E$59,2,FALSE)),\" \",VLOOKUP(K50,Proposito_programa!$C$2:$E$59,2,FALSE))","v":"Gestión pública local"},{"$f":"IF(ISERROR(VLOOKUP(K50,Proposito_programa!$C$2:$E$59,3,FALSE)),\" \",VLOOKUP(K50,Proposito_programa!$C$2:$E$59,3,FALSE))","v":"Propósito 5: Construir Bogotá - Región con gobierno abierto, transparente y ciudadanía consciente"},2105,1,35261208,"YEIMY ASTRID MEJIA CASTRO","Persona Natural",null,null,null,null,67100000,null,null,0,67100000,63846667,"2022-01-14","2022-01-17","2022-12-16",11,0,0,null,null,null,null,"Terminado",0.95151515648286145]
["FDLSF-CPS-038-2022",2022,"FDLSF-CD-068-2022","FDLSF-CPS-038-2022","Contratos de prestación de servicios profesionales y de apoyo a la gestión","Contratación directa","Prestación de servicios profesionales y de apoyo a la gestión, o para la ejecución de trabajos artísticos que sólo puedan encomendarse a determinadas personas naturales"," PRESTAR SERVICIOS PROFESIONALES PARA APOYAR AL DESPACHO DE LA ALCALDÍA LOCAL EN LA GESTIÓN DE LOS PROCESOS FINANCIEROS, ECONÓMICOS Y CONTABLES QUE COADYUVEN AL FORTALECIMIENTO INSTITUCIONAL EN TORNO A LAS ACTIVIDADES QUE REALIZA EL FONDO DE DESARROLLO","Inversión","Un nuevo contrato social y ambiental para la Bogotá del Siglo XXI",57,{"$f":"IF(ISERROR(VLOOKUP(K51,Proposito_programa!$C$2:$E$59,2,FALSE)),\" \",VLOOKUP(K51,Proposito_programa!$C$2:$E$59,2,FALSE))","v":"Gestión pública local"},{"$f":"IF(ISERROR(VLOOKUP(K51,Proposito_programa!$C$2:$E$59,3,FALSE)),\" \",VLOOKUP(K51,Proposito_programa!$C$2:$E$59,3,FALSE))","v":"Propósito 5: Construir Bogotá - Región con gobierno abierto, transparente y ciudadanía consciente"},2105,1,51958213,"ELAINE AGUILAR CASTRO","Persona Natural",null,null,null,null,67100000,null,null,0,67100000,47376667,"2022-01-14","2022-01-20","2022-09-12",11,0,0,null,null,null,null,"Terminado",0.70606061102831597]
["FDLSF-CPS-039-2022",2022,"FDLSF-CD-067-2022","FDLSF-CPS-039-2022","Contratos de prestación de servicios profesionales y de apoyo a la gestión","Contratación directa","Prestación de servicios profesionales y de apoyo a la gestión, o para la ejecución de trabajos artísticos que sólo puedan encomendarse a determinadas personas naturales","PRESTAR SERVICIOS PROFESIONALES EN EL ÁREA DE GESTIÓN DE DESARROLLO LOCAL PARA LA PLANEACIÓN, ESTRUCTURACIÓN, VIABILIZACIÓN, EVALUACIÓN Y SEGUIMIENTO DE LOS PROYECTOS DE INVERSION Y FUNCIONAMIENTO DE LA ALCALDIA LOCAL DE SANTA FE QUE LE SEAN ASIGNADOS","Inversión","Un nuevo contrato social y ambiental para la Bogotá del Siglo XXI",57,{"$f":"IF(ISERROR(VLOOKUP(K52,Proposito_programa!$C$2:$E$59,2,FALSE)),\" \",VLOOKUP(K52,Proposito_programa!$C$2:$E$59,2,FALSE))","v":"Gestión pública local"},{"$f":"IF(ISERROR(VLOOKUP(K52,Proposito_programa!$C$2:$E$59,3,FALSE)),\" \",VLOOKUP(K52,Proposito_programa!$C$2:$E$59,3,FALSE))","v":"Propósito 5: Construir Bogotá - Región con gobierno abierto, transparente y ciudadanía consciente"},2105,1,1010185467,"ANGELICA JOHANNA  \tLLANOS FORERO","Persona Natural",null,null,null,null,67100000,null,null,0,67100000,63846667,"2022-01-14","2022-01-17","2022-12-16",11,0,0,null,null,null,null,"Terminado",0.95151515648286145]
["FDLSF-CPS-040-2022",2022,"FDLSF-CD-069-2022","FDLSF-CPS-040-2022","Contratos de prestación de servicios profesionales y de apoyo a la gestión","Contratación directa","Prestación de servicios profesionales y de apoyo a la gestión, o para la ejecución de trabajos artísticos que sólo puedan encomendarse a determinadas personas naturales"," APOYAR LA FORMULACIÓN, GESTIÓN Y SEGUIMIENTO DE ACTIVIDADES ENFOCADAS A LA GESTIÓN AMBIENTAL EXTERNA, ENCAMINADAS A LA MITIGACIÓN DE LOS DIFERENTES IMPACTOS AMBIENTALES Y LA CONSERVACIÓN DE LOS RECURSOS NATURALES DE LA LOCALIDAD","Inversión","Un nuevo contrato social y ambiental para la Bogotá del Siglo XXI",57,{"$f":"IF(ISERROR(VLOOKUP(K53,Proposito_programa!$C$2:$E$59,2,FALSE)),\" \",VLOOKUP(K53,Proposito_programa!$C$2:$E$59,2,FALSE))","v":"Gestión pública local"},{"$f":"IF(ISERROR(VLOOKUP(K53,Proposito_programa!$C$2:$E$59,3,FALSE)),\" \",VLOOKUP(K53,Proposito_programa!$C$2:$E$59,3,FALSE))","v":"Propósito 5: Construir Bogotá - Región con gobierno abierto, transparente y ciudadanía consciente"},2105,1,1019051534,"NATALIA ROZO PEREZ","Persona Natural",null,null,null,null,67100000,null,null,0,67100000,63033333,"2022-01-14","2022-01-17","2022-12-20",11,0,0,null,null,null,null,"Terminado",0.93939393442622954]
["FDLSF-CPS-041-2022",2022,"FDLSF-CD-062-2022","FDLSF-CPS-041-2022","Contratos de prestación de servicios profesionales y de apoyo a la gestión","Contratación directa","Prestación de servicios profesionales y de apoyo a la gestión, o para la ejecución de trabajos artísticos que sólo puedan encomendarse a determinadas personas naturales","APOYAR EL ALCALDE LOCAL EN LA GESTIÓN DE LOS ASUNTOS RELACIONADOS CON SEGURIDAD CIUDADANA, CONVIVENCIA Y PREVENCIÓN DE CONFLICTIVIDADES, VIOLENCIAS Y DELITOS EN LA LOCALIDAD, DE CONFORMIDAD CON EL MARCO NORMATIVO APLICABLE EN LA MATERIA","Inversión","Un nuevo contrato social y ambiental para la Bogotá del Siglo XXI",57,{"$f":"IF(ISERROR(VLOOKUP(K54,Proposito_programa!$C$2:$E$59,2,FALSE)),\" \",VLOOKUP(K54,Proposito_programa!$C$2:$E$59,2,FALSE))","v":"Gestión pública local"},{"$f":"IF(ISERROR(VLOOKUP(K54,Proposito_programa!$C$2:$E$59,3,FALSE)),\" \",VLOOKUP(K54,Proposito_programa!$C$2:$E$59,3,FALSE))","v":"Propósito 5: Construir Bogotá - Región con gobierno abierto, transparente y ciudadanía consciente"},2105,1,79843643,"GUSTAVO ALEXANDER GRANADOS ARIAS","Persona Natural",null,null,null,null,77000000,null,1,7000000,84000000,71166667,"2022-01-14","2022-01-14","2023-01-14",11,1,30,79843643,"GUSTAVO ALEXANDER GRANADOS ARIAS","2022-05-27",null,"Terminado",0.84722222619047616]
["FDLSF-CPS-042-2022",2022,"FDLSF-CD-061-2022","FDLSF-CPS-042-2022","Contratos de prestación de servicios profesionales y de apoyo a la gestión","Contratación directa","Prestación de servicios profesionales y de apoyo a la gestión, o para la ejecución de trabajos artísticos que sólo puedan encomendarse a determinadas personas naturales","COORDINA, LIDERA Y ASESORA LOS PLANES Y ESTRATEGIAS DE COMUNICACIÓN INTERNA Y EXTERNA PARA LA DIVULGACIÓN DE LOS PROGRAMAS, PROYECTOS Y ACTIVIDADES DE LA ALCALDÍA LOCAL ","Inversión","Un nuevo contrato social y ambiental para la Bogotá del Siglo XXI",57,{"$f":"IF(ISERROR(VLOOKUP(K55,Proposito_programa!$C$2:$E$59,2,FALSE)),\" \",VLOOKUP(K55,Proposito_programa!$C$2:$E$59,2,FALSE))","v":"Gestión pública local"},{"$f":"IF(ISERROR(VLOOKUP(K55,Proposito_programa!$C$2:$E$59,3,FALSE)),\" \",VLOOKUP(K55,Proposito_programa!$C$2:$E$59,3,FALSE))","v":"Propósito 5: Construir Bogotá - Región con gobierno abierto, transparente y ciudadanía consciente"},2105,1,91517570,"WILLIAM ANDRES TELLEZ CHAVEZ","Persona Natural",null,null,null,null,77440000,null,null,0,77440000,72042666,"2022-01-17","2022-01-24","2022-12-23",11,0,0,null,null,null,null,"Terminado",0.93030302169421486]
["FDLSF-CPS-043-2022",2022,"FDLSF-CD-048-2022","FDLSF-CPS-043-2022","Contratos de prestación de servicios profesionales y de apoyo a la gestión","Contratación directa","Prestación de servicios profesionales y de apoyo a la gestión, o para la ejecución de trabajos artísticos que sólo puedan encomendarse a determinadas personas naturales","PRESTAR LOS SERVICIOS PROFESIONALES CON EL FIN DE LIDERAR Y GARANTIZAR LA IMPLEMENTACIÓN Y SEGUIMIENTO DE LOS PROCESOS Y PROCEDIMIENTOS DEL SERVICIO SOCIAL.","Inversión","Un nuevo contrato social y ambiental para la Bogotá del Siglo XXI",1,{"$f":"IF(ISERROR(VLOOKUP(K56,Proposito_programa!$C$2:$E$59,2,FALSE)),\" \",VLOOKUP(K56,Proposito_programa!$C$2:$E$59,2,FALSE))","v":"Subsidios y transferencias para la equidad"},{"$f":"IF(ISERROR(VLOOKUP(K56,Proposito_programa!$C$2:$E$59,3,FALSE)),\" \",VLOOKUP(K56,Proposito_programa!$C$2:$E$59,3,FALSE))","v":"Propósito 1: Hacer un nuevo contrato social para incrementar la inclusión social, productiva y política"},2081,1,1026250398,"JOHANNA MORALES RIZO","Persona Natural",null,null,null,null,67100000,null,1,4473333,71573333,58356667,"2022-01-18","2022-01-19","2022-12-31",11,0,0,null,null,null,null,"Terminado",0.81534091754536564]
["FDLSF-CPS-044-2022",2022,"FDLSF-CD-006-2022","FDLSF-CPS-044-2022","Contratos de prestación de servicios profesionales y de apoyo a la gestión","Contratación directa","Prestación de servicios profesionales y de apoyo a la gestión, o para la ejecución de trabajos artísticos que sólo puedan encomendarse a determinadas personas naturales","PRESTAR SERVICIOS PROFESIONALES EN EL ÁREA DE GESTIÓN DE DESARROLLO LOCAL REFERENTE A LAS PLATAFORMAS DE CONTRATACIÓN, ACTUALIZACIÓN Y CONSOLIDACIÓN DE LA BASE DE DATOS, SISTEMA ELECTRÓNICO, RESPUESTAS A LOS ÓRGANOS DE CONTROL Y TODO LO RELACIONADO CON LA ACTIVIDAD PRECONTRACTUAL, CONTRACTUAL Y POSTCONTRACTUAL DE LA EJECUCIÓN DE LOS RECURSOS DEL FONDO DE DESARROLLO LOCAL DE SANTA FE","Inversión","Un nuevo contrato social y ambiental para la Bogotá del Siglo XXI",57,{"$f":"IF(ISERROR(VLOOKUP(K57,Proposito_programa!$C$2:$E$59,2,FALSE)),\" \",VLOOKUP(K57,Proposito_programa!$C$2:$E$59,2,FALSE))","v":"Gestión pública local"},{"$f":"IF(ISERROR(VLOOKUP(K57,Proposito_programa!$C$2:$E$59,3,FALSE)),\" \",VLOOKUP(K57,Proposito_programa!$C$2:$E$59,3,FALSE))","v":"Propósito 5: Construir Bogotá - Región con gobierno abierto, transparente y ciudadanía consciente"},2105,1,1124051252,"JAKE STEPHANIA TINJACA NIÑO","Persona Natural",null,null,null,null,52800000,null,1,4800000,57600000,49920000,"2022-01-18","2022-01-19","2023-01-18",11,1,30,null,null,null,null,"Terminado",0.8666666666666667]
["FDLSF-CPS-045-2022",2022,"FDLSF-CD-053-2022","FDLSF-CPS-045-2022","Contratos de prestación de servicios profesionales y de apoyo a la gestión","Contratación directa","Prestación de servicios profesionales y de apoyo a la gestión, o para la ejecución de trabajos artísticos que sólo puedan encomendarse a determinadas personas naturales"," PRESTAR SERVICIOS DE APOYO PARA LA GESTIÓN LOCAL Y TERRITORIAL EN LOS TEMAS DE SEGURIDAD Y CONVIVENCIA CIUDADANA. ","Inversión","Un nuevo contrato social y ambiental para la Bogotá del Siglo XXI",43,{"$f":"IF(ISERROR(VLOOKUP(K58,Proposito_programa!$C$2:$E$59,2,FALSE)),\" \",VLOOKUP(K58,Proposito_programa!$C$2:$E$59,2,FALSE))","v":"Cultura ciudadana para la confianza, la convivencia y la participación desde la vida cotidiana"},{"$f":"IF(ISERROR(VLOOKUP(K58,Proposito_programa!$C$2:$E$59,3,FALSE)),\" \",VLOOKUP(K58,Proposito_programa!$C$2:$E$59,3,FALSE))","v":"Propósito 3: Inspirar confianza y legitimidad para vivir sin miedo y ser epicentro de cultura ciudadana, paz y reconciliación"},2128,1,51977530,"ANA MARIA TORRES VEGA","Persona Natural",null,null,null,null,25850000,null,null,0,25850000,24126667,"2022-01-21","2022-01-23","2022-12-22",11,0,0,null,null,null,null,"Terminado",0.93333334622823982]
["FDLSF-CPS-046-2022",2022,"FDLSF-CD-053-2022","FDLSF-CPS-046-2022","Contratos de prestación de servicios profesionales y de apoyo a la gestión","Contratación directa","Prestación de servicios profesionales y de apoyo a la gestión, o para la ejecución de trabajos artísticos que sólo puedan encomendarse a determinadas personas naturales"," PRESTAR SERVICIOS DE APOYO PARA LA GESTIÓN LOCAL Y TERRITORIAL EN LOS TEMAS DE SEGURIDAD Y CONVIVENCIA CIUDADANA. ","Inversión","Un nuevo contrato social y ambiental para la Bogotá del Siglo XXI",43,{"$f":"IF(ISERROR(VLOOKUP(K59,Proposito_programa!$C$2:$E$59,2,FALSE)),\" \",VLOOKUP(K59,Proposito_programa!$C$2:$E$59,2,FALSE))","v":"Cultura ciudadana para la confianza, la convivencia y la participación desde la vida cotidiana"},{"$f":"IF(ISERROR(VLOOKUP(K59,Proposito_programa!$C$2:$E$59,3,FALSE)),\" \",VLOOKUP(K59,Proposito_programa!$C$2:$E$59,3,FALSE))","v":"Propósito 3: Inspirar confianza y legitimidad para vivir sin miedo y ser epicentro de cultura ciudadana, paz y reconciliación"},2128,1,23866211,"LUZ MERY ALARCON PUENTES","Persona Natural",null,null,null,null,25850000,null,1,2350000,28200000,24126667,"2022-01-21","2022-01-23","2023-01-22",11,1,30,null,null,null,null,"Terminado",0.85555556737588656]
["FDLSF-CPS-047-2022",2022,"FDLSF-CD-053-2022","FDLSF-CPS-047-2022","Contratos de prestación de servicios profesionales y de apoyo a la gestión","Contratación directa","Prestación de servicios profesionales y de apoyo a la gestión, o para la ejecución de trabajos artísticos que sólo puedan encomendarse a determinadas personas naturales"," PRESTAR SERVICIOS DE APOYO PARA LA GESTIÓN LOCAL Y TERRITORIAL EN LOS TEMAS DE SEGURIDAD Y CONVIVENCIA CIUDADANA. ","Inversión","Un nuevo contrato social y ambiental para la Bogotá del Siglo XXI",43,{"$f":"IF(ISERROR(VLOOKUP(K60,Proposito_programa!$C$2:$E$59,2,FALSE)),\" \",VLOOKUP(K60,Proposito_programa!$C$2:$E$59,2,FALSE))","v":"Cultura ciudadana para la confianza, la convivencia y la participación desde la vida cotidiana"},{"$f":"IF(ISERROR(VLOOKUP(K60,Proposito_programa!$C$2:$E$59,3,FALSE)),\" \",VLOOKUP(K60,Proposito_programa!$C$2:$E$59,3,FALSE))","v":"Propósito 3: Inspirar confianza y legitimidad para vivir sin miedo y ser epicentro de cultura ciudadana, paz y reconciliación"},2128,1,19450034,"OWER JOSE CAMPOS SALDAÑA","Persona Natural",null,null,null,null,25850000,null,1,2350000,28200000,23891667,"2022-01-21","2022-01-26","2023-01-25",11,1,30,null,null,null,null,"Terminado",0.84722223404255315]
["FDLSF-CPS-048-2022",2022,"FDLSF-CD-053-2022","FDLSF-CPS-048-2022","Contratos de prestación de servicios profesionales y de apoyo a la gestión","Contratación directa","Prestación de servicios profesionales y de apoyo a la gestión, o para la ejecución de trabajos artísticos que sólo puedan encomendarse a determinadas personas naturales"," PRESTAR SERVICIOS DE APOYO PARA LA GESTIÓN LOCAL Y TERRITORIAL EN LOS TEMAS DE SEGURIDAD Y CONVIVENCIA CIUDADANA. ","Inversión","Un nuevo contrato social y ambiental para la Bogotá del Siglo XXI",43,{"$f":"IF(ISERROR(VLOOKUP(K61,Proposito_programa!$C$2:$E$59,2,FALSE)),\" \",VLOOKUP(K61,Proposito_programa!$C$2:$E$59,2,FALSE))","v":"Cultura ciudadana para la confianza, la convivencia y la participación desde la vida cotidiana"},{"$f":"IF(ISERROR(VLOOKUP(K61,Proposito_programa!$C$2:$E$59,3,FALSE)),\" \",VLOOKUP(K61,Proposito_programa!$C$2:$E$59,3,FALSE))","v":"Propósito 3: Inspirar confianza y legitimidad para vivir sin miedo y ser epicentro de cultura ciudadana, paz y reconciliación"},2128,1,79752780,"RAFAEL LEONARDO HERNANDEZ LOSADA","Persona Natural",null,null,null,null,25850000,null,null,0,25850000,22951667,"2022-01-21","2022-01-23","2023-01-07",11,0,7,null,null,null,null,"Terminado",0.88787880077369441]
["FDLSF-CPS-049-2022",2022,"FDLSF-CD-053-2022","FDLSF-CPS-049-2022","Contratos de prestación de servicios profesionales y de apoyo a la gestión","Contratación directa","Prestación de servicios profesionales y de apoyo a la gestión, o para la ejecución de trabajos artísticos que sólo puedan encomendarse a determinadas personas naturales"," PRESTAR SERVICIOS DE APOYO PARA LA GESTIÓN LOCAL Y TERRITORIAL EN LOS TEMAS DE SEGURIDAD Y CONVIVENCIA CIUDADANA. ","Inversión","Un nuevo contrato social y ambiental para la Bogotá del Siglo XXI",43,{"$f":"IF(ISERROR(VLOOKUP(K62,Proposito_programa!$C$2:$E$59,2,FALSE)),\" \",VLOOKUP(K62,Proposito_programa!$C$2:$E$59,2,FALSE))","v":"Cultura ciudadana para la confianza, la convivencia y la participación desde la vida cotidiana"},{"$f":"IF(ISERROR(VLOOKUP(K62,Proposito_programa!$C$2:$E$59,3,FALSE)),\" \",VLOOKUP(K62,Proposito_programa!$C$2:$E$59,3,FALSE))","v":"Propósito 3: Inspirar confianza y legitimidad para vivir sin miedo y ser epicentro de cultura ciudadana, paz y reconciliación"},2128,1,79973182,"OMAR ORLANDO MESA SIERRA","Persona Natural",null,null,null,null,25850000,null,1,2350000,28200000,23265000,"2022-01-20","2022-01-23","2023-01-28",11,1,30,79973182,"OMAR ORLANDO MESA SIERRA","2022-09-12",null,"Terminado",0.82499999999999996]
["FDLSF-CPS-050-2022",2022,"FDLSF-CD-053-2022","FDLSF-CPS-050-2022","Contratos de prestación de servicios profesionales y de apoyo a la gestión","Contratación directa","Prestación de servicios profesionales y de apoyo a la gestión, o para la ejecución de trabajos artísticos que sólo puedan encomendarse a determinadas personas naturales"," PRESTAR SERVICIOS DE APOYO PARA LA GESTIÓN LOCAL Y TERRITORIAL EN LOS TEMAS DE SEGURIDAD Y CONVIVENCIA CIUDADANA. ","Inversión","Un nuevo contrato social y ambiental para la Bogotá del Siglo XXI",43,{"$f":"IF(ISERROR(VLOOKUP(K63,Proposito_programa!$C$2:$E$59,2,FALSE)),\" \",VLOOKUP(K63,Proposito_programa!$C$2:$E$59,2,FALSE))","v":"Cultura ciudadana para la confianza, la convivencia y la participación desde la vida cotidiana"},{"$f":"IF(ISERROR(VLOOKUP(K63,Proposito_programa!$C$2:$E$59,3,FALSE)),\" \",VLOOKUP(K63,Proposito_programa!$C$2:$E$59,3,FALSE))","v":"Propósito 3: Inspirar confianza y legitimidad para vivir sin miedo y ser epicentro de cultura ciudadana, paz y reconciliación"},2128,1,52886138,"LUZ ADRIANA SANABRIA","Persona Natural",null,null,null,null,25850000,null,1,2350000,28200000,24048333,"2022-01-21","2022-01-24","2023-01-23",11,1,30,null,null,null,null,"Terminado",0.85277776595744681]
["FDLSF-CPS-051-2022",2022,"FDLSF-CD-053-2022","FDLSF-CPS-051-2022","Contratos de prestación de servicios profesionales y de apoyo a la gestión","Contratación directa","Prestación de servicios profesionales y de apoyo a la gestión, o para la ejecución de trabajos artísticos que sólo puedan encomendarse a determinadas personas naturales"," PRESTAR SERVICIOS DE APOYO PARA LA GESTIÓN LOCAL Y TERRITORIAL EN LOS TEMAS DE SEGURIDAD Y CONVIVENCIA CIUDADANA. ","Inversión","Un nuevo contrato social y ambiental para la Bogotá del Siglo XXI",43,{"$f":"IF(ISERROR(VLOOKUP(K64,Proposito_programa!$C$2:$E$59,2,FALSE)),\" \",VLOOKUP(K64,Proposito_programa!$C$2:$E$59,2,FALSE))","v":"Cultura ciudadana para la confianza, la convivencia y la participación desde la vida cotidiana"},{"$f":"IF(ISERROR(VLOOKUP(K64,Proposito_programa!$C$2:$E$59,3,FALSE)),\" \",VLOOKUP(K64,Proposito_programa!$C$2:$E$59,3,FALSE))","v":"Propósito 3: Inspirar confianza y legitimidad para vivir sin miedo y ser epicentro de cultura ciudadana, paz y reconciliación"},2128,1,80068905,"NELSON ALEJANDRO CALDAS MARTINEZ","Persona Natural",null,null,null,null,25850000,null,1,2350000,28200000,23265000,"2022-01-20","2022-01-23","2023-01-22",11,1,30,null,null,null,null,"Terminado",0.82499999999999996]
["FDLSF-CPS-052-2022",2022,"FDLSF-CD-053-2022","FDLSF-CPS-052-2022","Contratos de prestación de servicios profesionales y de apoyo a la gestión","Contratación directa","Prestación de servicios profesionales y de apoyo a la gestión, o para la ejecución de trabajos artísticos que sólo puedan encomendarse a determinadas personas naturales"," PRESTAR SERVICIOS DE APOYO PARA LA GESTIÓN LOCAL Y TERRITORIAL EN LOS TEMAS DE SEGURIDAD Y CONVIVENCIA CIUDADANA. ","Inversión","Un nuevo contrato social y ambiental para la Bogotá del Siglo XXI",43,{"$f":"IF(ISERROR(VLOOKUP(K65,Proposito_programa!$C$2:$E$59,2,FALSE)),\" \",VLOOKUP(K65,Proposito_programa!$C$2:$E$59,2,FALSE))","v":"Cultura ciudadana para la confianza, la convivencia y la participación desde la vida cotidiana"},{"$f":"IF(ISERROR(VLOOKUP(K65,Proposito_programa!$C$2:$E$59,3,FALSE)),\" \",VLOOKUP(K65,Proposito_programa!$C$2:$E$59,3,FALSE))","v":"Propósito 3: Inspirar confianza y legitimidad para vivir sin miedo y ser epicentro de cultura ciudadana, paz y reconciliación"},2128,1,79772071,"ELKIN JOSE SIERRA BRACHO","Persona Natural",null,null,null,null,25850000,null,1,2350000,28200000,24126667,"2022-01-21","2022-01-23","2023-01-22",11,1,30,null,null,null,null,"Terminado",0.85555556737588656]
["FDLSF-CPS-053-2022",2022,"FDLSF-CD-053-2022","FDLSF-CPS-053-2022","Contratos de prestación de servicios profesionales y de apoyo a la gestión","Contratación directa","Prestación de servicios profesionales y de apoyo a la gestión, o para la ejecución de trabajos artísticos que sólo puedan encomendarse a determinadas personas naturales","PRESTAR SERVICIOS DE APOYO PARA LA GESTIÓN LOCAL Y TERRITORIAL EN LOS TEMAS DE SEGURIDAD Y CONVIVENCIA CIUDADANA. ","Inversión","Un nuevo contrato social y ambiental para la Bogotá del Siglo XXI",43,{"$f":"IF(ISERROR(VLOOKUP(K66,Proposito_programa!$C$2:$E$59,2,FALSE)),\" \",VLOOKUP(K66,Proposito_programa!$C$2:$E$59,2,FALSE))","v":"Cultura ciudadana para la confianza, la convivencia y la participación desde la vida cotidiana"},{"$f":"IF(ISERROR(VLOOKUP(K66,Proposito_programa!$C$2:$E$59,3,FALSE)),\" \",VLOOKUP(K66,Proposito_programa!$C$2:$E$59,3,FALSE))","v":"Propósito 3: Inspirar confianza y legitimidad para vivir sin miedo y ser epicentro de cultura ciudadana, paz y reconciliación"},2128,1,79765033,"DANIEL FELIPE PEÑA SANCHEZ","Persona Natural",null,null,null,null,25850000,null,null,0,25850000,24126667,"2022-01-21","2022-01-23","2022-12-22",11,0,0,null,null,null,null,"Terminado",0.93333334622823982]
["FDLSF-CPS-054-2022",2022,"FDLSF-CD-053-2022","FDLSF-CPS-054-2022","Contratos de prestación de servicios profesionales y de apoyo a la gestión","Contratación directa","Prestación de servicios profesionales y de apoyo a la gestión, o para la ejecución de trabajos artísticos que sólo puedan encomendarse a determinadas personas naturales"," PRESTAR SERVICIOS DE APOYO PARA LA GESTIÓN LOCAL Y TERRITORIAL EN LOS TEMAS DE SEGURIDAD Y CONVIVENCIA CIUDADANA. ","Inversión","Un nuevo contrato social y ambiental para la Bogotá del Siglo XXI",43,{"$f":"IF(ISERROR(VLOOKUP(K67,Proposito_programa!$C$2:$E$59,2,FALSE)),\" \",VLOOKUP(K67,Proposito_programa!$C$2:$E$59,2,FALSE))","v":"Cultura ciudadana para la confianza, la convivencia y la participación desde la vida cotidiana"},{"$f":"IF(ISERROR(VLOOKUP(K67,Proposito_programa!$C$2:$E$59,3,FALSE)),\" \",VLOOKUP(K67,Proposito_programa!$C$2:$E$59,3,FALSE))","v":"Propósito 3: Inspirar confianza y legitimidad para vivir sin miedo y ser epicentro de cultura ciudadana, paz y reconciliación"},2128,1,64571691,"JOHANNA IBET GARAY ALVAREZ","Persona Natural",null,null,null,null,25850000,null,1,2350000,28200000,24048333,"2022-01-21","2022-01-24","2023-01-23",11,1,30,null,null,null,null,"Terminado",0.85277776595744681]
["FDLSF-CPS-055-2022",2022,"FDLSF-CD-053-2022","FDLSF-CPS-055-2022","Contratos de prestación de servicios profesionales y de apoyo a la gestión","Contratación directa","Prestación de servicios profesionales y de apoyo a la gestión, o para la ejecución de trabajos artísticos que sólo puedan encomendarse a determinadas personas naturales"," PRESTAR SERVICIOS DE APOYO PARA LA GESTIÓN LOCAL Y TERRITORIAL EN LOS TEMAS DE SEGURIDAD Y CONVIVENCIA CIUDADANA. ","Inversión","Un nuevo contrato social y ambiental para la Bogotá del Siglo XXI",43,{"$f":"IF(ISERROR(VLOOKUP(K68,Proposito_programa!$C$2:$E$59,2,FALSE)),\" \",VLOOKUP(K68,Proposito_programa!$C$2:$E$59,2,FALSE))","v":"Cultura ciudadana para la confianza, la convivencia y la participación desde la vida cotidiana"},{"$f":"IF(ISERROR(VLOOKUP(K68,Proposito_programa!$C$2:$E$59,3,FALSE)),\" \",VLOOKUP(K68,Proposito_programa!$C$2:$E$59,3,FALSE))","v":"Propósito 3: Inspirar confianza y legitimidad para vivir sin miedo y ser epicentro de cultura ciudadana, paz y reconciliación"},2128,1,1007403672,"JOSE WILMAR URBANO SIBOCHE ","Persona Natural",null,null,null,null,25850000,null,null,0,25850000,24126667,"2022-01-20","2022-01-23","2022-12-22",11,0,0,null,null,null,null,"Terminado",0.93333334622823982]
["FDLSF-CPS-056-2022",2022,"FDLSF-CD-053-2022","FDLSF-CPS-056-2022","Contratos de prestación de servicios profesionales y de apoyo a la gestión","Contratación directa","Prestación de servicios profesionales y de apoyo a la gestión, o para la ejecución de trabajos artísticos que sólo puedan encomendarse a determinadas personas naturales"," PRESTAR SERVICIOS DE APOYO PARA LA GESTIÓN LOCAL Y TERRITORIAL EN LOS TEMAS DE SEGURIDAD Y CONVIVENCIA CIUDADANA. ","Inversión","Un nuevo contrato social y ambiental para la Bogotá del Siglo XXI",43,{"$f":"IF(ISERROR(VLOOKUP(K69,Proposito_programa!$C$2:$E$59,2,FALSE)),\" \",VLOOKUP(K69,Proposito_programa!$C$2:$E$59,2,FALSE))","v":"Cultura ciudadana para la confianza, la convivencia y la participación desde la vida cotidiana"},{"$f":"IF(ISERROR(VLOOKUP(K69,Proposito_programa!$C$2:$E$59,3,FALSE)),\" \",VLOOKUP(K69,Proposito_programa!$C$2:$E$59,3,FALSE))","v":"Propósito 3: Inspirar confianza y legitimidad para vivir sin miedo y ser epicentro de cultura ciudadana, paz y reconciliación"},2128,1,79994158,"NELSON ENRIQUE FANDIÑO SUAREZ","Persona Natural",null,null,null,null,25850000,null,1,2350000,28200000,23891667,"2022-01-20","2022-01-26","2023-01-25",11,1,30,null,null,null,null,"Terminado",0.84722223404255315]
["FDLSF-CPS-057-2022",2022,"FDLSF-CD-053-2022","FDLSF-CPS-057-2022","Contratos de prestación de servicios profesionales y de apoyo a la gestión","Contratación directa","Prestación de servicios profesionales y de apoyo a la gestión, o para la ejecución de trabajos artísticos que sólo puedan encomendarse a determinadas personas naturales"," PRESTAR SERVICIOS DE APOYO PARA LA GESTIÓN LOCAL Y TERRITORIAL EN LOS TEMAS DE SEGURIDAD Y CONVIVENCIA CIUDADANA. ","Inversión","Un nuevo contrato social y ambiental para la Bogotá del Siglo XXI",43,{"$f":"IF(ISERROR(VLOOKUP(K70,Proposito_programa!$C$2:$E$59,2,FALSE)),\" \",VLOOKUP(K70,Proposito_programa!$C$2:$E$59,2,FALSE))","v":"Cultura ciudadana para la confianza, la convivencia y la participación desde la vida cotidiana"},{"$f":"IF(ISERROR(VLOOKUP(K70,Proposito_programa!$C$2:$E$59,3,FALSE)),\" \",VLOOKUP(K70,Proposito_programa!$C$2:$E$59,3,FALSE))","v":"Propósito 3: Inspirar confianza y legitimidad para vivir sin miedo y ser epicentro de cultura ciudadana, paz y reconciliación"},2128,1,59687264,"DIANA RAQUEL CASTILLO","Persona Natural",null,null,null,null,25850000,null,null,0,25850000,23891667,"2022-01-21","2022-01-26","2022-12-25",11,0,0,null,null,null,null,"Terminado",0.92424243713733079]
["FDLSF-CPS-058-2022",2022,"FDLSF-CD-053-2022","FDLSF-CPS-058-2022","Contratos de prestación de servicios profesionales y de apoyo a la gestión","Contratación directa","Prestación de servicios profesionales y de apoyo a la gestión, o para la ejecución de trabajos artísticos que sólo puedan encomendarse a determinadas personas naturales"," PRESTAR SERVICIOS DE APOYO PARA LA GESTIÓN LOCAL Y TERRITORIAL EN LOS TEMAS DE SEGURIDAD Y CONVIVENCIA CIUDADANA. ","Inversión","Un nuevo contrato social y ambiental para la Bogotá del Siglo XXI",43,{"$f":"IF(ISERROR(VLOOKUP(K71,Proposito_programa!$C$2:$E$59,2,FALSE)),\" \",VLOOKUP(K71,Proposito_programa!$C$2:$E$59,2,FALSE))","v":"Cultura ciudadana para la confianza, la convivencia y la participación desde la vida cotidiana"},{"$f":"IF(ISERROR(VLOOKUP(K71,Proposito_programa!$C$2:$E$59,3,FALSE)),\" \",VLOOKUP(K71,Proposito_programa!$C$2:$E$59,3,FALSE))","v":"Propósito 3: Inspirar confianza y legitimidad para vivir sin miedo y ser epicentro de cultura ciudadana, paz y reconciliación"},2128,1,1005483879,"KAREN JULIETH HERREÑO RODRIGUEZ","Persona Natural",null,null,null,null,25850000,null,null,0,25850000,22011667,"2022-01-27","2022-01-29","2022-12-28",11,0,0,1005483879,"KAREN JULIETH HERREÑO RODRIGUEZ","2022-11-10",null,"Terminado",0.85151516441005803]
["FDLSF-CPS-059-2022",2022,"FDLSF-CD-053-2022","FDLSF-CPS-059-2022","Contratos de prestación de servicios profesionales y de apoyo a la gestión","Contratación directa","Prestación de servicios profesionales y de apoyo a la gestión, o para la ejecución de trabajos artísticos que sólo puedan encomendarse a determinadas personas naturales"," PRESTAR SERVICIOS DE APOYO PARA LA GESTIÓN LOCAL Y TERRITORIAL EN LOS TEMAS DE SEGURIDAD Y CONVIVENCIA CIUDADANA. ","Inversión","Un nuevo contrato social y ambiental para la Bogotá del Siglo XXI",43,{"$f":"IF(ISERROR(VLOOKUP(K72,Proposito_programa!$C$2:$E$59,2,FALSE)),\" \",VLOOKUP(K72,Proposito_programa!$C$2:$E$59,2,FALSE))","v":"Cultura ciudadana para la confianza, la convivencia y la participación desde la vida cotidiana"},{"$f":"IF(ISERROR(VLOOKUP(K72,Proposito_programa!$C$2:$E$59,3,FALSE)),\" \",VLOOKUP(K72,Proposito_programa!$C$2:$E$59,3,FALSE))","v":"Propósito 3: Inspirar confianza y legitimidad para vivir sin miedo y ser epicentro de cultura ciudadana, paz y reconciliación"},2128,1,52445223,"DIANA CONSUELO MORALES RAMOS","Persona Natural",null,null,null,null,25850000,null,null,0,25850000,23891667,"2022-01-21","2022-01-26","2022-12-25",11,0,0,null,null,null,null,"Terminado",0.92424243713733079]
["FDLSF-CPS-060-2022",2022,"FDLSF-CD-054-2022","FDLSF-CPS-060-2022","Contratos de prestación de servicios profesionales y de apoyo a la gestión","Contratación directa","Prestación de servicios profesionales y de apoyo a la gestión, o para la ejecución de trabajos artísticos que sólo puedan encomendarse a determinadas personas naturales","APOYAR TÉCNICAMENTE LAS DISTINTAS ETAPAS DE LOS PROCESO DE COMPETENCIA DE LAS INSPECCIONES DE POLICÍA DE LA LOCALIDAD DE SANTA FE, SEGÚN REPARTO","Inversión","Un nuevo contrato social y ambiental para la Bogotá del Siglo XXI",57,{"$f":"IF(ISERROR(VLOOKUP(K73,Proposito_programa!$C$2:$E$59,2,FALSE)),\" \",VLOOKUP(K73,Proposito_programa!$C$2:$E$59,2,FALSE))","v":"Gestión pública local"},{"$f":"IF(ISERROR(VLOOKUP(K73,Proposito_programa!$C$2:$E$59,3,FALSE)),\" \",VLOOKUP(K73,Proposito_programa!$C$2:$E$59,3,FALSE))","v":"Propósito 5: Construir Bogotá - Región con gobierno abierto, transparente y ciudadanía consciente"},2105,1,52475976,"ANGELA PATRICIA GALINDO CARO","Persona Natural",null,null,null,null,42700000,null,null,0,42700000,42700000,"2022-01-19","2022-01-20","2022-08-19",7,0,0,null,null,null,null,"Terminado",1]
["FDLSF-CPS-061-2022",2022,"FDLSF-CD-024-2022","FDLSF-CPS-061-2022","Contratos de prestación de servicios profesionales y de apoyo a la gestión","Contratación directa","Prestación de servicios profesionales y de apoyo a la gestión, o para la ejecución de trabajos artísticos que sólo puedan encomendarse a determinadas personas naturales","PRESTAR SERVICIOS DE APOYO TÉCNICO AL CONSEJO LOCAL DE GESTIÓN DEL RIESGO Y CAMBIO CLIMATICO DE LA ALCALDIA LOCAL DE SANTA FE ","Inversión","Un nuevo contrato social y ambiental para la Bogotá del Siglo XXI",57,{"$f":"IF(ISERROR(VLOOKUP(K74,Proposito_programa!$C$2:$E$59,2,FALSE)),\" \",VLOOKUP(K74,Proposito_programa!$C$2:$E$59,2,FALSE))","v":"Gestión pública local"},{"$f":"IF(ISERROR(VLOOKUP(K74,Proposito_programa!$C$2:$E$59,3,FALSE)),\" \",VLOOKUP(K74,Proposito_programa!$C$2:$E$59,3,FALSE))","v":"Propósito 5: Construir Bogotá - Región con gobierno abierto, transparente y ciudadanía consciente"},2105,1,1019062593,"MISAEL EDUARDO SANDOVAL CHAPARRO","Persona Natural",null,null,null,null,40260000,null,1,1586000,41846000,38186000,"2022-01-17","2022-01-18","2022-12-21",11,0,4,null,null,null,null,"Terminado",0.91253644314868809]
["FDLSF-CPS-062-2022",2022,"FDLSF-CD-073-2022","FDLSF-CPS-062-2022","Contratos de prestación de servicios profesionales y de apoyo a la gestión","Contratación directa","Prestación de servicios profesionales y de apoyo a la gestión, o para la ejecución de trabajos artísticos que sólo puedan encomendarse a determinadas personas naturales","APOYAR AL ALCALDE LOCAL EN LA FORMULACIÓN, SEGUIMIENTO E IMPLEMENTACIÓN DE LA ESTRATEGIA LOCAL PARA LA TERMINACIÓN JURÍDICA O INACTIVACIÓN DE LAS ACTUACIONES ADMINISTRATIVAS QUE CURSAN EN LA ALCALDÍA LOCAL","Inversión","Un nuevo contrato social y ambiental para la Bogotá del Siglo XXI",57,{"$f":"IF(ISERROR(VLOOKUP(K75,Proposito_programa!$C$2:$E$59,2,FALSE)),\" \",VLOOKUP(K75,Proposito_programa!$C$2:$E$59,2,FALSE))","v":"Gestión pública local"},{"$f":"IF(ISERROR(VLOOKUP(K75,Proposito_programa!$C$2:$E$59,3,FALSE)),\" \",VLOOKUP(K75,Proposito_programa!$C$2:$E$59,3,FALSE))","v":"Propósito 5: Construir Bogotá - Región con gobierno abierto, transparente y ciudadanía consciente"},2105,1,52426849,"DIANA ALEJANDRA LEGUIZAMON TRUJILLO","Persona Natural",null,null,null,null,52920000,null,null,0,52920000,52920000,"2022-01-18","2022-01-19","2022-08-18",7,0,0,null,null,null,null,"Terminado",1]
["FDLSF-CPS-063-2022",2022,"FDLSF-CD-074-2022","FDLSF-CPS-063-2022","Contratos de prestación de servicios profesionales y de apoyo a la gestión","Contratación directa","Prestación de servicios profesionales y de apoyo a la gestión, o para la ejecución de trabajos artísticos que sólo puedan encomendarse a determinadas personas naturales","PRESTAR SERVICIOS PROFESIONALES EN EL ÁREA DE GESTIÓN DEL DESARROLLO LOCAL EN LOS TEMAS RELACIONADOS CON PRESUPUESTO DE LA ALCALDÍA LOCAL DE SANTA FE.","Inversión","Un nuevo contrato social y ambiental para la Bogotá del Siglo XXI",57,{"$f":"IF(ISERROR(VLOOKUP(K76,Proposito_programa!$C$2:$E$59,2,FALSE)),\" \",VLOOKUP(K76,Proposito_programa!$C$2:$E$59,2,FALSE))","v":"Gestión pública local"},{"$f":"IF(ISERROR(VLOOKUP(K76,Proposito_programa!$C$2:$E$59,3,FALSE)),\" \",VLOOKUP(K76,Proposito_programa!$C$2:$E$59,3,FALSE))","v":"Propósito 5: Construir Bogotá - Región con gobierno abierto, transparente y ciudadanía consciente"},2105,1,1015440025,"YUDY LORENA BARRERA BAQUERO","Persona Natural",null,null,null,null,42700000,null,null,0,42700000,42700000,"2022-01-18","2022-01-19","2022-08-18",7,0,0,null,null,null,null,"Terminado",1]
["FDLSF-CPS-064-2022",2022,"FDLSF-CD-064-2022","FDLSF-CPS-064-2022","Contratos de prestación de servicios profesionales y de apoyo a la gestión","Contratación directa","Prestación de servicios profesionales y de apoyo a la gestión, o para la ejecución de trabajos artísticos que sólo puedan encomendarse a determinadas personas naturales","PRESTAR APOYO AL ÁREA GESTIÓN POLICÍVA Y ÁREA DE GESTIÓN DE DESARROLLO LOCAL EN LA CONDUCCIÓN DEL PARQUE AUTOMOTOR DEL FDLSF QUE LE SEA ASIGNADO","Inversión","Un nuevo contrato social y ambiental para la Bogotá del Siglo XXI",57,{"$f":"IF(ISERROR(VLOOKUP(K77,Proposito_programa!$C$2:$E$59,2,FALSE)),\" \",VLOOKUP(K77,Proposito_programa!$C$2:$E$59,2,FALSE))","v":"Gestión pública local"},{"$f":"IF(ISERROR(VLOOKUP(K77,Proposito_programa!$C$2:$E$59,3,FALSE)),\" \",VLOOKUP(K77,Proposito_programa!$C$2:$E$59,3,FALSE))","v":"Propósito 5: Construir Bogotá - Región con gobierno abierto, transparente y ciudadanía consciente"},2105,1,79912636,"FREDDY GIOVANNY SALAMANCA RAMÍREZ","Persona Natural",null,null,null,null,18900000,null,null,0,18900000,18900000,"2022-01-19","2022-01-20","2022-08-28",7,0,0,null,null,null,null,"Terminado",1]
["FDLSF-CPS-065-2022",2022,"FDLSF-CD-014-2022","FDLSF-CPS-065-2022","Contratos de prestación de servicios profesionales y de apoyo a la gestión","Contratación directa","Prestación de servicios profesionales y de apoyo a la gestión, o para la ejecución de trabajos artísticos que sólo puedan encomendarse a determinadas personas naturales","PRESTAR SERVICOS TÉCNICOS EN LOS ASUNTOS RELACIONADOS CON LOS TEMAS DE PARTICIPACIÓN Y RELACIONES COMUNITARIAS DE LA ALCALDIA LOCAL DE SANTA FE","Inversión","Un nuevo contrato social y ambiental para la Bogotá del Siglo XXI",57,{"$f":"IF(ISERROR(VLOOKUP(K78,Proposito_programa!$C$2:$E$59,2,FALSE)),\" \",VLOOKUP(K78,Proposito_programa!$C$2:$E$59,2,FALSE))","v":"Gestión pública local"},{"$f":"IF(ISERROR(VLOOKUP(K78,Proposito_programa!$C$2:$E$59,3,FALSE)),\" \",VLOOKUP(K78,Proposito_programa!$C$2:$E$59,3,FALSE))","v":"Propósito 5: Construir Bogotá - Región con gobierno abierto, transparente y ciudadanía consciente"},2105,1,1033759713,"LAURA CATALINA MORENO MUÑOZ","Persona Natural",null,null,null,null,25620000,null,null,0,25620000,23424000,"2022-01-19","2022-01-19","2022-08-18",7,0,0,null,null,null,null,"Terminado",0.91428571428571426]
["FDLSF-CPS-066-2022",2022,"FDLSF-CD-027-2022","FDLSF-CPS-066-2022","Contratos de prestación de servicios profesionales y de apoyo a la gestión","Contratación directa","Prestación de servicios profesionales y de apoyo a la gestión, o para la ejecución de trabajos artísticos que sólo puedan encomendarse a determinadas personas naturales","PRESTAR SERVICIOS DE APOYO ADMINISTRATIVO Y ASISTENCIAL A LA JUNTA ADMINISTRADORA LOCAL DE SANTA FE","Inversión","Un nuevo contrato social y ambiental para la Bogotá del Siglo XXI",57,{"$f":"IF(ISERROR(VLOOKUP(K79,Proposito_programa!$C$2:$E$59,2,FALSE)),\" \",VLOOKUP(K79,Proposito_programa!$C$2:$E$59,2,FALSE))","v":"Gestión pública local"},{"$f":"IF(ISERROR(VLOOKUP(K79,Proposito_programa!$C$2:$E$59,3,FALSE)),\" \",VLOOKUP(K79,Proposito_programa!$C$2:$E$59,3,FALSE))","v":"Propósito 5: Construir Bogotá - Región con gobierno abierto, transparente y ciudadanía consciente"},2105,1,1010187248,"JULIETH JOHANNA SILVA AREVALO","Persona Natural",null,null,null,null,16450000,null,null,0,16450000,16450000,"2022-01-18","2022-01-21","2022-08-20",7,0,0,null,null,null,null,"Terminado",{"$f":"IF(ISERROR(AB79/AA79),\"-\",(AB79/AA79))","v":1}]
["FDLSF-CPS-067-2022",2022,"FDLSF-CD-027-2022","FDLSF-CPS-067-2022","Contratos de prestación de servicios profesionales y de apoyo a la gestión","Contratación directa","Prestación de servicios profesionales y de apoyo a la gestión, o para la ejecución de trabajos artísticos que sólo puedan encomendarse a determinadas personas naturales","PRESTAR SERVICIOS DE APOYO ADMINISTRATIVO Y ASISTENCIAL A LA JUNTA ADMINISTRADORA LOCAL DE SANTA FE.","Inversión","Un nuevo contrato social y ambiental para la Bogotá del Siglo XXI",57,{"$f":"IF(ISERROR(VLOOKUP(K80,Proposito_programa!$C$2:$E$59,2,FALSE)),\" \",VLOOKUP(K80,Proposito_programa!$C$2:$E$59,2,FALSE))","v":"Gestión pública local"},{"$f":"IF(ISERROR(VLOOKUP(K80,Proposito_programa!$C$2:$E$59,3,FALSE)),\" \",VLOOKUP(K80,Proposito_programa!$C$2:$E$59,3,FALSE))","v":"Propósito 5: Construir Bogotá - Región con gobierno abierto, transparente y ciudadanía consciente"},2105,1,1026282016,"NATALIA MATEUS CAMARGO","Persona Natural",null,null,null,null,16450000,null,null,0,16450000,16450000,"2022-01-18","2022-01-21","2022-08-20",7,0,0,null,null,null,null,"Terminado",1]
["FDLSF-CPS-068-2022",2022,"FDLSF-CD-071-2022","FDLSF-CPS-068-2022","Contratos de prestación de servicios profesionales y de apoyo a la gestión","Contratación directa","Prestación de servicios profesionales y de apoyo a la gestión, o para la ejecución de trabajos artísticos que sólo puedan encomendarse a determinadas personas naturales"," PRESTAR SERVICIOS PROFESIONALES PARA LA ESTRUCTURACIÓN, VIABILIZACIÓN, EVALUACIÓN Y SEGUIMIENTO DE LOS PROYECTOS RELACIONADOS CON LA LINEA DE INVERSIÓN AMBIENTAL DEL PLAN DE DESARROLLO LOCAL DE SANTA FE. ","Inversión","Un nuevo contrato social y ambiental para la Bogotá del Siglo XXI",57,{"$f":"IF(ISERROR(VLOOKUP(K81,Proposito_programa!$C$2:$E$59,2,FALSE)),\" \",VLOOKUP(K81,Proposito_programa!$C$2:$E$59,2,FALSE))","v":"Gestión pública local"},{"$f":"IF(ISERROR(VLOOKUP(K81,Proposito_programa!$C$2:$E$59,3,FALSE)),\" \",VLOOKUP(K81,Proposito_programa!$C$2:$E$59,3,FALSE))","v":"Propósito 5: Construir Bogotá - Región con gobierno abierto, transparente y ciudadanía consciente"},2105,1,53030141,"DIANA MARCELA RUBIO ACOSTA","Persona Natural",null,null,null,null,33600000,null,null,0,33600000,33600000,"2022-01-19","2022-01-21","2022-08-20",7,0,0,null,null,null,null,"Terminado",1]
["FDLSF-CPS-069-2022",2022,"FDLSF-CD-072-2022","FDLSF-CPS-069-2022","Contratos de prestación de servicios profesionales y de apoyo a la gestión","Contratación directa","Prestación de servicios profesionales y de apoyo a la gestión, o para la ejecución de trabajos artísticos que sólo puedan encomendarse a determinadas personas naturales","PRESTAR SERVICIOS PROFESIONALES PARA EL ACOMPAÑAMIENTO EN EL DESARROLLO Y LA IMPLEMENTACIÓN DE LAS DIFERENTES ESTRATEGIAS PARA LA REACTIVACIÓN ECONÓMICA LOCAL EN EL MARCO DEL EMPRENDIMIENTO LOCAL Y DE FORTALECIMIENTO EMPRESARIAL","Inversión","Un nuevo contrato social y ambiental para la Bogotá del Siglo XXI",6,{"$f":"IF(ISERROR(VLOOKUP(K82,Proposito_programa!$C$2:$E$59,2,FALSE)),\" \",VLOOKUP(K82,Proposito_programa!$C$2:$E$59,2,FALSE))","v":"Sistema Distrital de Cuidado"},{"$f":"IF(ISERROR(VLOOKUP(K82,Proposito_programa!$C$2:$E$59,3,FALSE)),\" \",VLOOKUP(K82,Proposito_programa!$C$2:$E$59,3,FALSE))","v":"Propósito 1: Hacer un nuevo contrato social para incrementar la inclusión social, productiva y política"},2188,1,52786358,"DIANA PATRICIA NOGUERA SIMIJACA","Persona Natural",null,null,null,null,67100000,null,1,6100000,73200000,63033333,"2022-01-19","2022-01-21","2022-12-20",11,0,0,null,null,null,null,"Terminado",0.8611111065573771]
["FDLSF-CPS-070-2022",2022,"FDLSF-CD-056-2022","FDLSF-CPS-070-2022","Contratos de prestación de servicios profesionales y de apoyo a la gestión","Contratación directa","Prestación de servicios profesionales y de apoyo a la gestión, o para la ejecución de trabajos artísticos que sólo puedan encomendarse a determinadas personas naturales","PRESTAR SUS SERVICIOS PROFESIONALES PARA LA ESTRUCTURACIÓN, VIABILIZACIÓN, EVALUACIÓN Y SEGUIMIENTO DE LOS PROYECTOS DEL PRESUPUESTO DEL FONDO DE DESARROLLO LOCAL DE SANTA FE QUE LE SEAN ASIGNADOS","Inversión","Un nuevo contrato social y ambiental para la Bogotá del Siglo XXI",57,{"$f":"IF(ISERROR(VLOOKUP(K83,Proposito_programa!$C$2:$E$59,2,FALSE)),\" \",VLOOKUP(K83,Proposito_programa!$C$2:$E$59,2,FALSE))","v":"Gestión pública local"},{"$f":"IF(ISERROR(VLOOKUP(K83,Proposito_programa!$C$2:$E$59,3,FALSE)),\" \",VLOOKUP(K83,Proposito_programa!$C$2:$E$59,3,FALSE))","v":"Propósito 5: Construir Bogotá - Región con gobierno abierto, transparente y ciudadanía consciente"},2105,1,80166444,"YERNEY ROLANDO RODRIGUEZ AVILA","Persona Natural",null,null,null,null,52800000,-23520000,null,0,29280000,29280000,"2022-01-18","2022-01-19","2022-12-18",11,0,0,80166444,"YERNEY ROLANDO RODRIGUEZ AVILA","2022-04-08",null,"Terminado",1]
["FDLSF-CPS-071-2022",2022,"FDLSF-CD-042-2022","FDLSF-CPS-071-2022","Contratos de prestación de servicios profesionales y de apoyo a la gestión","Contratación directa","Prestación de servicios profesionales y de apoyo a la gestión, o para la ejecución de trabajos artísticos que sólo puedan encomendarse a determinadas personas naturales","PRESTAR LOS SERVICIOS PROFESIONALES PARA LA OPERACIÓN, PRESTACION, SEGUIMIENTO Y CUMPLIMIENTO DE LOS PROCEDIMIENTOS ADMINISTRATIVOS, OPERATIVOS Y PROGRAMÁTICOS DEL SERVICIO SOCIAL APOYO ECONÓMICO TIPO C, QUE CONTRIBUYAN A LA GARANTÍA DE LOS DERECHOS DE LA POBLACIÓN MAYOR EN EL MARCO DE LA POLÍTICA PÚBLICA SOCIAL PARA EL ENVEJECIMIENTO Y LA VEJEZ EN EL DISTRITO CAPITAL A CARGO DE LA ALCALDÍA LOCAL","Inversión","Un nuevo contrato social y ambiental para la Bogotá del Siglo XXI",1,{"$f":"IF(ISERROR(VLOOKUP(K84,Proposito_programa!$C$2:$E$59,2,FALSE)),\" \",VLOOKUP(K84,Proposito_programa!$C$2:$E$59,2,FALSE))","v":"Subsidios y transferencias para la equidad"},{"$f":"IF(ISERROR(VLOOKUP(K84,Proposito_programa!$C$2:$E$59,3,FALSE)),\" \",VLOOKUP(K84,Proposito_programa!$C$2:$E$59,3,FALSE))","v":"Propósito 1: Hacer un nuevo contrato social para incrementar la inclusión social, productiva y política"},2081,1,1136882124,"LAURA JULIETH ROJAS AYERBE","Persona Natural",null,null,null,null,56320000,null,1,3242666,{"$f":"+W84+X84+Z84","v":59562666},52906666,"2022-01-19","2022-01-21","2023-01-09",11,0,19,null,null,null,null,"Terminado",0.88825214774637518]
["FDLSF-CPS-072-2022",2022,"FDLSF-CD-023-2022","FDLSF-CPS-072-2022","Contratos de prestación de servicios profesionales y de apoyo a la gestión","Contratación directa","Prestación de servicios profesionales y de apoyo a la gestión, o para la ejecución de trabajos artísticos que sólo puedan encomendarse a determinadas personas naturales","PRESTAR LOS SERVICIOS DE APOYO AL ÁREA DE GESTIÓN DEL DESARROLLO LOCAL, EN LO RELACIONADO CON LAS ACTIVIDADES DEL ALMACÉN DE LA ALCALDÍA LOCAL DE SANTA FE","Inversión","Un nuevo contrato social y ambiental para la Bogotá del Siglo XXI",57,{"$f":"IF(ISERROR(VLOOKUP(K85,Proposito_programa!$C$2:$E$59,2,FALSE)),\" \",VLOOKUP(K85,Proposito_programa!$C$2:$E$59,2,FALSE))","v":"Gestión pública local"},{"$f":"IF(ISERROR(VLOOKUP(K85,Proposito_programa!$C$2:$E$59,3,FALSE)),\" \",VLOOKUP(K85,Proposito_programa!$C$2:$E$59,3,FALSE))","v":"Propósito 5: Construir Bogotá - Región con gobierno abierto, transparente y ciudadanía consciente"},2105,1,79323784,"CESAR MAURICIO PATIÑO CADENA","Persona Natural",null,null,null,null,16450000,null,null,0,16450000,16450000,"2022-01-19","2022-01-21","2022-08-20",7,0,0,null,null,null,null,"Terminado",1]
["FDLSF-CPS-073-2022",2022,"FDLSF-CD-067-2022","FDLSF-CPS-073-2022","Contratos de prestación de servicios profesionales y de apoyo a la gestión","Contratación directa","Prestación de servicios profesionales y de apoyo a la gestión, o para la ejecución de trabajos artísticos que sólo puedan encomendarse a determinadas personas naturales","PRESTAR SERVICIOS PROFESIONALES EN EL ÁREA DE GESTIÓN DE DESARROLLO LOCAL PARA LA PLANEACIÓN, ESTRUCTURACIÓN, VIABILIZACIÓN, EVALUACIÓN Y SEGUIMIENTO DE LOS PROYECTOS DE INVERSION Y FUNCIONAMIENTO DE LA ALCALDIA LOCAL DE SANTA FE QUE LE SEAN ASIGNADOS","Inversión","Un nuevo contrato social y ambiental para la Bogotá del Siglo XXI",57,{"$f":"IF(ISERROR(VLOOKUP(K86,Proposito_programa!$C$2:$E$59,2,FALSE)),\" \",VLOOKUP(K86,Proposito_programa!$C$2:$E$59,2,FALSE))","v":"Gestión pública local"},{"$f":"IF(ISERROR(VLOOKUP(K86,Proposito_programa!$C$2:$E$59,3,FALSE)),\" \",VLOOKUP(K86,Proposito_programa!$C$2:$E$59,3,FALSE))","v":"Propósito 5: Construir Bogotá - Región con gobierno abierto, transparente y ciudadanía consciente"},2105,1,53116983,"JEIMY TATIANA ESCOBAR ESPINOSA","Persona Natural",null,null,null,null,67100000,null,null,0,67100000,56933333,"2022-01-20","2022-01-21","2022-12-20",11,0,0,null,null,null,null,"Terminado",0.8484848435171386]
["FDLSF-CPS-074-2022",2022,"FDLSF-CD-026-2022","FDLSF-CPS-074-2022","Contratos de prestación de servicios profesionales y de apoyo a la gestión","Contratación directa","Prestación de servicios profesionales y de apoyo a la gestión, o para la ejecución de trabajos artísticos que sólo puedan encomendarse a determinadas personas naturales","PRESTAR SERVICIOS PROFESIONALES AL ÁREA DE GESTIÓN DEL DESARROLLO LOCAL, REALIZANDO ACTIVIDADES INHERENTES AL CONSEJO LOCAL DE GESTIÓN DEL RIESGO, DE LA LOCALIDAD DE SANTA FE ","Inversión","Un nuevo contrato social y ambiental para la Bogotá del Siglo XXI",57,{"$f":"IF(ISERROR(VLOOKUP(K87,Proposito_programa!$C$2:$E$59,2,FALSE)),\" \",VLOOKUP(K87,Proposito_programa!$C$2:$E$59,2,FALSE))","v":"Gestión pública local"},{"$f":"IF(ISERROR(VLOOKUP(K87,Proposito_programa!$C$2:$E$59,3,FALSE)),\" \",VLOOKUP(K87,Proposito_programa!$C$2:$E$59,3,FALSE))","v":"Propósito 5: Construir Bogotá - Región con gobierno abierto, transparente y ciudadanía consciente"},2105,1,52790286,"JESYCA ROSY ORJUELA AYA","Persona Natural",null,null,null,null,42700000,null,null,0,42700000,42700000,"2022-01-20","2022-01-21","2022-08-20",7,0,0,null,null,null,null,"Terminado",1]
["FDLSF-CPS-075-2022",2022,"FDLSF-CD-033-2022","FDLSF-CPS-075-2022","Contratos de prestación de servicios profesionales y de apoyo a la gestión","Contratación directa","Prestación de servicios profesionales y de apoyo a la gestión, o para la ejecución de trabajos artísticos que sólo puedan encomendarse a determinadas personas naturales","PRESTAR SERVICIOS PROFESIONALES PARA ADELANTAR TODAS LAS ACTIVIDADES JURÍDICAS CON OCASIÒN DE LOS DESPACHOS COMISORIOS DEL FDLSF","Inversión","Un nuevo contrato social y ambiental para la Bogotá del Siglo XXI",57,{"$f":"IF(ISERROR(VLOOKUP(K88,Proposito_programa!$C$2:$E$59,2,FALSE)),\" \",VLOOKUP(K88,Proposito_programa!$C$2:$E$59,2,FALSE))","v":"Gestión pública local"},{"$f":"IF(ISERROR(VLOOKUP(K88,Proposito_programa!$C$2:$E$59,3,FALSE)),\" \",VLOOKUP(K88,Proposito_programa!$C$2:$E$59,3,FALSE))","v":"Propósito 5: Construir Bogotá - Región con gobierno abierto, transparente y ciudadanía consciente"},2105,1,79971582,"NELSON EDUARDO LINARES CONDE","Persona Natural",null,null,null,null,67100000,null,1,6100000,73200000,62220000,"2022-01-21","2022-01-25","2023-01-24",11,1,30,null,null,null,null,"Terminado",0.85]
["FDLSF-CPS-076-2022",2022,"FDLSF-CD-054-2022","FDLSF-CPS-076-2022","Contratos de prestación de servicios profesionales y de apoyo a la gestión","Contratación directa","Prestación de servicios profesionales y de apoyo a la gestión, o para la ejecución de trabajos artísticos que sólo puedan encomendarse a determinadas personas naturales","APOYAR TÉCNICAMENTE LAS DISTINTAS ETAPAS DE LOS PROCESO DE COMPETENCIA DE LAS INSPECCIONES DE POLICÍA DE LA LOCALIDAD DE SANTA FE, SEGÚN REPARTO","Inversión","Un nuevo contrato social y ambiental para la Bogotá del Siglo XXI",57,{"$f":"IF(ISERROR(VLOOKUP(K89,Proposito_programa!$C$2:$E$59,2,FALSE)),\" \",VLOOKUP(K89,Proposito_programa!$C$2:$E$59,2,FALSE))","v":"Gestión pública local"},{"$f":"IF(ISERROR(VLOOKUP(K89,Proposito_programa!$C$2:$E$59,3,FALSE)),\" \",VLOOKUP(K89,Proposito_programa!$C$2:$E$59,3,FALSE))","v":"Propósito 5: Construir Bogotá - Región con gobierno abierto, transparente y ciudadanía consciente"},2105,1,79938600,"IVAN ALBERTO TORRES PARGA","Persona Natural",null,null,null,null,42700000,null,null,0,42700000,40260000,"2022-01-25","2022-01-28","2022-08-27",7,0,0,79938600,"IVAN ALBERTO TORRES PARGA","2022-02-10",null,"Terminado",0.94285714285714284]
["FDLSF-CPS-077-2022",2022,"FDLSF-CD-075-2022","FDLSF-CPS-077-2022","Contratos de prestación de servicios profesionales y de apoyo a la gestión","Contratación directa","Prestación de servicios profesionales y de apoyo a la gestión, o para la ejecución de trabajos artísticos que sólo puedan encomendarse a determinadas personas naturales","APOYAR LA FORMULACIÓN, EJECUCIÓN, SEGUIMIENTO Y MEJORA CONTINUA DE LAS HERRAMIENTAS QUE CONFORMAN LA GESTIÓN AMBIENTAL INSTITUCIONAL DE LA ALCALDÍA LOCAL.","Inversión","Un nuevo contrato social y ambiental para la Bogotá del Siglo XXI",57,{"$f":"IF(ISERROR(VLOOKUP(K90,Proposito_programa!$C$2:$E$59,2,FALSE)),\" \",VLOOKUP(K90,Proposito_programa!$C$2:$E$59,2,FALSE))","v":"Gestión pública local"},{"$f":"IF(ISERROR(VLOOKUP(K90,Proposito_programa!$C$2:$E$59,3,FALSE)),\" \",VLOOKUP(K90,Proposito_programa!$C$2:$E$59,3,FALSE))","v":"Propósito 5: Construir Bogotá - Región con gobierno abierto, transparente y ciudadanía consciente"},2105,1,1016067742,"BRAYAN ESTHEP ROJAS MAHECHA ","Persona Natural",null,null,null,null,33600000,null,null,0,33600000,33600000,"2022-01-20","2022-01-21","2022-08-20",7,0,0,null,null,null,null,"Terminado",1]
["FDLSF-CPS-078-2022",2022,"FDLSF-CD-077-2022","FDLSF-CPS-078-2022","Contratos de prestación de servicios profesionales y de apoyo a la gestión","Contratación directa","Prestación de servicios profesionales y de apoyo a la gestión, o para la ejecución de trabajos artísticos que sólo puedan encomendarse a determinadas personas naturales","PRESTAR SUS SERVICIOS PROFESIONALES ESPECIALIZADOS PARA EL SEGUIMIENTO, FORTALECIMIENTO, OPTIMIZACIÓN DE LOS PROCESOS Y TRÁMITES INTERNOS. APOYAR EN EL DESPACHO EN TEMAS REFERENTES A LA PLANEACIÓN ESTRATÉGICA, IMPLEMENTACIÓN DE SISTEMAS DE ALERTAS TEMPRANAS Y SEGUIMIENTO DE LA INFORMACIÓN REGISTRADA EN LAS HERRAMIENTAS UTILIZADAS POR EL FONDO DE DESARROLLO LOCAL","Inversión","Un nuevo contrato social y ambiental para la Bogotá del Siglo XXI",57,{"$f":"IF(ISERROR(VLOOKUP(K91,Proposito_programa!$C$2:$E$59,2,FALSE)),\" \",VLOOKUP(K91,Proposito_programa!$C$2:$E$59,2,FALSE))","v":"Gestión pública local"},{"$f":"IF(ISERROR(VLOOKUP(K91,Proposito_programa!$C$2:$E$59,3,FALSE)),\" \",VLOOKUP(K91,Proposito_programa!$C$2:$E$59,3,FALSE))","v":"Propósito 5: Construir Bogotá - Región con gobierno abierto, transparente y ciudadanía consciente"},2105,1,52392065,"CLAUDIA PATRICIA YOPASA POVEDA","Persona Natural",null,null,null,null,52920000,null,null,0,52920000,52920000,"2022-01-20","2022-01-21","2022-08-20",7,0,0,null,null,null,null,"Terminado",1]
["FDLSF-CPS-079-2022",2022,"FDLSF-CD-012-2022","FDLSF-CPS-079-2022","Contratos de prestación de servicios profesionales y de apoyo a la gestión","Contratación directa","Prestación de servicios profesionales y de apoyo a la gestión, o para la ejecución de trabajos artísticos que sólo puedan encomendarse a determinadas personas naturales","APOYAR AL ALCALDE LOCAL EN LA PROMOCIÓN, ACOMPAÑAMIENTO, COORDINACIÓN Y ATENCIÓN DE LAS INSTANCIAS DE COORDINACIÓN INTERINSTITUCIONALES Y LAS INSTANCIAS DE PARTICIPACIÓN LOCALES, ASÍ COMO LOS PROCESOS COMUNITARIOS EN LA LOCALIDAD ","Inversión","Un nuevo contrato social y ambiental para la Bogotá del Siglo XXI",57,{"$f":"IF(ISERROR(VLOOKUP(K92,Proposito_programa!$C$2:$E$59,2,FALSE)),\" \",VLOOKUP(K92,Proposito_programa!$C$2:$E$59,2,FALSE))","v":"Gestión pública local"},{"$f":"IF(ISERROR(VLOOKUP(K92,Proposito_programa!$C$2:$E$59,3,FALSE)),\" \",VLOOKUP(K92,Proposito_programa!$C$2:$E$59,3,FALSE))","v":"Propósito 5: Construir Bogotá - Región con gobierno abierto, transparente y ciudadanía consciente"},2105,1,53046666,"YEIMY CAROLINA BELLO CALIXTO","Persona Natural",null,null,null,null,33600000,null,null,0,33600000,33600000,"2022-01-19","2022-01-25","2022-08-24",7,0,0,null,null,null,null,"Terminado",1]
["FDLSF-CPS-080-2022",2022,"FDLSF-CD-064-2022","FDLSF-CPS-080-2022","Contratos de prestación de servicios profesionales y de apoyo a la gestión","Contratación directa","Prestación de servicios profesionales y de apoyo a la gestión, o para la ejecución de trabajos artísticos que sólo puedan encomendarse a determinadas personas naturales","PRESTAR APOYO AL ÁREA GESTIÓN POLICÍVA Y ÁREA DE GESTIÓN DE DESARROLLO LOCAL EN LA CONDUCCIÓN DEL PARQUE AUTOMOTOR DEL FDLSF QUE LE SEA ASIGNADO","Inversión","Un nuevo contrato social y ambiental para la Bogotá del Siglo XXI",57,{"$f":"IF(ISERROR(VLOOKUP(K93,Proposito_programa!$C$2:$E$59,2,FALSE)),\" \",VLOOKUP(K93,Proposito_programa!$C$2:$E$59,2,FALSE))","v":"Gestión pública local"},{"$f":"IF(ISERROR(VLOOKUP(K93,Proposito_programa!$C$2:$E$59,3,FALSE)),\" \",VLOOKUP(K93,Proposito_programa!$C$2:$E$59,3,FALSE))","v":"Propósito 5: Construir Bogotá - Región con gobierno abierto, transparente y ciudadanía consciente"},2105,1,79750912,"JHON ALEXANDER SANABRIA","Persona Natural",null,null,null,null,18900000,null,null,0,18900000,18900000,"2022-01-20","2022-01-21","2022-08-20",7,0,0,null,null,null,null,"Terminado",1]
["FDLSF-CPS-081-2022",2022,"FDLSF-CD-036-2022","FDLSF-CPS-081-2022","Contratos de prestación de servicios profesionales y de apoyo a la gestión","Contratación directa","Prestación de servicios profesionales y de apoyo a la gestión, o para la ejecución de trabajos artísticos que sólo puedan encomendarse a determinadas personas naturales","PRESTAR LOS SERVICIOS DE APOYO EN LA DISTRIBUCIÓN DE CORRESPONDENCIA PRODUCIDA EN LAS DIFERENTES ÁREAS DE LA ALCALDÍA LOCAL DE SANTA FE","Inversión","Un nuevo contrato social y ambiental para la Bogotá del Siglo XXI",57,{"$f":"IF(ISERROR(VLOOKUP(K94,Proposito_programa!$C$2:$E$59,2,FALSE)),\" \",VLOOKUP(K94,Proposito_programa!$C$2:$E$59,2,FALSE))","v":"Gestión pública local"},{"$f":"IF(ISERROR(VLOOKUP(K94,Proposito_programa!$C$2:$E$59,3,FALSE)),\" \",VLOOKUP(K94,Proposito_programa!$C$2:$E$59,3,FALSE))","v":"Propósito 5: Construir Bogotá - Región con gobierno abierto, transparente y ciudadanía consciente"},2105,1,82360623,"EUMIR ANTONIO PALACIOS CAICEDO","Persona Natural",null,null,null,null,25850000,null,1,2350000,28200000,24361667,"2022-01-19","2022-01-20","2023-01-19",11,1,30,null,null,null,null,"Terminado",0.86388890070921986]
["FDLSF-CPS-082-2022",2022,"FDLSF-CD-078-2022","FDLSF-CPS-082-2022","Contratos de prestación de servicios profesionales y de apoyo a la gestión","Contratación directa","Prestación de servicios profesionales y de apoyo a la gestión, o para la ejecución de trabajos artísticos que sólo puedan encomendarse a determinadas personas naturales"," PRESTAR SERVICIOS PROFESIONALES ESPECIALIZADOS AL DESPACHO, APOYANDO LA SUPERVISIÓN DEL GRUPO DE PROFESIONALES QUE REALIZAN LA PROMOCIÓN, ACOMPAÑAMIENTO Y ATENCIÓN DE LAS INSTANCIAS INTERINSTITUCIONALES Y LAS INSTANCIAS DE PARTICIPACIÓN LOCALES, ASÍ COMO LOS PROCESOS COMUNITARIOS EN LA LOCALIDAD DE SANTA FE","Inversión","Un nuevo contrato social y ambiental para la Bogotá del Siglo XXI",57,{"$f":"IF(ISERROR(VLOOKUP(K95,Proposito_programa!$C$2:$E$59,2,FALSE)),\" \",VLOOKUP(K95,Proposito_programa!$C$2:$E$59,2,FALSE))","v":"Gestión pública local"},{"$f":"IF(ISERROR(VLOOKUP(K95,Proposito_programa!$C$2:$E$59,3,FALSE)),\" \",VLOOKUP(K95,Proposito_programa!$C$2:$E$59,3,FALSE))","v":"Propósito 5: Construir Bogotá - Región con gobierno abierto, transparente y ciudadanía consciente"},2105,1,79951390,"DIEGO ALBERTO YARA PALENCIA","Persona Natural",null,null,null,null,52920000,null,null,0,52920000,52416000,"2022-01-19","2022-01-21","2022-08-20",7,0,0,79951390,"DIEGO ALBERTO YARA PALENCIA","2022-08-02",null,"Terminado",0.99047619047619051]
["FDLSF-CPS-083-2022",2022,"FDLSF-CD-056-2022","FDLSF-CPS-083-2022","Contratos de prestación de servicios profesionales y de apoyo a la gestión","Contratación directa","Prestación de servicios profesionales y de apoyo a la gestión, o para la ejecución de trabajos artísticos que sólo puedan encomendarse a determinadas personas naturales"," PRESTAR SUS SERVICIOS PROFESIONALES PARA LA ESTRUCTURACIÓN, VIABILIZACIÓN, EVALUACIÓN Y SEGUIMIENTO DE LOS PROYECTOS DEL PRESUPUESTO DEL FONDO DE DESARROLLO LOCAL DE SANTA FE QUE LE SEAN ASIGNADOS ","Inversión","Un nuevo contrato social y ambiental para la Bogotá del Siglo XXI",57,{"$f":"IF(ISERROR(VLOOKUP(K96,Proposito_programa!$C$2:$E$59,2,FALSE)),\" \",VLOOKUP(K96,Proposito_programa!$C$2:$E$59,2,FALSE))","v":"Gestión pública local"},{"$f":"IF(ISERROR(VLOOKUP(K96,Proposito_programa!$C$2:$E$59,3,FALSE)),\" \",VLOOKUP(K96,Proposito_programa!$C$2:$E$59,3,FALSE))","v":"Propósito 5: Construir Bogotá - Región con gobierno abierto, transparente y ciudadanía consciente"},2105,1,1022993911,"LUISA FERNANDA CAMELO RAMIREZ","Persona Natural",null,null,null,null,52800000,null,1,4800000,57600000,48480000,"2022-01-20","2022-01-28","2022-12-27",11,0,0,null,null,null,null,"Terminado",0.84166666666666667]
["FDLSF-CPS-084-2022",2022,"FDLSF-CD-001-2022","FDLSF-CPS-084-2022","Contratos de prestación de servicios profesionales y de apoyo a la gestión","Contratación directa","Prestación de servicios profesionales y de apoyo a la gestión, o para la ejecución de trabajos artísticos que sólo puedan encomendarse a determinadas personas naturales","PRESTAR SERVICIOS DE APOYO AL ÁREA DE GESTIÓN DEL DESARROLLO LOCAL EN LO RELACIONADO CON LA ATENCIÓN AL CIUDADANO Y AL CENTRO DOCUMENTAL DE INFORMACIÓN (CDI) DE LA ALCALDÍA LOCAL DE SANTA FE ","Inversión","Un nuevo contrato social y ambiental para la Bogotá del Siglo XXI",57,{"$f":"IF(ISERROR(VLOOKUP(K97,Proposito_programa!$C$2:$E$59,2,FALSE)),\" \",VLOOKUP(K97,Proposito_programa!$C$2:$E$59,2,FALSE))","v":"Gestión pública local"},{"$f":"IF(ISERROR(VLOOKUP(K97,Proposito_programa!$C$2:$E$59,3,FALSE)),\" \",VLOOKUP(K97,Proposito_programa!$C$2:$E$59,3,FALSE))","v":"Propósito 5: Construir Bogotá - Región con gobierno abierto, transparente y ciudadanía consciente"},2105,1,1013599315,"LORENA CALDERON CASTRO","Persona Natural",null,null,null,null,25850000,null,1,2350000,28200000,24283333,"2022-01-20","2022-01-21","2023-01-20",11,1,30,null,null,null,null,"Terminado",0.86111109929078011]
["FDLSF-CPS-085-2022",2022,"FDLSF-CD-018-2022","FDLSF-CPS-085-2022","Contratos de prestación de servicios profesionales y de apoyo a la gestión","Contratación directa","Prestación de servicios profesionales y de apoyo a la gestión, o para la ejecución de trabajos artísticos que sólo puedan encomendarse a determinadas personas naturales","PRESTAR LOS SERVICIOS PROFESIONALES AL ÁREA DE GESTIÓN DEL DESARROLLO LOCAL DE LA ALCALDÍA LOCAL, PARA APOYAR LA ESTRUCTURACIÓN, EVALUACIÓN Y SEGUIMIENTO DE LOS PROYECTOS, PLANES Y PROGRAMAS RELACIONADOS CON EL MANTENIMIENTO, MEJORAMIENTO Y CONSERVACIÓN DE LA INFRAESTRUCTURA VIAL Y ESPACIO PÚBLICO DE LA LOCALIDAD DE SANTA FE ","Inversión","Un nuevo contrato social y ambiental para la Bogotá del Siglo XXI",57,{"$f":"IF(ISERROR(VLOOKUP(K98,Proposito_programa!$C$2:$E$59,2,FALSE)),\" \",VLOOKUP(K98,Proposito_programa!$C$2:$E$59,2,FALSE))","v":"Gestión pública local"},{"$f":"IF(ISERROR(VLOOKUP(K98,Proposito_programa!$C$2:$E$59,3,FALSE)),\" \",VLOOKUP(K98,Proposito_programa!$C$2:$E$59,3,FALSE))","v":"Propósito 5: Construir Bogotá - Región con gobierno abierto, transparente y ciudadanía consciente"},2105,1,52489542,"MAGDA LORENA DAVILA VELANDIA ","Persona Natural",null,null,null,null,67100000,null,1,6100000,73200000,62830000,"2022-01-20","2022-01-20","2023-01-19",11,1,30,52489542,"MAGDA LORENA DAVILA VELANDIA ","2022-08-04",null,"Terminado",0.85833333333333328]
["FDLSF-CPS-086-2022",2022,"FDLSF-CD-021-2022","FDLSF-CPS-086-2022","Contratos de prestación de servicios profesionales y de apoyo a la gestión","Contratación directa","Prestación de servicios profesionales y de apoyo a la gestión, o para la ejecución de trabajos artísticos que sólo puedan encomendarse a determinadas personas naturales","PRESTAR LOS SERVICIOS PROFESIONALES AL ÁREA DE GESTIÓN DEL DESARROLLO LOCAL DE LA ALCALDÍA LOCAL, PARA APOYAR LA ESTRUCTURACIÓN, EVALUACIÓN Y SEGUIMIENTO DE LOS PROYECTOS, PLANES Y PROGRAMAS RELACIONADOS CON EL MANTENIMIENTO, MEJORAMIENTO Y CONSERVACIÓN DE LA INFRAESTRUCTURA VIAL Y ESPACIO PÚBLICO DE LA LOCALIDAD DE SANTA FE ","Inversión","Un nuevo contrato social y ambiental para la Bogotá del Siglo XXI",57,{"$f":"IF(ISERROR(VLOOKUP(K99,Proposito_programa!$C$2:$E$59,2,FALSE)),\" \",VLOOKUP(K99,Proposito_programa!$C$2:$E$59,2,FALSE))","v":"Gestión pública local"},{"$f":"IF(ISERROR(VLOOKUP(K99,Proposito_programa!$C$2:$E$59,3,FALSE)),\" \",VLOOKUP(K99,Proposito_programa!$C$2:$E$59,3,FALSE))","v":"Propósito 5: Construir Bogotá - Región con gobierno abierto, transparente y ciudadanía consciente"},2105,1,92527035,"GABRIEL EMILIO HERNANDEZ TAMARA","Persona Natural",null,null,null,null,33600000,null,null,0,33600000,33600000,"2022-01-20","2022-01-20","2022-08-19",7,0,0,null,null,null,null,"Terminado",1]
["FDLSF-CPS-087-2022",2022,"FDLSF-CD-030-2022","FDLSF-CPS-087-2022","Contratos de prestación de servicios profesionales y de apoyo a la gestión","Contratación directa","Prestación de servicios profesionales y de apoyo a la gestión, o para la ejecución de trabajos artísticos que sólo puedan encomendarse a determinadas personas naturales"," APOYAR Y DAR SOPORTE TÉCNICO AL ADMINISTRADOR Y USUARIO FINAL DE LA RED DE SISTEMAS Y TECNOLOGIA E INFORMACIÓN DE LA ALCALDIA LOCAL DE SANTA FE. ","Inversión","Un nuevo contrato social y ambiental para la Bogotá del Siglo XXI",57,{"$f":"IF(ISERROR(VLOOKUP(K100,Proposito_programa!$C$2:$E$59,2,FALSE)),\" \",VLOOKUP(K100,Proposito_programa!$C$2:$E$59,2,FALSE))","v":"Gestión pública local"},{"$f":"IF(ISERROR(VLOOKUP(K100,Proposito_programa!$C$2:$E$59,3,FALSE)),\" \",VLOOKUP(K100,Proposito_programa!$C$2:$E$59,3,FALSE))","v":"Propósito 5: Construir Bogotá - Región con gobierno abierto, transparente y ciudadanía consciente"},2105,1,1082879244,"RAFAEL RICARDO BALAGUERA BONITTO","Persona Natural",null,null,null,null,25620000,null,null,0,25620000,25620000,"2022-01-24","2022-01-27","2022-08-26",7,0,0,null,null,null,null,"Terminado",1]
["FDLSF-CPS-088-2022",2022,"FDLSF-CD-081-2022","FDLSF-CPS-088-2022","Contratos de prestación de servicios profesionales y de apoyo a la gestión","Contratación directa","Prestación de servicios profesionales y de apoyo a la gestión, o para la ejecución de trabajos artísticos que sólo puedan encomendarse a determinadas personas naturales","APOYAR AL ALCALDE LOCAL EN LA PROMOCIÓN, ARTICULACIÓN, ACOMPAÑAMIENTO Y SEGUIMIENTO PARA LA ATENCIÓN Y PROTECCIÓN DE LOS ANIMALES DOMÉSTICOS Y SILVESTRES DE LA LOCALIDAD","Inversión","Un nuevo contrato social y ambiental para la Bogotá del Siglo XXI",34,{"$f":"IF(ISERROR(VLOOKUP(K101,Proposito_programa!$C$2:$E$59,2,FALSE)),\" \",VLOOKUP(K101,Proposito_programa!$C$2:$E$59,2,FALSE))","v":"Bogotá protectora de los animales"},{"$f":"IF(ISERROR(VLOOKUP(K101,Proposito_programa!$C$2:$E$59,3,FALSE)),\" \",VLOOKUP(K101,Proposito_programa!$C$2:$E$59,3,FALSE))","v":"Propósito 2 : Cambiar Nuestros Hábitos de Vida para Reverdecer a Bogotá y Adaptarnos y Mitigar la Crisis Climática"},2074,1,1018474047,"SANTIAGO SANCHEZ GUZMAN","Persona Natural",null,null,null,null,33600000,null,null,0,33600000,33600000,"2022-01-24","2022-01-27","2022-08-26",7,0,0,null,null,null,null,"Terminado",1]
["FDLSF-CPS-089-2022",2022,"FDLSF-CD-080-2022","FDLSF-CPS-089-2022","Contratos de prestación de servicios profesionales y de apoyo a la gestión","Contratación directa","Prestación de servicios profesionales y de apoyo a la gestión, o para la ejecución de trabajos artísticos que sólo puedan encomendarse a determinadas personas naturales"," PRESTAR SERVICIO DE APOYO A LA GESTION EN LOS TRÁMITES QUE SE SURTAN EN EL DESPACHO DE LA ALCALDÍA LOCAL DE SANTA FE. ","Inversión","Un nuevo contrato social y ambiental para la Bogotá del Siglo XXI",57,{"$f":"IF(ISERROR(VLOOKUP(K102,Proposito_programa!$C$2:$E$59,2,FALSE)),\" \",VLOOKUP(K102,Proposito_programa!$C$2:$E$59,2,FALSE))","v":"Gestión pública local"},{"$f":"IF(ISERROR(VLOOKUP(K102,Proposito_programa!$C$2:$E$59,3,FALSE)),\" \",VLOOKUP(K102,Proposito_programa!$C$2:$E$59,3,FALSE))","v":"Propósito 5: Construir Bogotá - Región con gobierno abierto, transparente y ciudadanía consciente"},2105,1,1026304381,"NURY NATALIA PEÑA MORENO","Persona Natural",null,null,null,null,16450000,null,null,0,16450000,16450000,"2022-01-21","2022-01-24","2022-08-23",7,0,0,null,null,null,null,"Terminado",1]
["FDLSF-CPS-090-2022",2022,"FDLSF-CD-005-2022","FDLSF-CPS-090-2022","Contratos de prestación de servicios profesionales y de apoyo a la gestión","Contratación directa","Prestación de servicios profesionales y de apoyo a la gestión, o para la ejecución de trabajos artísticos que sólo puedan encomendarse a determinadas personas naturales","APOYAR AL EQUIPO DE PRENSA Y COMUNICACIONES DE LA ALCALDÍA LOCAL EN LA REALIZACIÓN DE PRODUCTOS Y PIEZAS DIGITALES, IMPRESAS Y PUBLICITARIAS DE GRAN FORMATO Y DE ANIMACIÓN GRÁFICA, ASÍ COMO APOYAR LA PRODUCCIÓN Y MONTAJE DE EVENTOS","Inversión","Un nuevo contrato social y ambiental para la Bogotá del Siglo XXI",57,{"$f":"IF(ISERROR(VLOOKUP(K103,Proposito_programa!$C$2:$E$59,2,FALSE)),\" \",VLOOKUP(K103,Proposito_programa!$C$2:$E$59,2,FALSE))","v":"Gestión pública local"},{"$f":"IF(ISERROR(VLOOKUP(K103,Proposito_programa!$C$2:$E$59,3,FALSE)),\" \",VLOOKUP(K103,Proposito_programa!$C$2:$E$59,3,FALSE))","v":"Propósito 5: Construir Bogotá - Región con gobierno abierto, transparente y ciudadanía consciente"},2105,1,1019065822,"DIEGO ALEJANDRO SANTIESTEBAN RAMIREZ","Persona Natural",null,null,null,null,42700000,null,null,0,42700000,42700000,"2022-01-20","2022-01-22","2022-08-21",7,0,0,null,null,null,null,"Terminado",1]
["FDLSF-CPS-091-2022",2022,"FDSLF-CD-003-2022","FDLSF-CPS-091-2022","Contratos de prestación de servicios profesionales y de apoyo a la gestión","Contratación directa","Prestación de servicios profesionales y de apoyo a la gestión, o para la ejecución de trabajos artísticos que sólo puedan encomendarse a determinadas personas naturales","APOYA EL CUBRIMIENTO DE LAS ACTIVIDADES, CRONOGRAMAS Y AGENDA DE LA ALCALDÍA LOCAL A NIVEL INTERNO Y EXTERNO, ASÍ COMO LA GENERACIÓN DE CONTENIDOS PERIODÍSTICOS","Inversión","Un nuevo contrato social y ambiental para la Bogotá del Siglo XXI",57,{"$f":"IF(ISERROR(VLOOKUP(K104,Proposito_programa!$C$2:$E$59,2,FALSE)),\" \",VLOOKUP(K104,Proposito_programa!$C$2:$E$59,2,FALSE))","v":"Gestión pública local"},{"$f":"IF(ISERROR(VLOOKUP(K104,Proposito_programa!$C$2:$E$59,3,FALSE)),\" \",VLOOKUP(K104,Proposito_programa!$C$2:$E$59,3,FALSE))","v":"Propósito 5: Construir Bogotá - Región con gobierno abierto, transparente y ciudadanía consciente"},2105,1,41323323,"MARTHA QUIROZ TOLOSA","Persona Natural",null,null,null,null,42700000,null,null,0,42700000,39446666,"2022-01-21","2022-01-22","2022-08-21",7,0,0,41323323,"MARTHA QUIROZ TOLOSA","2022-08-04",null,"Terminado",0.92380950819672136]
["FDLSF-CPS-092-2022",2022,"FDLSF-CD-079-2022","FDLSF-CPS-092-2022","Contratos de prestación de servicios profesionales y de apoyo a la gestión","Contratación directa","Prestación de servicios profesionales y de apoyo a la gestión, o para la ejecución de trabajos artísticos que sólo puedan encomendarse a determinadas personas naturales","PRESTAR LOS SERVICIOS DE APOYO AL FONDO DE DESARROLLO LOCAL DE SANTA FE EN LA GESTIÓN DE LOS TRÁMITES ADMINISTRATIVOS RELACIONADOS CON SEGURIDAD CIUDADANA Y CONVIVENCIA DE LA LOCALIDAD","Inversión","Un nuevo contrato social y ambiental para la Bogotá del Siglo XXI",57,{"$f":"IF(ISERROR(VLOOKUP(K105,Proposito_programa!$C$2:$E$59,2,FALSE)),\" \",VLOOKUP(K105,Proposito_programa!$C$2:$E$59,2,FALSE))","v":"Gestión pública local"},{"$f":"IF(ISERROR(VLOOKUP(K105,Proposito_programa!$C$2:$E$59,3,FALSE)),\" \",VLOOKUP(K105,Proposito_programa!$C$2:$E$59,3,FALSE))","v":"Propósito 5: Construir Bogotá - Región con gobierno abierto, transparente y ciudadanía consciente"},2105,1,1123160607,"CARLOS FABIAN RAMIREZ","Persona Natural",null,null,null,null,16450000,null,null,0,16450000,16450000,"2022-01-21","2022-01-24","2022-08-23",7,0,0,null,null,null,null,"Terminado",1]
["FDLSF-CPS-093-2022",2022,"FDLSF-CD-034-2022","FDLSF-CPS-093-2022","Contratos de prestación de servicios profesionales y de apoyo a la gestión","Contratación directa","Prestación de servicios profesionales y de apoyo a la gestión, o para la ejecución de trabajos artísticos que sólo puedan encomendarse a determinadas personas naturales"," PRESTAR SERVICIOS DE APOYO TÉCNICO AL ÁREA DE GESTIÓN POLICIVA, EN EL DESARROLLO DE LAS ACTIVIDADES PROPIAS DEL ÁREA ","Inversión","Un nuevo contrato social y ambiental para la Bogotá del Siglo XXI",57,{"$f":"IF(ISERROR(VLOOKUP(K106,Proposito_programa!$C$2:$E$59,2,FALSE)),\" \",VLOOKUP(K106,Proposito_programa!$C$2:$E$59,2,FALSE))","v":"Gestión pública local"},{"$f":"IF(ISERROR(VLOOKUP(K106,Proposito_programa!$C$2:$E$59,3,FALSE)),\" \",VLOOKUP(K106,Proposito_programa!$C$2:$E$59,3,FALSE))","v":"Propósito 5: Construir Bogotá - Región con gobierno abierto, transparente y ciudadanía consciente"},2105,1,1109291034,"YEIMMY LORENA RIAÑO TORO","Persona Natural",null,null,null,null,30240000,null,null,0,30240000,30240000,"2022-01-24","2022-01-24","2022-08-23",7,0,0,null,null,null,null,"Terminado",1]
["FDLSF-CPS-094-2022",2022,"FDLSF-CD-001-2022","FDLSF-CPS-094-2022","Contratos de prestación de servicios profesionales y de apoyo a la gestión","Contratación directa","Prestación de servicios profesionales y de apoyo a la gestión, o para la ejecución de trabajos artísticos que sólo puedan encomendarse a determinadas personas naturales","PRESTAR SERVICIOS DE APOYO AL ÁREA DE GESTIÓN DEL DESARROLLO LOCAL EN LO RELACIONADO CON LA ATENCIÓN AL CIUDADANO Y AL CENTRO DOCUMENTAL DE INFORMACIÓN (CDI) DE LA ALCALDÍA LOCAL DE SANTA FE ","Inversión","Un nuevo contrato social y ambiental para la Bogotá del Siglo XXI",57,{"$f":"IF(ISERROR(VLOOKUP(K107,Proposito_programa!$C$2:$E$59,2,FALSE)),\" \",VLOOKUP(K107,Proposito_programa!$C$2:$E$59,2,FALSE))","v":"Gestión pública local"},{"$f":"IF(ISERROR(VLOOKUP(K107,Proposito_programa!$C$2:$E$59,3,FALSE)),\" \",VLOOKUP(K107,Proposito_programa!$C$2:$E$59,3,FALSE))","v":"Propósito 5: Construir Bogotá - Región con gobierno abierto, transparente y ciudadanía consciente"},2105,1,1000776584,"WILLIAM ANTONIO BETANCUORT ORTEGON","Persona Natural",null,null,null,null,25850000,null,null,0,25850000,23186666,"2022-01-21","2022-01-24","2023-01-23",11,1,30,1000776584,"WILLIAM ANTONIO BETANCUORT ORTEGON","2022-07-27",null,"Terminado",0.89696967117988391]
["FDLSF-CPS-095-2022",2022,"FDLSF-CD-082-2022","FDLSF-CPS-095-2022","Contratos de prestación de servicios profesionales y de apoyo a la gestión","Contratación directa","Prestación de servicios profesionales y de apoyo a la gestión, o para la ejecución de trabajos artísticos que sólo puedan encomendarse a determinadas personas naturales","PRESTAR SUS SERVICIOS COMO APOYO EN LAS ACTIVIDADES PREVISTAS PARA LA IMPLEMENTACIÓN DE PROCESOS DE FORMACIÓN DEPORTIVA Y ACONDICIONAMIENTO FÍSICO DEL ADULTO MAYOR EN LA LOCALIDAD DE SANTA FE ","Inversión","Un nuevo contrato social y ambiental para la Bogotá del Siglo XXI",20,{"$f":"IF(ISERROR(VLOOKUP(K108,Proposito_programa!$C$2:$E$59,2,FALSE)),\" \",VLOOKUP(K108,Proposito_programa!$C$2:$E$59,2,FALSE))","v":"Bogotá, referente en cultura, deporte, recreación y actividad física, con parques para el desarrollo y la salud"},{"$f":"IF(ISERROR(VLOOKUP(K108,Proposito_programa!$C$2:$E$59,3,FALSE)),\" \",VLOOKUP(K108,Proposito_programa!$C$2:$E$59,3,FALSE))","v":"Propósito 1: Hacer un nuevo contrato social para incrementar la inclusión social, productiva y política"},2100,1,1010236964,"JUAN SEBASTIAN ALARCON VANEGAS","Persona Natural",null,null,null,null,9600000,null,null,0,9600000,9600000,"2022-01-26","2022-02-01","2022-07-31",6,0,0,null,null,null,null,"Terminado",1]
["FDLSF-CPS-096-2022",2022,"FDLSF-CD-082-2022","FDLSF-CPS-096-2022","Contratos de prestación de servicios profesionales y de apoyo a la gestión","Contratación directa","Prestación de servicios profesionales y de apoyo a la gestión, o para la ejecución de trabajos artísticos que sólo puedan encomendarse a determinadas personas naturales","PRESTAR SUS SERVICIOS COMO APOYO EN LAS ACTIVIDADES PREVISTAS PARA LA IMPLEMENTACIÓN DE PROCESOS DE FORMACIÓN DEPORTIVA Y ACONDICIONAMIENTO FÍSICO DEL ADULTO MAYOR EN LA LOCALIDAD DE SANTA FE ","Inversión","Un nuevo contrato social y ambiental para la Bogotá del Siglo XXI",20,{"$f":"IF(ISERROR(VLOOKUP(K109,Proposito_programa!$C$2:$E$59,2,FALSE)),\" \",VLOOKUP(K109,Proposito_programa!$C$2:$E$59,2,FALSE))","v":"Bogotá, referente en cultura, deporte, recreación y actividad física, con parques para el desarrollo y la salud"},{"$f":"IF(ISERROR(VLOOKUP(K109,Proposito_programa!$C$2:$E$59,3,FALSE)),\" \",VLOOKUP(K109,Proposito_programa!$C$2:$E$59,3,FALSE))","v":"Propósito 1: Hacer un nuevo contrato social para incrementar la inclusión social, productiva y política"},2100,1,1010238165,"HELBERTH  SEBASTIAN DIAZ BEJARANO","Persona Natural",null,null,null,null,9600000,null,null,0,9600000,9600000,"2022-01-26","2022-02-01","2022-07-31",6,0,0,null,null,null,null,"Terminado",1]
["FDLSF-CPS-097-2022",2022,"FDLSF-CD-082-2022","FDLSF-CPS-097-2022","Contratos de prestación de servicios profesionales y de apoyo a la gestión","Contratación directa","Prestación de servicios profesionales y de apoyo a la gestión, o para la ejecución de trabajos artísticos que sólo puedan encomendarse a determinadas personas naturales","PRESTAR SUS SERVICIOS COMO APOYO EN LAS ACTIVIDADES PREVISTAS PARA LA IMPLEMENTACIÓN DE PROCESOS DE FORMACIÓN DEPORTIVA Y ACONDICIONAMIENTO FÍSICO DEL ADULTO MAYOR EN LA LOCALIDAD DE SANTA FE ","Inversión","Un nuevo contrato social y ambiental para la Bogotá del Siglo XXI",20,{"$f":"IF(ISERROR(VLOOKUP(K110,Proposito_programa!$C$2:$E$59,2,FALSE)),\" \",VLOOKUP(K110,Proposito_programa!$C$2:$E$59,2,FALSE))","v":"Bogotá, referente en cultura, deporte, recreación y actividad física, con parques para el desarrollo y la salud"},{"$f":"IF(ISERROR(VLOOKUP(K110,Proposito_programa!$C$2:$E$59,3,FALSE)),\" \",VLOOKUP(K110,Proposito_programa!$C$2:$E$59,3,FALSE))","v":"Propósito 1: Hacer un nuevo contrato social para incrementar la inclusión social, productiva y política"},2100,1,1010242178,"NICOLE DAYANNA RIVERA VEGA","Persona Natural",null,null,null,null,9600000,null,null,0,9600000,9600000,"2022-01-26","2022-02-01","2022-07-31",6,0,0,null,null,null,null,"Terminado",1]
["FDLSF-CPS-098-2022",2022,"FDLSF-CD-082-2022","FDLSF-CPS-098-2022","Contratos de prestación de servicios profesionales y de apoyo a la gestión","Contratación directa","Prestación de servicios profesionales y de apoyo a la gestión, o para la ejecución de trabajos artísticos que sólo puedan encomendarse a determinadas personas naturales","PRESTAR SUS SERVICIOS COMO APOYO EN LAS ACTIVIDADES PREVISTAS PARA LA IMPLEMENTACIÓN DE PROCESOS DE FORMACIÓN DEPORTIVA Y ACONDICIONAMIENTO FÍSICO DEL ADULTO MAYOR EN LA LOCALIDAD DE SANTA FE ","Inversión","Un nuevo contrato social y ambiental para la Bogotá del Siglo XXI",20,{"$f":"IF(ISERROR(VLOOKUP(K111,Proposito_programa!$C$2:$E$59,2,FALSE)),\" \",VLOOKUP(K111,Proposito_programa!$C$2:$E$59,2,FALSE))","v":"Bogotá, referente en cultura, deporte, recreación y actividad física, con parques para el desarrollo y la salud"},{"$f":"IF(ISERROR(VLOOKUP(K111,Proposito_programa!$C$2:$E$59,3,FALSE)),\" \",VLOOKUP(K111,Proposito_programa!$C$2:$E$59,3,FALSE))","v":"Propósito 1: Hacer un nuevo contrato social para incrementar la inclusión social, productiva y política"},2100,1,1022326119,"LEIDY JOHANNA CUMBE SOUSA","Persona Natural",null,null,null,null,9600000,null,null,0,9600000,9600000,"2022-01-26","2022-02-01","2022-07-31",6,0,0,null,null,null,null,"Terminado",1]
["FDLSF-CPS-099-2022",2022,"FDLSF-CD-090-2022","FDLSF-CPS-099-2022","Contratos de prestación de servicios profesionales y de apoyo a la gestión","Contratación directa","Prestación de servicios profesionales y de apoyo a la gestión, o para la ejecución de trabajos artísticos que sólo puedan encomendarse a determinadas personas naturales"," PRESTAR SERVICIOS COMO INSTRUCTOR EN PROCESOS DE FORMACIÓN DEPORTIVA Y ACONDICIONAMIENTO FÍSICO DEL ADULTO MAYOR EN LA LOCALIDAD DE SANTA FE ","Inversión","Un nuevo contrato social y ambiental para la Bogotá del Siglo XXI",20,{"$f":"IF(ISERROR(VLOOKUP(K112,Proposito_programa!$C$2:$E$59,2,FALSE)),\" \",VLOOKUP(K112,Proposito_programa!$C$2:$E$59,2,FALSE))","v":"Bogotá, referente en cultura, deporte, recreación y actividad física, con parques para el desarrollo y la salud"},{"$f":"IF(ISERROR(VLOOKUP(K112,Proposito_programa!$C$2:$E$59,3,FALSE)),\" \",VLOOKUP(K112,Proposito_programa!$C$2:$E$59,3,FALSE))","v":"Propósito 1: Hacer un nuevo contrato social para incrementar la inclusión social, productiva y política"},2100,1,1030675885,"YOHAN DAVID QUIÑONES MOSQUERA","Persona Natural",null,null,null,null,17760000,null,null,0,17760000,14405333,"2022-01-26","2022-02-01","2022-07-31",6,0,0,1030675885,"YOHAN DAVID QUIÑONES MOSQUERA","2022-07-05",null,"Terminado",0.81111109234234235]
["FDLSF-CPS-100-2022",2022,"FDLSF-CD-091-2022","FDLSF-CPS-100-2022","Contratos de prestación de servicios profesionales y de apoyo a la gestión","Contratación directa","Prestación de servicios profesionales y de apoyo a la gestión, o para la ejecución de trabajos artísticos que sólo puedan encomendarse a determinadas personas naturales"," PRESTAR SERVICIOS COMO INSTRUCTOR EN PROCESOS DE FORMACIÓN DEPORTIVA Y ACONDICIONAMIENTO FÍSICO DEL ADULTO MAYOR EN LA LOCALIDAD DE SANTA FE ","Inversión","Un nuevo contrato social y ambiental para la Bogotá del Siglo XXI",20,{"$f":"IF(ISERROR(VLOOKUP(K113,Proposito_programa!$C$2:$E$59,2,FALSE)),\" \",VLOOKUP(K113,Proposito_programa!$C$2:$E$59,2,FALSE))","v":"Bogotá, referente en cultura, deporte, recreación y actividad física, con parques para el desarrollo y la salud"},{"$f":"IF(ISERROR(VLOOKUP(K113,Proposito_programa!$C$2:$E$59,3,FALSE)),\" \",VLOOKUP(K113,Proposito_programa!$C$2:$E$59,3,FALSE))","v":"Propósito 1: Hacer un nuevo contrato social para incrementar la inclusión social, productiva y política"},2100,1,1026253798,"WILLIAM ENRIQUE GIL AGUILLON","Persona Natural",null,null,null,null,17760000,null,null,0,17760000,17760000,"2022-01-26","2022-02-01","2022-07-31",6,0,0,null,null,null,null,"Terminado",1]
["FDLSF-CPS-101-2022",2022,"FDLSF-CD-082-2022","FDLSF-CPS-101-2022","Contratos de prestación de servicios profesionales y de apoyo a la gestión","Contratación directa","Prestación de servicios profesionales y de apoyo a la gestión, o para la ejecución de trabajos artísticos que sólo puedan encomendarse a determinadas personas naturales","PRESTAR SUS SERVICIOS COMO APOYO EN LAS ACTIVIDADES PREVISTAS PARA LA IMPLEMENTACIÓN DE PROCESOS DE FORMACIÓN DEPORTIVA Y ACONDICIONAMIENTO FÍSICO DEL ADULTO MAYOR EN LA LOCALIDAD DE SANTA FE ","Inversión","Un nuevo contrato social y ambiental para la Bogotá del Siglo XXI",20,{"$f":"IF(ISERROR(VLOOKUP(K114,Proposito_programa!$C$2:$E$59,2,FALSE)),\" \",VLOOKUP(K114,Proposito_programa!$C$2:$E$59,2,FALSE))","v":"Bogotá, referente en cultura, deporte, recreación y actividad física, con parques para el desarrollo y la salud"},{"$f":"IF(ISERROR(VLOOKUP(K114,Proposito_programa!$C$2:$E$59,3,FALSE)),\" \",VLOOKUP(K114,Proposito_programa!$C$2:$E$59,3,FALSE))","v":"Propósito 1: Hacer un nuevo contrato social para incrementar la inclusión social, productiva y política"},2100,1,1026281709,"FRANCY NATALIA VALENCIA ALBA","Persona Natural",null,null,null,null,9600000,null,null,0,9600000,9600000,"2022-01-26","2022-02-01","2022-07-31",6,0,0,null,null,null,null,"Terminado",1]
["FDLSF-CPS-102-2022",2022,"FDLSF-CD-094-2022","FDLSF-CPS-102-2022","Contratos de prestación de servicios profesionales y de apoyo a la gestión","Contratación directa","Prestación de servicios profesionales y de apoyo a la gestión, o para la ejecución de trabajos artísticos que sólo puedan encomendarse a determinadas personas naturales"," PRESTAR SERVICIOS COMO INSTRUCTOR EN PROCESOS DE FORMACIÓN DEPORTIVA Y ACONDICIONAMIENTO FÍSICO DEL ADULTO MAYOR EN LA LOCALIDAD DE SANTA FE ","Inversión","Un nuevo contrato social y ambiental para la Bogotá del Siglo XXI",20,{"$f":"IF(ISERROR(VLOOKUP(K115,Proposito_programa!$C$2:$E$59,2,FALSE)),\" \",VLOOKUP(K115,Proposito_programa!$C$2:$E$59,2,FALSE))","v":"Bogotá, referente en cultura, deporte, recreación y actividad física, con parques para el desarrollo y la salud"},{"$f":"IF(ISERROR(VLOOKUP(K115,Proposito_programa!$C$2:$E$59,3,FALSE)),\" \",VLOOKUP(K115,Proposito_programa!$C$2:$E$59,3,FALSE))","v":"Propósito 1: Hacer un nuevo contrato social para incrementar la inclusión social, productiva y política"},2100,1,1149444759,"YORDY FREYCER MOSQUERA VALENCIA","Persona Natural",null,null,null,null,17760000,null,null,0,17760000,17167999,"2022-01-26","2022-02-01","2022-07-31",6,0,0,1149444759,"YORDY FREYCER MOSQUERA VALENCIA","2022-05-27",null,"Terminado",0.96666661036036039]
["FDLSF-CPS-103-2022",2022,"FDLSF-CD-082-2022","FDLSF-CPS-103-2022","Contratos de prestación de servicios profesionales y de apoyo a la gestión","Contratación directa","Prestación de servicios profesionales y de apoyo a la gestión, o para la ejecución de trabajos artísticos que sólo puedan encomendarse a determinadas personas naturales","PRESTAR SUS SERVICIOS COMO APOYO EN LAS ACTIVIDADES PREVISTAS PARA LA IMPLEMENTACIÓN DE PROCESOS DE FORMACIÓN DEPORTIVA Y ACONDICIONAMIENTO FÍSICO DEL ADULTO MAYOR EN LA LOCALIDAD DE SANTA FE ","Inversión","Un nuevo contrato social y ambiental para la Bogotá del Siglo XXI",20,{"$f":"IF(ISERROR(VLOOKUP(K116,Proposito_programa!$C$2:$E$59,2,FALSE)),\" \",VLOOKUP(K116,Proposito_programa!$C$2:$E$59,2,FALSE))","v":"Bogotá, referente en cultura, deporte, recreación y actividad física, con parques para el desarrollo y la salud"},{"$f":"IF(ISERROR(VLOOKUP(K116,Proposito_programa!$C$2:$E$59,3,FALSE)),\" \",VLOOKUP(K116,Proposito_programa!$C$2:$E$59,3,FALSE))","v":"Propósito 1: Hacer un nuevo contrato social para incrementar la inclusión social, productiva y política"},2100,1,1026300965,"MARLON DAVID CHAVES MELENDEZ","Persona Natural",null,null,null,null,9600000,null,null,0,9600000,9600000,"2022-01-26","2022-02-01","2022-07-31",6,0,0,null,null,null,null,"Terminado",1]
["FDLSF-CPS-104-2022",2022,"FDLSF-CD-082-2022","FDLSF-CPS-104-2022","Contratos de prestación de servicios profesionales y de apoyo a la gestión","Contratación directa","Prestación de servicios profesionales y de apoyo a la gestión, o para la ejecución de trabajos artísticos que sólo puedan encomendarse a determinadas personas naturales","PRESTAR SUS SERVICIOS COMO APOYO EN LAS ACTIVIDADES PREVISTAS PARA LA IMPLEMENTACIÓN DE PROCESOS DE FORMACIÓN DEPORTIVA Y ACONDICIONAMIENTO FÍSICO DEL ADULTO MAYOR EN LA LOCALIDAD DE SANTA FE ","Inversión","Un nuevo contrato social y ambiental para la Bogotá del Siglo XXI",20,{"$f":"IF(ISERROR(VLOOKUP(K117,Proposito_programa!$C$2:$E$59,2,FALSE)),\" \",VLOOKUP(K117,Proposito_programa!$C$2:$E$59,2,FALSE))","v":"Bogotá, referente en cultura, deporte, recreación y actividad física, con parques para el desarrollo y la salud"},{"$f":"IF(ISERROR(VLOOKUP(K117,Proposito_programa!$C$2:$E$59,3,FALSE)),\" \",VLOOKUP(K117,Proposito_programa!$C$2:$E$59,3,FALSE))","v":"Propósito 1: Hacer un nuevo contrato social para incrementar la inclusión social, productiva y política"},2100,1,1010201281,"MONICA ALEJANDRA RUIZ BELTRAN","Persona Natural",null,null,null,null,9600000,null,null,0,9600000,9600000,"2022-01-26","2022-02-01","2022-07-31",6,0,0,null,null,null,null,"Terminado",1]
["FDLSF-CPS-105-2022",2022,"FDLSF-CD-082-2022","FDLSF-CPS-105-2022","Contratos de prestación de servicios profesionales y de apoyo a la gestión","Contratación directa","Prestación de servicios profesionales y de apoyo a la gestión, o para la ejecución de trabajos artísticos que sólo puedan encomendarse a determinadas personas naturales","PRESTAR SUS SERVICIOS COMO APOYO EN LAS ACTIVIDADES PREVISTAS PARA LA IMPLEMENTACIÓN DE PROCESOS DE FORMACIÓN DEPORTIVA Y ACONDICIONAMIENTO FÍSICO DEL ADULTO MAYOR EN LA LOCALIDAD DE SANTA FE ","Inversión","Un nuevo contrato social y ambiental para la Bogotá del Siglo XXI",20,{"$f":"IF(ISERROR(VLOOKUP(K118,Proposito_programa!$C$2:$E$59,2,FALSE)),\" \",VLOOKUP(K118,Proposito_programa!$C$2:$E$59,2,FALSE))","v":"Bogotá, referente en cultura, deporte, recreación y actividad física, con parques para el desarrollo y la salud"},{"$f":"IF(ISERROR(VLOOKUP(K118,Proposito_programa!$C$2:$E$59,3,FALSE)),\" \",VLOOKUP(K118,Proposito_programa!$C$2:$E$59,3,FALSE))","v":"Propósito 1: Hacer un nuevo contrato social para incrementar la inclusión social, productiva y política"},2100,1,1010203835,"FELIPE ARNALDO PINEDA CUITIVA","Persona Natural",null,null,null,null,9600000,null,null,0,9600000,9600000,"2022-01-26","2022-02-01","2022-07-31",6,0,0,null,null,null,null,"Terminado",1]
["FDLSF-CPS-106-2022",2022,"FDLSF-CD-082-2022","FDLSF-CPS-106-2022","Contratos de prestación de servicios profesionales y de apoyo a la gestión","Contratación directa","Prestación de servicios profesionales y de apoyo a la gestión, o para la ejecución de trabajos artísticos que sólo puedan encomendarse a determinadas personas naturales","PRESTAR SUS SERVICIOS COMO APOYO EN LAS ACTIVIDADES PREVISTAS PARA LA IMPLEMENTACIÓN DE PROCESOS DE FORMACIÓN DEPORTIVA Y ACONDICIONAMIENTO FÍSICO DEL ADULTO MAYOR EN LA LOCALIDAD DE SANTA FE ","Inversión","Un nuevo contrato social y ambiental para la Bogotá del Siglo XXI",20,{"$f":"IF(ISERROR(VLOOKUP(K119,Proposito_programa!$C$2:$E$59,2,FALSE)),\" \",VLOOKUP(K119,Proposito_programa!$C$2:$E$59,2,FALSE))","v":"Bogotá, referente en cultura, deporte, recreación y actividad física, con parques para el desarrollo y la salud"},{"$f":"IF(ISERROR(VLOOKUP(K119,Proposito_programa!$C$2:$E$59,3,FALSE)),\" \",VLOOKUP(K119,Proposito_programa!$C$2:$E$59,3,FALSE))","v":"Propósito 1: Hacer un nuevo contrato social para incrementar la inclusión social, productiva y política"},2100,1,1032452170,"SERGIO ANDRES PINZON TORRES","Persona Natural",null,null,null,null,9600000,null,null,0,9600000,9600000,"2022-01-26","2022-02-01","2022-07-31",6,0,0,null,null,null,null,"Terminado",1]
["FDLSF-CPS-107-2022",2022,"FDLSF-CD-082-2022","FDLSF-CPS-107-2022","Contratos de prestación de servicios profesionales y de apoyo a la gestión","Contratación directa","Prestación de servicios profesionales y de apoyo a la gestión, o para la ejecución de trabajos artísticos que sólo puedan encomendarse a determinadas personas naturales","PRESTAR SUS SERVICIOS COMO APOYO EN LAS ACTIVIDADES PREVISTAS PARA LA IMPLEMENTACIÓN DE PROCESOS DE FORMACIÓN DEPORTIVA Y ACONDICIONAMIENTO FÍSICO DEL ADULTO MAYOR EN LA LOCALIDAD DE SANTA FE ","Inversión","Un nuevo contrato social y ambiental para la Bogotá del Siglo XXI",20,{"$f":"IF(ISERROR(VLOOKUP(K120,Proposito_programa!$C$2:$E$59,2,FALSE)),\" \",VLOOKUP(K120,Proposito_programa!$C$2:$E$59,2,FALSE))","v":"Bogotá, referente en cultura, deporte, recreación y actividad física, con parques para el desarrollo y la salud"},{"$f":"IF(ISERROR(VLOOKUP(K120,Proposito_programa!$C$2:$E$59,3,FALSE)),\" \",VLOOKUP(K120,Proposito_programa!$C$2:$E$59,3,FALSE))","v":"Propósito 1: Hacer un nuevo contrato social para incrementar la inclusión social, productiva y política"},2100,1,1019039231,"JHON JAIRO GALINDO RONDON ","Persona Natural",null,null,null,null,9600000,null,null,0,9600000,9280000,"2022-01-26","2022-02-01","2022-07-31",6,0,0,1019039231,"JHON JAIRO GALINDO RONDON ","2022-02-17",null,"Terminado",0.96666666666666667]
["FDLSF-CPS-108-2022",2022,"FDLSF-CD-082-2022","FDLSF-CPS-108-2022","Contratos de prestación de servicios profesionales y de apoyo a la gestión","Contratación directa","Prestación de servicios profesionales y de apoyo a la gestión, o para la ejecución de trabajos artísticos que sólo puedan encomendarse a determinadas personas naturales","PRESTAR SUS SERVICIOS COMO APOYO EN LAS ACTIVIDADES PREVISTAS PARA LA IMPLEMENTACIÓN DE PROCESOS DE FORMACIÓN DEPORTIVA Y ACONDICIONAMIENTO FÍSICO DEL ADULTO MAYOR EN LA LOCALIDAD DE SANTA FE ","Inversión","Un nuevo contrato social y ambiental para la Bogotá del Siglo XXI",20,{"$f":"IF(ISERROR(VLOOKUP(K121,Proposito_programa!$C$2:$E$59,2,FALSE)),\" \",VLOOKUP(K121,Proposito_programa!$C$2:$E$59,2,FALSE))","v":"Bogotá, referente en cultura, deporte, recreación y actividad física, con parques para el desarrollo y la salud"},{"$f":"IF(ISERROR(VLOOKUP(K121,Proposito_programa!$C$2:$E$59,3,FALSE)),\" \",VLOOKUP(K121,Proposito_programa!$C$2:$E$59,3,FALSE))","v":"Propósito 1: Hacer un nuevo contrato social para incrementar la inclusión social, productiva y política"},2100,1,1026305458,"DANIEL ALBERTO VEGA LOPEZ","Persona Natural",null,null,null,null,9600000,null,null,0,9600000,9600000,"2022-01-26","2022-02-01","2022-07-31",6,0,0,null,null,null,null,"Terminado",1]
["FDLSF-CPS-109-2022",2022,"FDLSF-CD-092-2022","FDLSF-CPS-109-2022","Contratos de prestación de servicios profesionales y de apoyo a la gestión","Contratación directa","Prestación de servicios profesionales y de apoyo a la gestión, o para la ejecución de trabajos artísticos que sólo puedan encomendarse a determinadas personas naturales"," PRESTAR SERVICIOS COMO INSTRUCTOR EN PROCESOS DE FORMACIÓN DEPORTIVA Y ACONDICIONAMIENTO FÍSICO DEL ADULTO MAYOR EN LA LOCALIDAD DE SANTA FE ","Inversión","Un nuevo contrato social y ambiental para la Bogotá del Siglo XXI",20,{"$f":"IF(ISERROR(VLOOKUP(K122,Proposito_programa!$C$2:$E$59,2,FALSE)),\" \",VLOOKUP(K122,Proposito_programa!$C$2:$E$59,2,FALSE))","v":"Bogotá, referente en cultura, deporte, recreación y actividad física, con parques para el desarrollo y la salud"},{"$f":"IF(ISERROR(VLOOKUP(K122,Proposito_programa!$C$2:$E$59,3,FALSE)),\" \",VLOOKUP(K122,Proposito_programa!$C$2:$E$59,3,FALSE))","v":"Propósito 1: Hacer un nuevo contrato social para incrementar la inclusión social, productiva y política"},2100,1,1026284712,"CRISTIAN CAMILO TINTIN HERRERA","Persona Natural",null,null,null,null,17760000,null,null,0,17760000,17760000,"2022-01-26","2022-02-01","2022-07-31",6,0,0,null,null,null,null,"Terminado",1]
["FDLSF-CPS-110-2022",2022,"FDLSF-CD-093-2022","FDLSF-CPS-110-2022","Contratos de prestación de servicios profesionales y de apoyo a la gestión","Contratación directa","Prestación de servicios profesionales y de apoyo a la gestión, o para la ejecución de trabajos artísticos que sólo puedan encomendarse a determinadas personas naturales","PRESTAR SERVICIOS COMO INSTRUCTOR EN PROCESOS DE FORMACIÓN DEPORTIVA Y ACONDICIONAMIENTO FÍSICO DEL ADULTO MAYOR EN LA LOCALIDAD DE SANTA FE ","Inversión","Un nuevo contrato social y ambiental para la Bogotá del Siglo XXI",20,{"$f":"IF(ISERROR(VLOOKUP(K123,Proposito_programa!$C$2:$E$59,2,FALSE)),\" \",VLOOKUP(K123,Proposito_programa!$C$2:$E$59,2,FALSE))","v":"Bogotá, referente en cultura, deporte, recreación y actividad física, con parques para el desarrollo y la salud"},{"$f":"IF(ISERROR(VLOOKUP(K123,Proposito_programa!$C$2:$E$59,3,FALSE)),\" \",VLOOKUP(K123,Proposito_programa!$C$2:$E$59,3,FALSE))","v":"Propósito 1: Hacer un nuevo contrato social para incrementar la inclusión social, productiva y política"},2100,1,1042214190,"EDGAR MAURICIO MENESES HERNANDEZ","Persona Natural",null,null,null,null,17760000,null,null,0,17760000,17760000,"2022-01-26","2022-02-01","2022-07-31",6,0,0,null,null,null,null,"Terminado",1]
["FDLSF-CPS-111-2022",2022,"FDLSF-CD-094-2022","FDLSF-CPS-111-2022","Contratos de prestación de servicios profesionales y de apoyo a la gestión","Contratación directa","Prestación de servicios profesionales y de apoyo a la gestión, o para la ejecución de trabajos artísticos que sólo puedan encomendarse a determinadas personas naturales"," PRESTAR SERVICIOS COMO INSTRUCTOR EN PROCESOS DE FORMACIÓN DEPORTIVA Y ACONDICIONAMIENTO FÍSICO DEL ADULTO MAYOR EN LA LOCALIDAD DE SANTA FE ","Inversión","Un nuevo contrato social y ambiental para la Bogotá del Siglo XXI",20,{"$f":"IF(ISERROR(VLOOKUP(K124,Proposito_programa!$C$2:$E$59,2,FALSE)),\" \",VLOOKUP(K124,Proposito_programa!$C$2:$E$59,2,FALSE))","v":"Bogotá, referente en cultura, deporte, recreación y actividad física, con parques para el desarrollo y la salud"},{"$f":"IF(ISERROR(VLOOKUP(K124,Proposito_programa!$C$2:$E$59,3,FALSE)),\" \",VLOOKUP(K124,Proposito_programa!$C$2:$E$59,3,FALSE))","v":"Propósito 1: Hacer un nuevo contrato social para incrementar la inclusión social, productiva y política"},2100,1,94070749,"JORGE ELIVER RIOS ASPRILLA","Persona Natural",null,null,null,null,17760000,null,null,0,17760000,17760000,"2022-01-26","2022-02-01","2022-07-31",6,0,0,null,null,null,null,"Terminado",1]
["FDLSF-CPS-112-2022",2022,"FDLSF-CD-094-2022","FDLSF-CPS-112-2022","Contratos de prestación de servicios profesionales y de apoyo a la gestión","Contratación directa","Prestación de servicios profesionales y de apoyo a la gestión, o para la ejecución de trabajos artísticos que sólo puedan encomendarse a determinadas personas naturales"," PRESTAR SERVICIOS COMO INSTRUCTOR EN PROCESOS DE FORMACIÓN DEPORTIVA Y ACONDICIONAMIENTO FÍSICO DEL ADULTO MAYOR EN LA LOCALIDAD DE SANTA FE ","Inversión","Un nuevo contrato social y ambiental para la Bogotá del Siglo XXI",20,{"$f":"IF(ISERROR(VLOOKUP(K125,Proposito_programa!$C$2:$E$59,2,FALSE)),\" \",VLOOKUP(K125,Proposito_programa!$C$2:$E$59,2,FALSE))","v":"Bogotá, referente en cultura, deporte, recreación y actividad física, con parques para el desarrollo y la salud"},{"$f":"IF(ISERROR(VLOOKUP(K125,Proposito_programa!$C$2:$E$59,3,FALSE)),\" \",VLOOKUP(K125,Proposito_programa!$C$2:$E$59,3,FALSE))","v":"Propósito 1: Hacer un nuevo contrato social para incrementar la inclusión social, productiva y política"},2100,1,52747046,"YULY PAOLA GRANADOS LEAL","Persona Natural",null,null,null,null,17760000,null,null,0,17760000,17760000,"2022-01-26","2022-02-01","2022-07-31",6,0,0,null,null,null,null,"Terminado",1]
["FDLSF-CPS-113-2022",2022,"FDLSF-CD-070-2022","FDLSF-CPS-113-2022","Contratos de prestación de servicios profesionales y de apoyo a la gestión","Contratación directa","Prestación de servicios profesionales y de apoyo a la gestión, o para la ejecución de trabajos artísticos que sólo puedan encomendarse a determinadas personas naturales","PRESTAR SUS SERVICIOS PROFESIONALES AL DESPACHO EN LOS ASPECTOS RELACIONADOS CON PRODUCTIVIDAD, EMPRENDIMIENTO Y DESARROLLO EMPRESARIAL DE LA LOCALIDAD DE SANTA FE","Inversión","Un nuevo contrato social y ambiental para la Bogotá del Siglo XXI",57,{"$f":"IF(ISERROR(VLOOKUP(K126,Proposito_programa!$C$2:$E$59,2,FALSE)),\" \",VLOOKUP(K126,Proposito_programa!$C$2:$E$59,2,FALSE))","v":"Gestión pública local"},{"$f":"IF(ISERROR(VLOOKUP(K126,Proposito_programa!$C$2:$E$59,3,FALSE)),\" \",VLOOKUP(K126,Proposito_programa!$C$2:$E$59,3,FALSE))","v":"Propósito 5: Construir Bogotá - Región con gobierno abierto, transparente y ciudadanía consciente"},2105,1,79115862,"FERNANDO ZULUAGA FLOREZ","Persona Natural",null,null,null,null,42700000,null,null,0,42700000,42699999,"2022-01-21","2022-01-24","2022-08-23",7,0,0,null,null,null,null,"Terminado",0.9999999765807962]
["FDLSF-CPS-114-2022",2022,"FDLSF-CD-095-2022","FDLSF-CPS-114-2022","Contratos de prestación de servicios profesionales y de apoyo a la gestión","Contratación directa","Prestación de servicios profesionales y de apoyo a la gestión, o para la ejecución de trabajos artísticos que sólo puedan encomendarse a determinadas personas naturales","PRESTAR SERVICIOS PROFESIONALES PARA BRINDAR LINEAMIENTOS JURIDICOS, EVALUAR Y ORIENTAR TEMAS PRIORITARIOS DE LA ALCALDIA LOCAL DE SANTA FE PARA EL CUMPLIMIENTO DE LAS REGULACIONES EN MATERIA DE DERECHO ADMINISTRATIVO APLICABLES EN LA ALCALDIA LOCAL. ","Inversión","Un nuevo contrato social y ambiental para la Bogotá del Siglo XXI",57,{"$f":"IF(ISERROR(VLOOKUP(K127,Proposito_programa!$C$2:$E$59,2,FALSE)),\" \",VLOOKUP(K127,Proposito_programa!$C$2:$E$59,2,FALSE))","v":"Gestión pública local"},{"$f":"IF(ISERROR(VLOOKUP(K127,Proposito_programa!$C$2:$E$59,3,FALSE)),\" \",VLOOKUP(K127,Proposito_programa!$C$2:$E$59,3,FALSE))","v":"Propósito 5: Construir Bogotá - Región con gobierno abierto, transparente y ciudadanía consciente"},2105,1,1101451439,"ANA RAQUEL BLANCO SOTELO","Persona Natural",null,null,null,null,42700000,null,null,0,42700000,42700000,"2022-01-21","2022-01-24","2022-08-23",7,0,0,1101451439,"ANA RAQUEL BLANCO SOTELO","2022-02-23",null,"Terminado",1]
["FDLSF-CPS-115-2022",2022,"FDLSF-CD-086-2022","FDLSF-CPS-115-2022","Contratos de prestación de servicios profesionales y de apoyo a la gestión","Contratación directa","Prestación de servicios profesionales y de apoyo a la gestión, o para la ejecución de trabajos artísticos que sólo puedan encomendarse a determinadas personas naturales","PRESTAR SERVICIOS COMO INSTRUCTOR EN PROCESOS DE FORMACIÓN DEPORTIVA Y ACONDICIONAMIENTO FÍSICO DEL ADULTO MAYOR EN LA LOCALIDAD DE SANTA FE ","Inversión","Un nuevo contrato social y ambiental para la Bogotá del Siglo XXI",20,{"$f":"IF(ISERROR(VLOOKUP(K128,Proposito_programa!$C$2:$E$59,2,FALSE)),\" \",VLOOKUP(K128,Proposito_programa!$C$2:$E$59,2,FALSE))","v":"Bogotá, referente en cultura, deporte, recreación y actividad física, con parques para el desarrollo y la salud"},{"$f":"IF(ISERROR(VLOOKUP(K128,Proposito_programa!$C$2:$E$59,3,FALSE)),\" \",VLOOKUP(K128,Proposito_programa!$C$2:$E$59,3,FALSE))","v":"Propósito 1: Hacer un nuevo contrato social para incrementar la inclusión social, productiva y política"},2100,1,79115862,"SANDRA AZUCENA SOTELO PERDOMO","Persona Natural",null,null,null,null,17760000,null,null,0,17760000,17464000,"2022-01-24","2022-02-01","2022-07-31",6,0,0,79115862,"SANDRA AZUCENA SOTELO PERDOMO","2022-04-04",null,"Terminado",0.98333333333333328]
["FDLSF-CPS-116-2022",2022,"FDLSF-CD-087-2022","FDLSF-CPS-116-2022","Contratos de prestación de servicios profesionales y de apoyo a la gestión","Contratación directa","Prestación de servicios profesionales y de apoyo a la gestión, o para la ejecución de trabajos artísticos que sólo puedan encomendarse a determinadas personas naturales","PRESTAR SERVICIOS COMO INSTRUCTOR EN PROCESOS DE FORMACIÓN DEPORTIVA Y ACONDICIONAMIENTO FÍSICO DEL ADULTO MAYOR EN LA LOCALIDAD DE SANTA FE ","Inversión","Un nuevo contrato social y ambiental para la Bogotá del Siglo XXI",20,{"$f":"IF(ISERROR(VLOOKUP(K129,Proposito_programa!$C$2:$E$59,2,FALSE)),\" \",VLOOKUP(K129,Proposito_programa!$C$2:$E$59,2,FALSE))","v":"Bogotá, referente en cultura, deporte, recreación y actividad física, con parques para el desarrollo y la salud"},{"$f":"IF(ISERROR(VLOOKUP(K129,Proposito_programa!$C$2:$E$59,3,FALSE)),\" \",VLOOKUP(K129,Proposito_programa!$C$2:$E$59,3,FALSE))","v":"Propósito 1: Hacer un nuevo contrato social para incrementar la inclusión social, productiva y política"},2100,1,1020818905,"JHOAN NICOLAS LOPEZ DONATO","Persona Natural",null,null,null,null,17760000,null,null,0,17760000,17760000,"2022-01-24","2022-02-01","2022-07-31",6,0,0,null,null,null,null,"Terminado",1]
["FDLSF-CPS-117-2022",2022,"FDLSF-CD-088-2022","FDLSF-CPS-117-2022","Contratos de prestación de servicios profesionales y de apoyo a la gestión","Contratación directa","Prestación de servicios profesionales y de apoyo a la gestión, o para la ejecución de trabajos artísticos que sólo puedan encomendarse a determinadas personas naturales","PRESTAR SERVICIOS COMO INSTRUCTOR EN PROCESOS DE FORMACIÓN DEPORTIVA Y ACONDICIONAMIENTO FÍSICO DEL ADULTO MAYOR EN LA LOCALIDAD DE SANTA FE ","Inversión","Un nuevo contrato social y ambiental para la Bogotá del Siglo XXI",20,{"$f":"IF(ISERROR(VLOOKUP(K130,Proposito_programa!$C$2:$E$59,2,FALSE)),\" \",VLOOKUP(K130,Proposito_programa!$C$2:$E$59,2,FALSE))","v":"Bogotá, referente en cultura, deporte, recreación y actividad física, con parques para el desarrollo y la salud"},{"$f":"IF(ISERROR(VLOOKUP(K130,Proposito_programa!$C$2:$E$59,3,FALSE)),\" \",VLOOKUP(K130,Proposito_programa!$C$2:$E$59,3,FALSE))","v":"Propósito 1: Hacer un nuevo contrato social para incrementar la inclusión social, productiva y política"},2100,1,1033760005,"DUBAN SLATER FINO REINOSO","Persona Natural",null,null,null,null,17760000,null,null,0,17760000,17760000,"2022-01-24","2022-02-01","2022-07-31",6,0,0,null,null,null,null,"Terminado",1]
["FDLSF-CPS-118-2022",2022,"FDLSF-CD-089-2022","FDLSF-CPS-118-2022","Contratos de prestación de servicios profesionales y de apoyo a la gestión","Contratación directa","Prestación de servicios profesionales y de apoyo a la gestión, o para la ejecución de trabajos artísticos que sólo puedan encomendarse a determinadas personas naturales"," PRESTAR SERVICIOS COMO INSTRUCTOR EN PROCESOS DE FORMACIÓN DEPORTIVA Y ACONDICIONAMIENTO FÍSICO DEL ADULTO MAYOR EN LA LOCALIDAD DE SANTA FE ","Inversión","Un nuevo contrato social y ambiental para la Bogotá del Siglo XXI",20,{"$f":"IF(ISERROR(VLOOKUP(K131,Proposito_programa!$C$2:$E$59,2,FALSE)),\" \",VLOOKUP(K131,Proposito_programa!$C$2:$E$59,2,FALSE))","v":"Bogotá, referente en cultura, deporte, recreación y actividad física, con parques para el desarrollo y la salud"},{"$f":"IF(ISERROR(VLOOKUP(K131,Proposito_programa!$C$2:$E$59,3,FALSE)),\" \",VLOOKUP(K131,Proposito_programa!$C$2:$E$59,3,FALSE))","v":"Propósito 1: Hacer un nuevo contrato social para incrementar la inclusión social, productiva y política"},2100,1,1026298169,"ADRIAN FELIPE SANCHEZ FLAUTERO","Persona Natural",null,null,null,null,17760000,null,null,0,17760000,17760000,"2022-01-24","2022-02-01","2022-07-31",6,0,0,null,null,null,null,"Terminado",1]
["FDLSF-CPS-119-2022",2022,"FDLSF-CD-044-2022","FDLSF-CPS-119-2022","Contratos de prestación de servicios profesionales y de apoyo a la gestión","Contratación directa","Prestación de servicios profesionales y de apoyo a la gestión, o para la ejecución de trabajos artísticos que sólo puedan encomendarse a determinadas personas naturales","APOYAR ADMINISTRATIVA Y ASISTENCIALMENTE A LAS INSPECCIONES DE POLICÍA DE LA LOCALIDAD ","Inversión","Un nuevo contrato social y ambiental para la Bogotá del Siglo XXI",57,{"$f":"IF(ISERROR(VLOOKUP(K132,Proposito_programa!$C$2:$E$59,2,FALSE)),\" \",VLOOKUP(K132,Proposito_programa!$C$2:$E$59,2,FALSE))","v":"Gestión pública local"},{"$f":"IF(ISERROR(VLOOKUP(K132,Proposito_programa!$C$2:$E$59,3,FALSE)),\" \",VLOOKUP(K132,Proposito_programa!$C$2:$E$59,3,FALSE))","v":"Propósito 5: Construir Bogotá - Región con gobierno abierto, transparente y ciudadanía consciente"},2105,1,1136887920,"SERGIO STEVEN GARZON SANABRIA","Persona Natural",null,null,null,null,16450000,null,null,0,16450000,16450000,"2022-01-24","2022-01-25","2022-08-24",7,0,0,null,null,null,null,"Terminado",1]
["FDLSF-CPS-120-2022",2022,"FDLSF-CD-044-2022","FDLSF-CPS-120-2022","Contratos de prestación de servicios profesionales y de apoyo a la gestión","Contratación directa","Prestación de servicios profesionales y de apoyo a la gestión, o para la ejecución de trabajos artísticos que sólo puedan encomendarse a determinadas personas naturales","APOYAR ADMINISTRATIVA Y ASISTENCIALMENTE A LAS INSPECCIONES DE POLICÍA DE LA LOCALIDAD","Inversión","Un nuevo contrato social y ambiental para la Bogotá del Siglo XXI",57,{"$f":"IF(ISERROR(VLOOKUP(K133,Proposito_programa!$C$2:$E$59,2,FALSE)),\" \",VLOOKUP(K133,Proposito_programa!$C$2:$E$59,2,FALSE))","v":"Gestión pública local"},{"$f":"IF(ISERROR(VLOOKUP(K133,Proposito_programa!$C$2:$E$59,3,FALSE)),\" \",VLOOKUP(K133,Proposito_programa!$C$2:$E$59,3,FALSE))","v":"Propósito 5: Construir Bogotá - Región con gobierno abierto, transparente y ciudadanía consciente"},2105,1,1014210029,"NICOLAS ANDRES PAEZ BECERRA","Persona Natural",null,null,null,null,16450000,null,null,0,16450000,16450000,"2022-01-24","2022-01-25","2022-08-24",7,0,0,null,null,null,null,"Terminado",1]
["FDLSF-CPS-121-2022",2022,"FDLSF-CD-045-2022","FDLSF-CPS-121-2022","Contratos de prestación de servicios profesionales y de apoyo a la gestión","Contratación directa","Prestación de servicios profesionales y de apoyo a la gestión, o para la ejecución de trabajos artísticos que sólo puedan encomendarse a determinadas personas naturales","APOYAR JURÍDICAMENTE LA EJECUCIÓN DE LAS ACCIONES REQUERIDAS PARA LA DEPURACIÓN DE LAS ACTUACIONES ADMINISTRATIVAS QUE CURSAN EN LA ALCALDÍA LOCAL","Inversión","Un nuevo contrato social y ambiental para la Bogotá del Siglo XXI",57,{"$f":"IF(ISERROR(VLOOKUP(K134,Proposito_programa!$C$2:$E$59,2,FALSE)),\" \",VLOOKUP(K134,Proposito_programa!$C$2:$E$59,2,FALSE))","v":"Gestión pública local"},{"$f":"IF(ISERROR(VLOOKUP(K134,Proposito_programa!$C$2:$E$59,3,FALSE)),\" \",VLOOKUP(K134,Proposito_programa!$C$2:$E$59,3,FALSE))","v":"Propósito 5: Construir Bogotá - Región con gobierno abierto, transparente y ciudadanía consciente"},2105,1,1010218952,"KEVIN OSWALDO LEIVA QUIMBAYO","Persona Natural",null,null,null,null,33600000,null,null,0,33600000,33120000,"2022-01-24","2022-02-04","2022-09-03",7,0,0,null,null,null,null,"Terminado",0.98571428571428577]
["FDLSF-CPS-122-2022",2022,"FDLSF-CD-083-2022","FDLSF-CPS-122-2022","Contratos de prestación de servicios profesionales y de apoyo a la gestión","Contratación directa","Prestación de servicios profesionales y de apoyo a la gestión, o para la ejecución de trabajos artísticos que sólo puedan encomendarse a determinadas personas naturales","PRESTAR SERVICIOS PROFESIONALES COMO COORDINADOR DE ADULTO MAYOR PARA LA VIGENCIA 2022 EN MARCO DE LAS INICIATIVAS CIUDADANAS PROPUESTAS Y RELACIONADAS CON FORMACIÓN DEPORTIVA EN EL PROYECTO 2100 'SANTA FE, REFERENTE EN CULTURA, DEPORTE, RECREACIÓN Y ACTIVIDAD FÍSICA, CON PARQUES PARA EL DESARROLLO Y LA SALUD","Inversión","Un nuevo contrato social y ambiental para la Bogotá del Siglo XXI",20,{"$f":"IF(ISERROR(VLOOKUP(K135,Proposito_programa!$C$2:$E$59,2,FALSE)),\" \",VLOOKUP(K135,Proposito_programa!$C$2:$E$59,2,FALSE))","v":"Bogotá, referente en cultura, deporte, recreación y actividad física, con parques para el desarrollo y la salud"},{"$f":"IF(ISERROR(VLOOKUP(K135,Proposito_programa!$C$2:$E$59,3,FALSE)),\" \",VLOOKUP(K135,Proposito_programa!$C$2:$E$59,3,FALSE))","v":"Propósito 1: Hacer un nuevo contrato social para incrementar la inclusión social, productiva y política"},2100,1,1030574330,"DIANA MARCELA AVILA RINCON","Persona Natural",null,null,null,null,28800000,null,null,0,28800000,28800000,"2022-01-24","2022-02-01","2022-07-31",6,0,0,null,null,null,null,"Terminado",1]
["FDLSF-CPS-123-2022",2022,"FDLSF-CD-064-2022","FDLSF-CPS-123-2022","Contratos de prestación de servicios profesionales y de apoyo a la gestión","Contratación directa","Prestación de servicios profesionales y de apoyo a la gestión, o para la ejecución de trabajos artísticos que sólo puedan encomendarse a determinadas personas naturales","PRESTAR APOYO AL ÁREA GESTIÓN POLICÍVA Y ÁREA DE GESTIÓN DE DESARROLLO LOCAL EN LA CONDUCCIÓN DEL PARQUE AUTOMOTOR DEL FDLSF QUE LE SEA ASIGNADO","Inversión","Un nuevo contrato social y ambiental para la Bogotá del Siglo XXI",57,{"$f":"IF(ISERROR(VLOOKUP(K136,Proposito_programa!$C$2:$E$59,2,FALSE)),\" \",VLOOKUP(K136,Proposito_programa!$C$2:$E$59,2,FALSE))","v":"Gestión pública local"},{"$f":"IF(ISERROR(VLOOKUP(K136,Proposito_programa!$C$2:$E$59,3,FALSE)),\" \",VLOOKUP(K136,Proposito_programa!$C$2:$E$59,3,FALSE))","v":"Propósito 5: Construir Bogotá - Región con gobierno abierto, transparente y ciudadanía consciente"},2105,1,79977098,"MIGUEL ANGEL RODRIGUEZ COLORADO","Persona Natural",null,null,null,null,18900000,null,null,0,18900000,17640000,"2022-01-24","2022-01-25","2022-08-24",7,0,0,79977098,"MIGUEL ANGEL RODRIGUEZ COLORADO","2022-03-15",null,"Terminado",0.93333333333333335]
["FDLSF-CPS-124-2022",2022,"FDLSF-CD-032-2022","FDLSF-CPS-124-2022","Contratos de prestación de servicios profesionales y de apoyo a la gestión","Contratación directa","Prestación de servicios profesionales y de apoyo a la gestión, o para la ejecución de trabajos artísticos que sólo puedan encomendarse a determinadas personas naturales"," PRESTAR SERVICIO TECNICOS PARA LA OPERACIÒN DEL PUNTO VIVE DIGITAL DE LA LOCALIDAD DE SANTA FE ","Inversión","Un nuevo contrato social y ambiental para la Bogotá del Siglo XXI",57,{"$f":"IF(ISERROR(VLOOKUP(K137,Proposito_programa!$C$2:$E$59,2,FALSE)),\" \",VLOOKUP(K137,Proposito_programa!$C$2:$E$59,2,FALSE))","v":"Gestión pública local"},{"$f":"IF(ISERROR(VLOOKUP(K137,Proposito_programa!$C$2:$E$59,3,FALSE)),\" \",VLOOKUP(K137,Proposito_programa!$C$2:$E$59,3,FALSE))","v":"Propósito 5: Construir Bogotá - Región con gobierno abierto, transparente y ciudadanía consciente"},2105,1,1032358324,"SEBASTIAN HERRERA SERRATO","Persona Natural",null,null,null,null,20720000,null,null,0,20720000,18647999,"2022-01-25","2022-02-01","2022-11-21",7,1,45,null,null,null,null,"Terminado",0.89999995173745173]
["FDLSF-CPS-125-2022",2022,"FDLSF-CD-022-2022","FDLSF-CPS-125-2022","Contratos de prestación de servicios profesionales y de apoyo a la gestión","Contratación directa","Prestación de servicios profesionales y de apoyo a la gestión, o para la ejecución de trabajos artísticos que sólo puedan encomendarse a determinadas personas naturales","PRESTAR SERVICIOS TECNICOS DE APOYO AL ÁREA DE GESTIÓN DEL DESARROLLO DE LA ALCALDÍA LOCAL DE SANTA FE, EN TEMAS RELACIONADOS CON INFRAESTRUCTURA.","Inversión","Un nuevo contrato social y ambiental para la Bogotá del Siglo XXI",57,{"$f":"IF(ISERROR(VLOOKUP(K138,Proposito_programa!$C$2:$E$59,2,FALSE)),\" \",VLOOKUP(K138,Proposito_programa!$C$2:$E$59,2,FALSE))","v":"Gestión pública local"},{"$f":"IF(ISERROR(VLOOKUP(K138,Proposito_programa!$C$2:$E$59,3,FALSE)),\" \",VLOOKUP(K138,Proposito_programa!$C$2:$E$59,3,FALSE))","v":"Propósito 5: Construir Bogotá - Región con gobierno abierto, transparente y ciudadanía consciente"},2105,1,1018502859,"JOSE DANIEL ALARCON CORONADO","Persona Natural",null,null,null,null,32560000,null,1,2960000,35520000,30093333,"2022-01-24","2022-01-26","2023-01-25",11,1,30,null,null,null,null,"Terminado",0.84722221283783783]
["FDLSF-CPS-126-2022",2022,"FDLSF-CD-076-2022","FDLSF-CPS-126-2022","Contratos de prestación de servicios profesionales y de apoyo a la gestión","Contratación directa","Prestación de servicios profesionales y de apoyo a la gestión, o para la ejecución de trabajos artísticos que sólo puedan encomendarse a determinadas personas naturales","PRESTAR LOS SERVICIOS COMO OPERARIO PARA LA GESTIÓN EN ACTIVIDADES OPERATIVAS DE PLANTACIÓN, RECUPERACIÓN Y MANTENIMIENTO DE LAS COBERTURAS VEGETALES Y HUERTAS URBANAS EN LA LOCALIDAD DE SANTA FE, EN EL MARCO DE LAS INICIATIVAS CIUDADANAS DE PRESUPUESTOS PARTICIPATIVOS","Inversión","Un nuevo contrato social y ambiental para la Bogotá del Siglo XXI",24,{"$f":"IF(ISERROR(VLOOKUP(K139,Proposito_programa!$C$2:$E$59,2,FALSE)),\" \",VLOOKUP(K139,Proposito_programa!$C$2:$E$59,2,FALSE))","v":"Bogotá región emprendedora e innovadora"},{"$f":"IF(ISERROR(VLOOKUP(K139,Proposito_programa!$C$2:$E$59,3,FALSE)),\" \",VLOOKUP(K139,Proposito_programa!$C$2:$E$59,3,FALSE))","v":"Propósito 1: Hacer un nuevo contrato social para incrementar la inclusión social, productiva y política"},2123,1,1026258308,"IVAN DARIO PULIDO AGUDELO","Persona Natural",null,null,null,null,8460000,null,null,0,8460000,8460000,"2022-01-26","2022-02-01","2022-07-31",6,0,0,null,null,null,null,"Terminado",1]
["FDLSF-CPS-127-2022",2022,"FDLSF-CD-076-2022","FDLSF-CPS-127-2022","Contratos de prestación de servicios profesionales y de apoyo a la gestión","Contratación directa","Prestación de servicios profesionales y de apoyo a la gestión, o para la ejecución de trabajos artísticos que sólo puedan encomendarse a determinadas personas naturales","PRESTAR LOS SERVICIOS COMO OPERARIO PARA LA GESTIÓN EN ACTIVIDADES OPERATIVAS DE PLANTACIÓN, RECUPERACIÓN Y MANTENIMIENTO DE LAS COBERTURAS VEGETALES Y HUERTAS URBANAS EN LA LOCALIDAD DE SANTA FE, EN EL MARCO DE LAS INICIATIVAS CIUDADANAS DE PRESUPUESTOS PARTICIPATIVOS","Inversión","Un nuevo contrato social y ambiental para la Bogotá del Siglo XXI",24,{"$f":"IF(ISERROR(VLOOKUP(K140,Proposito_programa!$C$2:$E$59,2,FALSE)),\" \",VLOOKUP(K140,Proposito_programa!$C$2:$E$59,2,FALSE))","v":"Bogotá región emprendedora e innovadora"},{"$f":"IF(ISERROR(VLOOKUP(K140,Proposito_programa!$C$2:$E$59,3,FALSE)),\" \",VLOOKUP(K140,Proposito_programa!$C$2:$E$59,3,FALSE))","v":"Propósito 1: Hacer un nuevo contrato social para incrementar la inclusión social, productiva y política"},2123,1,52089975,"ANA INES DIAZ BOTIA","Persona Natural",null,null,null,null,8460000,null,null,0,8460000,8460000,"2022-01-26","2022-01-28","2022-07-27",6,0,0,null,null,null,null,"Terminado",1]
["FDLSF-CPS-128-2022",2022,"FDLSF-CD-015-2022","FDLSF-CPS-128-2022","Contratos de prestación de servicios profesionales y de apoyo a la gestión","Contratación directa","Prestación de servicios profesionales y de apoyo a la gestión, o para la ejecución de trabajos artísticos que sólo puedan encomendarse a determinadas personas naturales","APOYAR EN LAS TAREAS OPERATIVAS DE CARÁCTER ARCHIVÍSTICO DESARROLLADAS EN LA ALCALDÍA LOCAL PARA GARANTIZAR LA APLICACIÓN CORRECTA DE LOS PROCEDIMIENTOS TÉCNICOS.","Inversión","Un nuevo contrato social y ambiental para la Bogotá del Siglo XXI",57,{"$f":"IF(ISERROR(VLOOKUP(K141,Proposito_programa!$C$2:$E$59,2,FALSE)),\" \",VLOOKUP(K141,Proposito_programa!$C$2:$E$59,2,FALSE))","v":"Gestión pública local"},{"$f":"IF(ISERROR(VLOOKUP(K141,Proposito_programa!$C$2:$E$59,3,FALSE)),\" \",VLOOKUP(K141,Proposito_programa!$C$2:$E$59,3,FALSE))","v":"Propósito 5: Construir Bogotá - Región con gobierno abierto, transparente y ciudadanía consciente"},2105,1,52039924,"MARYBEL GAITAN CORTES","Persona Natural",null,null,null,null,25620000,null,null,0,25620000,25620000,"2022-01-25","2022-01-26","2022-08-25",7,0,0,null,null,null,null,"Terminado",1]
["FDLSF-CPS-129-2022",2022,"FDLSF-CD-076-2022","FDLSF-CPS-129-2022","Contratos de prestación de servicios profesionales y de apoyo a la gestión","Contratación directa","Prestación de servicios profesionales y de apoyo a la gestión, o para la ejecución de trabajos artísticos que sólo puedan encomendarse a determinadas personas naturales","PRESTAR LOS SERVICIOS COMO OPERARIO PARA LA GESTIÓN EN ACTIVIDADES OPERATIVAS DE PLANTACIÓN, RECUPERACIÓN Y MANTENIMIENTO DE LAS COBERTURAS VEGETALES Y HUERTAS URBANAS EN LA LOCALIDAD DE SANTA FE, EN EL MARCO DE LAS INICIATIVAS CIUDADANAS DE PRESUPUESTOS PARTICIPATIVOS","Inversión","Un nuevo contrato social y ambiental para la Bogotá del Siglo XXI",24,{"$f":"IF(ISERROR(VLOOKUP(K142,Proposito_programa!$C$2:$E$59,2,FALSE)),\" \",VLOOKUP(K142,Proposito_programa!$C$2:$E$59,2,FALSE))","v":"Bogotá región emprendedora e innovadora"},{"$f":"IF(ISERROR(VLOOKUP(K142,Proposito_programa!$C$2:$E$59,3,FALSE)),\" \",VLOOKUP(K142,Proposito_programa!$C$2:$E$59,3,FALSE))","v":"Propósito 1: Hacer un nuevo contrato social para incrementar la inclusión social, productiva y política"},2123,1,1026262563,"MERLY PAOLA CASALLAS RIOS","Persona Natural",null,null,null,null,8460000,null,null,0,8460000,8460000,"2022-01-26","2022-01-28","2022-07-27",6,0,0,null,null,null,null,"Terminado",1]
["FDLSF-CPS-130-2022",2022,"FDLSF-CD-085-2022","FDLSF-CPS-130-2022","Contratos de prestación de servicios profesionales y de apoyo a la gestión","Contratación directa","Prestación de servicios profesionales y de apoyo a la gestión, o para la ejecución de trabajos artísticos que sólo puedan encomendarse a determinadas personas naturales","PRESTAR LOS SERVICIOS TÉCNICOS DE APOYO EN CAMPO PARA LA IMPLEMENTACIÓN DE ACCIONES PARA EL FOMENTO DE LA AGRICULTURA URBANA Y COBERTURAS VERDES EN LA LOCALIDAD DE SANTA FE","Inversión","Un nuevo contrato social y ambiental para la Bogotá del Siglo XXI",24,{"$f":"IF(ISERROR(VLOOKUP(K143,Proposito_programa!$C$2:$E$59,2,FALSE)),\" \",VLOOKUP(K143,Proposito_programa!$C$2:$E$59,2,FALSE))","v":"Bogotá región emprendedora e innovadora"},{"$f":"IF(ISERROR(VLOOKUP(K143,Proposito_programa!$C$2:$E$59,3,FALSE)),\" \",VLOOKUP(K143,Proposito_programa!$C$2:$E$59,3,FALSE))","v":"Propósito 1: Hacer un nuevo contrato social para incrementar la inclusión social, productiva y política"},2123,1,80768937,"EDWIN ALONSO NIÑO FERRER","Persona Natural",null,null,null,null,17760000,null,null,0,17760000,17760000,"2022-01-25","2022-01-27","2022-07-26",6,0,0,null,null,null,null,"Terminado",{"$f":"IF(ISERROR(AB143/AA143),\"-\",(AB143/AA143))","v":1}]
["FDLSF-CPS-131-2022",2022,"FDLSF-CD-034-2022","FDLSF-CPS-131-2022","Contratos de prestación de servicios profesionales y de apoyo a la gestión","Contratación directa","Prestación de servicios profesionales y de apoyo a la gestión, o para la ejecución de trabajos artísticos que sólo puedan encomendarse a determinadas personas naturales"," PRESTAR SERVICIOS DE APOYO TÉCNICO AL ÁREA DE GESTIÓN POLICIVA, EN EL DESARROLLO DE LAS ACTIVIDADES PROPIAS DEL ÁREA ","Inversión","Un nuevo contrato social y ambiental para la Bogotá del Siglo XXI",57,{"$f":"IF(ISERROR(VLOOKUP(K144,Proposito_programa!$C$2:$E$59,2,FALSE)),\" \",VLOOKUP(K144,Proposito_programa!$C$2:$E$59,2,FALSE))","v":"Gestión pública local"},{"$f":"IF(ISERROR(VLOOKUP(K144,Proposito_programa!$C$2:$E$59,3,FALSE)),\" \",VLOOKUP(K144,Proposito_programa!$C$2:$E$59,3,FALSE))","v":"Propósito 5: Construir Bogotá - Región con gobierno abierto, transparente y ciudadanía consciente"},2105,1,1018418087,"JHON FERNANDO FUENTES ROJAS","Persona Natural",null,null,null,null,30240000,null,null,0,30240000,30240000,"2022-01-25","2022-01-26","2022-08-25",7,0,0,null,null,null,null,"Terminado",1]
["FDLSF-CPS-132-2022",2022,"FDLSF-CD-012-2022","FDLSF-CPS-132-2022","Contratos de prestación de servicios profesionales y de apoyo a la gestión","Contratación directa","Prestación de servicios profesionales y de apoyo a la gestión, o para la ejecución de trabajos artísticos que sólo puedan encomendarse a determinadas personas naturales","APOYAR AL ALCALDE LOCAL EN LA PROMOCIÓN, ACOMPAÑAMIENTO, COORDINACIÓN Y ATENCIÓN DE LAS INSTANCIAS DE COORDINACIÓN INTERINSTITUCIONALES Y LAS INSTANCIAS DE PARTICIPACIÓN LOCALES, ASÍ COMO LOS PROCESOS COMUNITARIOS EN LA LOCALIDAD ","Inversión","Un nuevo contrato social y ambiental para la Bogotá del Siglo XXI",57,{"$f":"IF(ISERROR(VLOOKUP(K145,Proposito_programa!$C$2:$E$59,2,FALSE)),\" \",VLOOKUP(K145,Proposito_programa!$C$2:$E$59,2,FALSE))","v":"Gestión pública local"},{"$f":"IF(ISERROR(VLOOKUP(K145,Proposito_programa!$C$2:$E$59,3,FALSE)),\" \",VLOOKUP(K145,Proposito_programa!$C$2:$E$59,3,FALSE))","v":"Propósito 5: Construir Bogotá - Región con gobierno abierto, transparente y ciudadanía consciente"},2105,1,1026270004,"YULI ANDREA RODRIGUEZ","Persona Natural",null,null,null,null,33600000,null,null,0,33600000,32480000,"2022-01-24","2022-01-27","2022-08-26",7,0,0,1026270004,"YULI ANDREA RODRIGUEZ","2022-04-18",null,"Terminado",0.96666666666666667]
["FDLSF-CPS-133-2022",2022,"FDLSF-CD-012-2022","FDLSF-CPS-133-2022","Contratos de prestación de servicios profesionales y de apoyo a la gestión","Contratación directa","Prestación de servicios profesionales y de apoyo a la gestión, o para la ejecución de trabajos artísticos que sólo puedan encomendarse a determinadas personas naturales","APOYAR AL ALCALDE LOCAL EN LA PROMOCIÓN, ACOMPAÑAMIENTO, COORDINACIÓN Y ATENCIÓN DE LAS INSTANCIAS DE COORDINACIÓN INTERINSTITUCIONALES Y LAS INSTANCIAS DE PARTICIPACIÓN LOCALES, ASÍ COMO LOS PROCESOS COMUNITARIOS EN LA LOCALIDAD ","Inversión","Un nuevo contrato social y ambiental para la Bogotá del Siglo XXI",57,{"$f":"IF(ISERROR(VLOOKUP(K146,Proposito_programa!$C$2:$E$59,2,FALSE)),\" \",VLOOKUP(K146,Proposito_programa!$C$2:$E$59,2,FALSE))","v":"Gestión pública local"},{"$f":"IF(ISERROR(VLOOKUP(K146,Proposito_programa!$C$2:$E$59,3,FALSE)),\" \",VLOOKUP(K146,Proposito_programa!$C$2:$E$59,3,FALSE))","v":"Propósito 5: Construir Bogotá - Región con gobierno abierto, transparente y ciudadanía consciente"},2105,1,1018418087,"NELSON ARNULFO FRESNEDA GUZMAN","Persona Natural",null,null,null,null,33600000,null,null,0,33600000,33600000,"2022-01-25","2022-01-26","2022-08-25",7,0,0,null,null,null,null,"Terminado",1]
["FDLSF-CPS-134-2022",2022,"FDLSF-CD-009-2022","FDLSF-CPS-134-2022","Contratos de prestación de servicios profesionales y de apoyo a la gestión","Contratación directa","Prestación de servicios profesionales y de apoyo a la gestión, o para la ejecución de trabajos artísticos que sólo puedan encomendarse a determinadas personas naturales","COORDINAR LA ARTICULACIÓN, ASISTENCIA Y ACOMPAÑAMIENTO DE LOS PROCESOS DE PLANEACIÓN LOCAL, PARA LA PROMOCIÓN DE LA PARTICIPACIÓN DE LAS MUJERES Y DE LA EQUIDAD DE GÉNERO, PARA MATERIALIZAR EN LA LOCALIDAD LAS ESTRATEGIAS DE TERRITORIALIZACIÓN Y TRANSVERSALIZACIÓN DE LA POLÍTICA PUBLICA DE MUJERES Y EQUIDAD DE GÉNERO, PPMYEG","Inversión","Un nuevo contrato social y ambiental para la Bogotá del Siglo XXI",57,{"$f":"IF(ISERROR(VLOOKUP(K147,Proposito_programa!$C$2:$E$59,2,FALSE)),\" \",VLOOKUP(K147,Proposito_programa!$C$2:$E$59,2,FALSE))","v":"Gestión pública local"},{"$f":"IF(ISERROR(VLOOKUP(K147,Proposito_programa!$C$2:$E$59,3,FALSE)),\" \",VLOOKUP(K147,Proposito_programa!$C$2:$E$59,3,FALSE))","v":"Propósito 5: Construir Bogotá - Región con gobierno abierto, transparente y ciudadanía consciente"},2105,1,1026270004,"ADRIANA PATRICIA POSADA BELTRAN","Persona Natural",null,null,null,null,33600000,null,null,0,33600000,32480000,"2022-01-26","2022-01-27","2022-08-30",7,0,0,1026270004,"ADRIANA PATRICIA POSADA BELTRAN","2022-02-01",null,"Terminado",0.96666666666666667]
["FDLSF-CPS-135-2022",2022,"FDLSF-CD-019-2022","FDLSF-CPS-135-2022","Contratos de prestación de servicios profesionales y de apoyo a la gestión","Contratación directa","Prestación de servicios profesionales y de apoyo a la gestión, o para la ejecución de trabajos artísticos que sólo puedan encomendarse a determinadas personas naturales","APOYAR JURÍDICAMENTE LA EJECUCIÓN DE LAS ACCIONES REQUERIDAS PARA LA DEPURACIÓN DE LAS ACTUACIONES ADMINISTRATIVAS QUE CURSAN EN LA ALCALDÍA LOCAL","Inversión","Un nuevo contrato social y ambiental para la Bogotá del Siglo XXI",57,{"$f":"IF(ISERROR(VLOOKUP(K148,Proposito_programa!$C$2:$E$59,2,FALSE)),\" \",VLOOKUP(K148,Proposito_programa!$C$2:$E$59,2,FALSE))","v":"Gestión pública local"},{"$f":"IF(ISERROR(VLOOKUP(K148,Proposito_programa!$C$2:$E$59,3,FALSE)),\" \",VLOOKUP(K148,Proposito_programa!$C$2:$E$59,3,FALSE))","v":"Propósito 5: Construir Bogotá - Región con gobierno abierto, transparente y ciudadanía consciente"},2105,1,1098700541,"JOSE KARLORLANDO LOPEZ URBINA","Persona Natural",null,null,null,null,42700000,null,null,0,{"$f":"+W148+X148+Z148","v":42700000},42700000,"2022-01-25","2022-01-26","2022-08-25",7,0,0,null,null,null,null,"Terminado",1]
["FDLSF-CPS-136-2022",2022,"FDLSF-CD-019-2022","FDLSF-CPS-136-2022","Contratos de prestación de servicios profesionales y de apoyo a la gestión","Contratación directa","Prestación de servicios profesionales y de apoyo a la gestión, o para la ejecución de trabajos artísticos que sólo puedan encomendarse a determinadas personas naturales","APOYAR JURÍDICAMENTE LA EJECUCIÓN DE LAS ACCIONES REQUERIDAS PARA LA DEPURACIÓN DE LAS ACTUACIONES ADMINISTRATIVAS QUE CURSAN EN LA ALCALDÍA LOCAL","Inversión","Un nuevo contrato social y ambiental para la Bogotá del Siglo XXI",57,{"$f":"IF(ISERROR(VLOOKUP(K149,Proposito_programa!$C$2:$E$59,2,FALSE)),\" \",VLOOKUP(K149,Proposito_programa!$C$2:$E$59,2,FALSE))","v":"Gestión pública local"},{"$f":"IF(ISERROR(VLOOKUP(K149,Proposito_programa!$C$2:$E$59,3,FALSE)),\" \",VLOOKUP(K149,Proposito_programa!$C$2:$E$59,3,FALSE))","v":"Propósito 5: Construir Bogotá - Región con gobierno abierto, transparente y ciudadanía consciente"},2105,1,1013593466,"OMAR DAVID CASTILLO AMADOR","Persona Natural",null,null,null,null,42700000,null,null,0,42700000,42700000,"2022-01-25","2022-01-26","2022-08-25",7,0,0,null,null,null,null,"Terminado",1]
["FDLSF.CPS-137-2022",2022,"FDLSF-CD-084-2022","FDLSF.CPS-137-2022","Contratos de prestación de servicios profesionales y de apoyo a la gestión","Contratación directa","Prestación de servicios profesionales y de apoyo a la gestión, o para la ejecución de trabajos artísticos que sólo puedan encomendarse a determinadas personas naturales","PRESTAR SERVICIOS PROFESIONALES COMO COORDINADOR DE LAS ESCUELAS DEPORTIVAS PARA LA VIGENCIA 2022 EN MARCO DE LAS INICIATIVAS CIUDADANAS PROPUESTAS Y RELACIONADAS CON FORMACIÓN DEPORTIVA EN EL PROYECTO 2100 'SANTA FE , REFERENTE EN CULTURA, DEPORTE, RECREACIÓN Y ACTIVIDAD FÍSICA, CON PARQUES PARA EL DESARROLLO Y LA SALUD","Inversión","Un nuevo contrato social y ambiental para la Bogotá del Siglo XXI",20,{"$f":"IF(ISERROR(VLOOKUP(K150,Proposito_programa!$C$2:$E$59,2,FALSE)),\" \",VLOOKUP(K150,Proposito_programa!$C$2:$E$59,2,FALSE))","v":"Bogotá, referente en cultura, deporte, recreación y actividad física, con parques para el desarrollo y la salud"},{"$f":"IF(ISERROR(VLOOKUP(K150,Proposito_programa!$C$2:$E$59,3,FALSE)),\" \",VLOOKUP(K150,Proposito_programa!$C$2:$E$59,3,FALSE))","v":"Propósito 1: Hacer un nuevo contrato social para incrementar la inclusión social, productiva y política"},2100,1,1098700541,"NUBIA ANGELICA NIÑO PARRADO","Persona Natural",null,null,null,null,28800000,null,null,0,28800000,28800000,"2022-01-25","2022-02-01","2022-07-31",6,0,0,null,null,null,null,"Terminado",1]
["FDLSF-CPS-138-2022",2022,"FDLSF-CD-054-2022","FDLSF-CPS-138-2022","Contratos de prestación de servicios profesionales y de apoyo a la gestión","Contratación directa","Prestación de servicios profesionales y de apoyo a la gestión, o para la ejecución de trabajos artísticos que sólo puedan encomendarse a determinadas personas naturales","APOYAR TÉCNICAMENTE LAS DISTINTAS ETAPAS DE LOS PROCESO DE COMPETENCIA DE LAS INSPECCIONES DE POLICÍA DE LA LOCALIDAD DE SANTA FE, SEGÚN REPARTO","Inversión","Un nuevo contrato social y ambiental para la Bogotá del Siglo XXI",57,{"$f":"IF(ISERROR(VLOOKUP(K151,Proposito_programa!$C$2:$E$59,2,FALSE)),\" \",VLOOKUP(K151,Proposito_programa!$C$2:$E$59,2,FALSE))","v":"Gestión pública local"},{"$f":"IF(ISERROR(VLOOKUP(K151,Proposito_programa!$C$2:$E$59,3,FALSE)),\" \",VLOOKUP(K151,Proposito_programa!$C$2:$E$59,3,FALSE))","v":"Propósito 5: Construir Bogotá - Región con gobierno abierto, transparente y ciudadanía consciente"},2105,1,1030603688,"JIMMY ALEJANDRO BELLO ACERO","Persona Natural",null,null,null,null,42700000,null,null,0,42700000,42700000,"2022-01-25","2022-01-28","2022-08-27",7,0,0,null,null,null,null,"Terminado",1]
["FDLSF-CPS-139-2022",2022,"FDLSF-CD-054-2022","FDLSF-CPS-139-2022","Contratos de prestación de servicios profesionales y de apoyo a la gestión","Contratación directa","Prestación de servicios profesionales y de apoyo a la gestión, o para la ejecución de trabajos artísticos que sólo puedan encomendarse a determinadas personas naturales","APOYAR TÉCNICAMENTE LAS DISTINTAS ETAPAS DE LOS PROCESO DE COMPETENCIA DE LAS INSPECCIONES DE POLICÍA DE LA LOCALIDAD DE SANTA FE, SEGÚN REPARTO","Inversión","Un nuevo contrato social y ambiental para la Bogotá del Siglo XXI",57,{"$f":"IF(ISERROR(VLOOKUP(K152,Proposito_programa!$C$2:$E$59,2,FALSE)),\" \",VLOOKUP(K152,Proposito_programa!$C$2:$E$59,2,FALSE))","v":"Gestión pública local"},{"$f":"IF(ISERROR(VLOOKUP(K152,Proposito_programa!$C$2:$E$59,3,FALSE)),\" \",VLOOKUP(K152,Proposito_programa!$C$2:$E$59,3,FALSE))","v":"Propósito 5: Construir Bogotá - Región con gobierno abierto, transparente y ciudadanía consciente"},2105,1,79627358,"GUILLERMO ALBERTO RAMIREZ DUQUE","Persona Natural",null,null,null,null,42700000,null,null,0,42700000,42700000,"2022-01-26","2022-01-28","2022-08-27",7,0,0,null,null,null,null,"Terminado",1]
["FDLSF-CPS-140-2022",2022,"FDLSF-CD-029-2022","FDLSF-CPS-140-2022","Contratos de prestación de servicios profesionales y de apoyo a la gestión","Contratación directa","Prestación de servicios profesionales y de apoyo a la gestión, o para la ejecución de trabajos artísticos que sólo puedan encomendarse a determinadas personas naturales","PRESTAR SERVICIOS DE APOYO PARA EL FORTALECIMIENTO A LA GESTIÓN LOCAL DE PROCESOS INSTITUCIONALES Y SOCIALES DE INTERÉS PÚBLICO ARTICULADOS POR EL FONDO DE DESARROLLO LOCAL DE SANTA FE EN COMPAÑÍA DE SECTORES ADMINISTRATIVOS DEL DISTRITO, INSTANCIAS Y ORGANIZACIONES SOCIALES EN LA LOCALIDAD.","Inversión","Un nuevo contrato social y ambiental para la Bogotá del Siglo XXI",57,{"$f":"IF(ISERROR(VLOOKUP(K153,Proposito_programa!$C$2:$E$59,2,FALSE)),\" \",VLOOKUP(K153,Proposito_programa!$C$2:$E$59,2,FALSE))","v":"Gestión pública local"},{"$f":"IF(ISERROR(VLOOKUP(K153,Proposito_programa!$C$2:$E$59,3,FALSE)),\" \",VLOOKUP(K153,Proposito_programa!$C$2:$E$59,3,FALSE))","v":"Propósito 5: Construir Bogotá - Región con gobierno abierto, transparente y ciudadanía consciente"},2105,1," 1 0 2 6 2 7 2 8 5 6","LEIDY JULIETH DIAZ BUITRAGO","Persona Natural",null,null,null,null,16450000,null,null,0,16450000,16450000,"2022-01-26","2022-01-28","2022-08-27",7,0,0,null,null,null,null,"Terminado",1]
["FDLSF-CPS-141-2022",2022,"FDLSF-CD-029-2022","FDLSF-CPS-141-2022","Contratos de prestación de servicios profesionales y de apoyo a la gestión","Contratación directa","Prestación de servicios profesionales y de apoyo a la gestión, o para la ejecución de trabajos artísticos que sólo puedan encomendarse a determinadas personas naturales","PRESTAR SERVICIOS DE APOYO PARA EL FORTALECIMIENTO A LA GESTIÓN LOCAL DE PROCESOS INSTITUCIONALES Y SOCIALES DE INTERÉS PÚBLICO ARTICULADOS POR EL FONDO DE DESARROLLO LOCAL DE SANTA FE EN COMPAÑÍA DE SECTORES ADMINISTRATIVOS DEL DISTRITO, INSTANCIAS Y ORGANIZACIONES SOCIALES EN LA LOCALIDAD.","Inversión","Un nuevo contrato social y ambiental para la Bogotá del Siglo XXI",57,{"$f":"IF(ISERROR(VLOOKUP(K154,Proposito_programa!$C$2:$E$59,2,FALSE)),\" \",VLOOKUP(K154,Proposito_programa!$C$2:$E$59,2,FALSE))","v":"Gestión pública local"},{"$f":"IF(ISERROR(VLOOKUP(K154,Proposito_programa!$C$2:$E$59,3,FALSE)),\" \",VLOOKUP(K154,Proposito_programa!$C$2:$E$59,3,FALSE))","v":"Propósito 5: Construir Bogotá - Región con gobierno abierto, transparente y ciudadanía consciente"},2105,1,1000002470,"JHASSBLEYDI VALENTINA ARCILA RIVERA","Persona Natural",null,null,null,null,16450000,null,null,0,16450000,16371665,"2022-01-26","2022-01-26","2022-08-25",7,0,0,1000002470,"JHASSBLEYDI VALENTINA ARCILA RIVERA","2022-06-15",null,"Terminado",0.99523799392097267]
["FDLSF-CPS-142-2022",2022,"FDLSF-CD-076-2022","FDLSF-CPS-142-2022","Contratos de prestación de servicios profesionales y de apoyo a la gestión","Contratación directa","Prestación de servicios profesionales y de apoyo a la gestión, o para la ejecución de trabajos artísticos que sólo puedan encomendarse a determinadas personas naturales","PRESTAR LOS SERVICIOS COMO OPERARIO PARA LA GESTIÓN EN ACTIVIDADES OPERATIVAS DE PLANTACIÓN, RECUPERACIÓN Y MANTENIMIENTO DE LAS COBERTURAS VEGETALES Y HUERTAS URBANAS EN LA LOCALIDAD DE SANTA FE, EN EL MARCO DE LAS INICIATIVAS CIUDADANAS DE PRESUPUESTOS PARTICIPATIVOS","Inversión","Un nuevo contrato social y ambiental para la Bogotá del Siglo XXI",24,{"$f":"IF(ISERROR(VLOOKUP(K155,Proposito_programa!$C$2:$E$59,2,FALSE)),\" \",VLOOKUP(K155,Proposito_programa!$C$2:$E$59,2,FALSE))","v":"Bogotá región emprendedora e innovadora"},{"$f":"IF(ISERROR(VLOOKUP(K155,Proposito_programa!$C$2:$E$59,3,FALSE)),\" \",VLOOKUP(K155,Proposito_programa!$C$2:$E$59,3,FALSE))","v":"Propósito 1: Hacer un nuevo contrato social para incrementar la inclusión social, productiva y política"},2123,1,53166781,"MARI IXABEL PAEZ CASTRO","Persona Natural",null,null,null,null,8460000,null,null,0,8460000,8460000,"2022-01-26","2022-02-01","2022-07-31",6,0,0,null,null,null,null,"Terminado",1]
["FDLSF-CPS-143-2022",2022,"FDLSF-CD-055-2022","FDLSF-CPS-143-2022","Contratos de prestación de servicios profesionales y de apoyo a la gestión","Contratación directa","Prestación de servicios profesionales y de apoyo a la gestión, o para la ejecución de trabajos artísticos que sólo puedan encomendarse a determinadas personas naturales","APOYAR TÉCNICAMENTE LAS DISTINTAS ETAPAS DE LOS PROCESOS DE COMPETENCIA DE LA ALCALDÍA LOCAL PARA LA DEPURACIÓN DE ACTUACIONES ADMINISTRATIVAS","Inversión","Un nuevo contrato social y ambiental para la Bogotá del Siglo XXI",57,{"$f":"IF(ISERROR(VLOOKUP(K156,Proposito_programa!$C$2:$E$59,2,FALSE)),\" \",VLOOKUP(K156,Proposito_programa!$C$2:$E$59,2,FALSE))","v":"Gestión pública local"},{"$f":"IF(ISERROR(VLOOKUP(K156,Proposito_programa!$C$2:$E$59,3,FALSE)),\" \",VLOOKUP(K156,Proposito_programa!$C$2:$E$59,3,FALSE))","v":"Propósito 5: Construir Bogotá - Región con gobierno abierto, transparente y ciudadanía consciente"},2105,1,1013636916,"ANDRES CAMILO VELASQUEZ LEON","Persona Natural",null,null,null,null,42700000,null,null,0,42700000,42700000,"2022-01-26","2022-01-28","2022-08-27",7,0,0,null,null,null,null,"Terminado",1]
["FDLSF-CPS-144-2022",2022,"FDLSF-CD-096-2022","FDLSF-CPS-144-2022","Contratos de prestación de servicios profesionales y de apoyo a la gestión","Contratación directa","Prestación de servicios profesionales y de apoyo a la gestión, o para la ejecución de trabajos artísticos que sólo puedan encomendarse a determinadas personas naturales","APOYAR LA GESTIÓN DOCUMENTAL DE LA ALCALDÍA LOCAL EN LA IMPLEMENTACIÓN DE LOS PROCESOS DE CLASIFICACIÓN, ORDENACIÓN, SELECCIÓN NATURAL, FOLIACIÓN, IDENTIFICACIÓN, LEVANTAMIENTO DE INVENTARIOS, ALMACENAMIENTO Y APLICACIÓN DE PROTOCOLOS DE ELIMINACIÓN Y TRANSFERENCIAS DOCUMENTALES.","Inversión","Un nuevo contrato social y ambiental para la Bogotá del Siglo XXI",57,{"$f":"IF(ISERROR(VLOOKUP(K157,Proposito_programa!$C$2:$E$59,2,FALSE)),\" \",VLOOKUP(K157,Proposito_programa!$C$2:$E$59,2,FALSE))","v":"Gestión pública local"},{"$f":"IF(ISERROR(VLOOKUP(K157,Proposito_programa!$C$2:$E$59,3,FALSE)),\" \",VLOOKUP(K157,Proposito_programa!$C$2:$E$59,3,FALSE))","v":"Propósito 5: Construir Bogotá - Región con gobierno abierto, transparente y ciudadanía consciente"},2105,1,79745860,"WILSON JAIR GONZALEZ BELTRAN","Persona Natural",null,null,null,null,16450000,null,null,0,16450000,16450000,"2022-01-28","2022-02-01","2022-10-09",7,0,29,79745860,"WILSON JAIR GONZALEZ BELTRAN","2022-02-08",null,"Terminado",1]
["FDLSF-CPS-145-2022",2022,"FDLSF-CD-020-2022","FDLSF-CPS-145-2022","Contratos de prestación de servicios profesionales y de apoyo a la gestión","Contratación directa","Prestación de servicios profesionales y de apoyo a la gestión, o para la ejecución de trabajos artísticos que sólo puedan encomendarse a determinadas personas naturales","PRESTAR SERVICIOS COMO TÉCNICO DE DESPACHOS COMISORIOS EN EL ÁREA DE GESTION POLICIVA DE LA ALCALDIA LOCAL DE SANTA FE","Inversión","Un nuevo contrato social y ambiental para la Bogotá del Siglo XXI",57,{"$f":"IF(ISERROR(VLOOKUP(K158,Proposito_programa!$C$2:$E$59,2,FALSE)),\" \",VLOOKUP(K158,Proposito_programa!$C$2:$E$59,2,FALSE))","v":"Gestión pública local"},{"$f":"IF(ISERROR(VLOOKUP(K158,Proposito_programa!$C$2:$E$59,3,FALSE)),\" \",VLOOKUP(K158,Proposito_programa!$C$2:$E$59,3,FALSE))","v":"Propósito 5: Construir Bogotá - Región con gobierno abierto, transparente y ciudadanía consciente"},2105,1,13615877,"RAFAEL ELIAS MURCIA CUBIDES","Persona Natural",null,null,null,null,30240000,null,null,0,30240000,30240000,"2022-01-27","2022-01-27","2022-08-26",7,0,0,null,null,null,null,"Terminado",1]
["FDLSF-CPS-146-2022",2022,"FDLSF-CD-146-2022","FDLSF-CPS-146-2022","Contratos de prestación de servicios","Contratación directa","No aplica","PRESTAR EL SERVICIO\nDE MANTENIMIENTO PREVENTIVO Y CORRECTIVO CON BOLSA DE REPUESTOS AL ASCENSOR MARCA\nSCHINDLER DE PROPIEDAD DE LA ALCALDÍA LOCAL DE SANTA FE","Funcionamiento",null,null,{"$f":"IF(ISERROR(VLOOKUP(K159,Proposito_programa!$C$2:$E$59,2,FALSE)),\" \",VLOOKUP(K159,Proposito_programa!$C$2:$E$59,2,FALSE))","v":" "},{"$f":"IF(ISERROR(VLOOKUP(K159,Proposito_programa!$C$2:$E$59,3,FALSE)),\" \",VLOOKUP(K159,Proposito_programa!$C$2:$E$59,3,FALSE))","v":" "},"No aplica",1,860005289,"ASCENSORES SCHINDLER DE COLOMBIA SAS","Persona Jurídica",null,null,null,null,13588829,null,1,4000000,17588829,10873609,"2022-01-28","2022-03-10","2023-03-09",12,0,0,null,null,null,null,"En ejecución",0.61821108159047999]
["FDLSF-CPS-147-2022",2022,"FDLSF-CD-038-2022","FDLSF-CPS-147-2022","Contratos de prestación de servicios profesionales y de apoyo a la gestión","Contratación directa","Prestación de servicios profesionales y de apoyo a la gestión, o para la ejecución de trabajos artísticos que sólo puedan encomendarse a determinadas personas naturales","PRESTAR SUS SERVICIOS PROFESIONALES PARA LA ESTRUCTURACIÓN, VIABILIZACIÓN, EVALUACIÓN Y SEGUIMIENTO DE LOS PROYECTOS DEL PRESUPUESTO DEL FONDO DE DESARROLLO LOCAL DE SANTA FE QUE LE SEAN ASIGNADOS.","Inversión","Un nuevo contrato social y ambiental para la Bogotá del Siglo XXI",57,{"$f":"IF(ISERROR(VLOOKUP(K160,Proposito_programa!$C$2:$E$59,2,FALSE)),\" \",VLOOKUP(K160,Proposito_programa!$C$2:$E$59,2,FALSE))","v":"Gestión pública local"},{"$f":"IF(ISERROR(VLOOKUP(K160,Proposito_programa!$C$2:$E$59,3,FALSE)),\" \",VLOOKUP(K160,Proposito_programa!$C$2:$E$59,3,FALSE))","v":"Propósito 5: Construir Bogotá - Región con gobierno abierto, transparente y ciudadanía consciente"},2105,1,80098547,"ALBERT ANDRES RINCON BELLO","Persona Natural",null,null,null,null,28800000,null,null,0,28800000,28000000,"2022-01-27","2022-02-01","2022-07-31",6,0,0,80098547,"ALBERT ANDRES RINCON BELLO","2022-04-28",null,"Terminado",0.97222222222222221]
["FDLSF-CPS-148-2022",2022,"FDLSF-CD-097-2022","FDLSF-CPS-148-2022","Contratos de prestación de servicios profesionales y de apoyo a la gestión","Contratación directa","Prestación de servicios profesionales y de apoyo a la gestión, o para la ejecución de trabajos artísticos que sólo puedan encomendarse a determinadas personas naturales","PRESTAR SERVICIOS PROFESIONALES PARA ASESORAR JURIDICAMENTE A LA JUNTA ADMINISTRADORA LOCAL EN EL MARCO DE LA LEY ORGANICA 2116 DE 2021 Y BRINDAR APOYO JURIDICO PARA LA EJECUCIÓN DE LAS ACCIONES REQUERIDAS PARA LA DEPURACIÓN DE LAS ACTUACIONES ADMINISTRATIVAS QUE CURSAN EN LA ALCALDÍA LOCAL","Inversión","Un nuevo contrato social y ambiental para la Bogotá del Siglo XXI",57,{"$f":"IF(ISERROR(VLOOKUP(K161,Proposito_programa!$C$2:$E$59,2,FALSE)),\" \",VLOOKUP(K161,Proposito_programa!$C$2:$E$59,2,FALSE))","v":"Gestión pública local"},{"$f":"IF(ISERROR(VLOOKUP(K161,Proposito_programa!$C$2:$E$59,3,FALSE)),\" \",VLOOKUP(K161,Proposito_programa!$C$2:$E$59,3,FALSE))","v":"Propósito 5: Construir Bogotá - Región con gobierno abierto, transparente y ciudadanía consciente"},2105,1,1014263010,"KAREN JIMENA BURBANO MORENO","Persona Natural",null,null,null,null,28800000,null,null,0,28800000,24000000,"2022-01-27","2022-02-01","2022-07-31",6,0,0,null,null,null,null,"Terminado",0.83333333333333337]
["FDLSF-CCOM-150-2022",2022,"FDLSF-CD-098-2022","FDLSF-CCOM-150-2022","Otros","Contratación directa","El arrendamiento o adquisición de inmuebles","ENTREGAR EN PRÉSTAMO DE USO, A TÍTULO GRATUITO MUEBLES PARA EL FORTALECIMIENTO DE LA JUNTA DE ACCIÓN COMUNAL BARRIO SAN BERNARDO DE LA LOCALIDAD DE SANTA FE, BIENES QUE SON DE PROPIEDAD ÚNICA Y EXCLUSIVA DEL FONDO DE DESARROLLO LOCAL DE SANTA FE, sobre los cuales no pesa ningún gravamen o limitación alguna, en préstamo a título gratuito, los mismos se describen con las características y demás especificaciones en el alcance del objeto, para identificarlos en forma clara y precisa. C","Inversión","Un nuevo contrato social y ambiental para la Bogotá del Siglo XXI",null,{"$f":"IF(ISERROR(VLOOKUP(K162,Proposito_programa!$C$2:$E$59,2,FALSE)),\" \",VLOOKUP(K162,Proposito_programa!$C$2:$E$59,2,FALSE))","v":" "},{"$f":"IF(ISERROR(VLOOKUP(K162,Proposito_programa!$C$2:$E$59,3,FALSE)),\" \",VLOOKUP(K162,Proposito_programa!$C$2:$E$59,3,FALSE))","v":" "},null,1,901058605,"JUNTA DE ACCION COMUNAL DEL BARRIO SAN BERNARDO","Persona Jurídica",null,null,null,null,0,null,null,0,0,0,"2022-01-28",null,"N/A",60,"N/A",0,null,null,null,null,"En ejecución","-"]
["FDLSF-CCOM-151-2022",2022,"FDLSF-CD-098-2022","FDLSF-CCOM-151-2022","Otros","Contratación directa","El arrendamiento o adquisición de inmuebles","ENTREGAR EN PRÉSTAMO DE USO, A TÍTULO GRATUITO MUEBLES O INMUEBLES PARA EL FORTALECIMIENTO DE LAS JUNTAS DE ACCIÓN COMUNAL DE LA LOCALIDAD DE SANTA FE, BIENES QUE SON DE PROPIEDAD ÚNICA Y EXCLUSIVA DEL FONDO DE DESARROLLO LOCAL DE SANTA FE, sobre los cuales no pesa ningún gravamen o limitación alguna, en préstamo a título gratuito, los mismos se describen con las características y demás especificaciones en el alcance del objeto, para identificarlos en forma clara y precisa","Inversión","Un nuevo contrato social y ambiental para la Bogotá del Siglo XXI",null,{"$f":"IF(ISERROR(VLOOKUP(K163,Proposito_programa!$C$2:$E$59,2,FALSE)),\" \",VLOOKUP(K163,Proposito_programa!$C$2:$E$59,2,FALSE))","v":" "},{"$f":"IF(ISERROR(VLOOKUP(K163,Proposito_programa!$C$2:$E$59,3,FALSE)),\" \",VLOOKUP(K163,Proposito_programa!$C$2:$E$59,3,FALSE))","v":" "},null,1,900104756,"JUNTA DE ACCION COMUNAL DEL BARRIO LOURDES","Persona Jurídica",null,null,null,null,0,null,null,0,0,0,"2022-01-28",null,"N/A",60,"N/A",0,null,null,null,null,"En ejecución","-"]
["FDLSF-CUS-152-2022",2022,"FDLSF-MC-002-2022","FDLSF-CUS-152-2022","Suministro","Contratación mínima cuantia","No aplica","ELABORAR Y ENTREGAR CHAQUETAS INSTITUCIONALES PARA FUNCIONARIOS Y CONTRATISTAS CON LA IMAGEN CORPORATIVA DE CONFORMIDAD AL ANEXO TECNICO, PARA EL DESARROLLO DE LOS PROCESOS MISIONALES Y FORTALECER LA GESTIÓN INSTITUCIONAL DE LA ALCALDIA LOCAL DE SANTA FE","Inversión","Un nuevo contrato social y ambiental para la Bogotá del Siglo XXI",57,{"$f":"IF(ISERROR(VLOOKUP(K164,Proposito_programa!$C$2:$E$59,2,FALSE)),\" \",VLOOKUP(K164,Proposito_programa!$C$2:$E$59,2,FALSE))","v":"Gestión pública local"},{"$f":"IF(ISERROR(VLOOKUP(K164,Proposito_programa!$C$2:$E$59,3,FALSE)),\" \",VLOOKUP(K164,Proposito_programa!$C$2:$E$59,3,FALSE))","v":"Propósito 5: Construir Bogotá - Región con gobierno abierto, transparente y ciudadanía consciente"},2105,15,900990752,"PROYECTOS INSTITUCIONALES DE COLOMBIA SAS PROINCOL JK SAS","Persona Jurídica",null,null,null,null,14178000,null,null,0,14178000,6664000,"2022-03-15","2022-04-04","2022-06-03",2,0,0,null,null,null,null,"Terminado",0.47002398081534774]
["FDLSF-CPS-153-2022",2022,"FDLSF-MC-003-2022","FDLSF-CPS-153-2022","Contratos de prestación de servicios","Contratación mínima cuantia","No aplica","PRESTAR EL SERVICIO DE OUTSOURCING DE EQUIPOS DE IMPRESIÓN MULTIFUNCIONALES CON SUS RESPECTIVOS SUMINISTROS DE ACUERDO AL ANEXO TÉCNICO ADJUNTO","Funcionamiento",null,"No aplica",{"$f":"IF(ISERROR(VLOOKUP(K165,Proposito_programa!$C$2:$E$59,2,FALSE)),\" \",VLOOKUP(K165,Proposito_programa!$C$2:$E$59,2,FALSE))","v":" "},{"$f":"IF(ISERROR(VLOOKUP(K165,Proposito_programa!$C$2:$E$59,3,FALSE)),\" \",VLOOKUP(K165,Proposito_programa!$C$2:$E$59,3,FALSE))","v":" "},"No aplica",4," 830053669","SOLUTION COPY LTDA","Persona Jurídica",null,null,null,null,27846000,null,null,0,27846000,11138400,"2022-03-18","2022-03-23","2023-05-22",9,5,150,null,null,null,null,"Terminado",0.4]
["FDLSF-CPS-154-2022",2022,"FDLSF-LP-001-2022","FDLSF-CPS-154-2022","Contratos de prestación de servicios","Licitación pública","No aplica","PRESTAR EL SERVICIO INTEGRAL DE VIGILANCIA Y SEGURIDAD PRIVADA PARA LAS DISTINTAS SEDES DE LA ALCALDÍA LOCAL DE SANTA FE, INCLUYENDO LAS DEMÁS POR LAS QUE SEA RESPONSABLE, UTILIZANDO MEDIOS TECNOLÓGICOS Y HUMANOS PARA LA ADECUADA PROTECCIÓN DE LOS FUNCIONARIOS, CONTRATISTAS Y VISITANTES EN GENERAL","Funcionamiento",null,"No aplica",{"$f":"IF(ISERROR(VLOOKUP(K166,Proposito_programa!$C$2:$E$59,2,FALSE)),\" \",VLOOKUP(K166,Proposito_programa!$C$2:$E$59,2,FALSE))","v":" "},{"$f":"IF(ISERROR(VLOOKUP(K166,Proposito_programa!$C$2:$E$59,3,FALSE)),\" \",VLOOKUP(K166,Proposito_programa!$C$2:$E$59,3,FALSE))","v":" "},"No aplica",51,900823024,"VIGILANCIA Y SEGURIDAD 365 LIMITADA","Persona Jurídica",null,null,null,null,394990499,null,1,34231530,429222029,331154606,"2022-03-22","2022-03-23","2023-01-31",9,0,40,null,null,null,null,"En ejecución",0.77152285676371934]
["FDLSF-CPS-155-2022",2022,"FDLSF-MC-005-2022","FDLSF-CPS-155-2022","Contratos de prestación de servicios","Contratación mínima cuantia","No aplica","PRESTAR LOS SERVICIOS DE APOYO LOGÍSTICO PARA LLEVAR A CABO EL PROCESO DE RENDICIÓN DE CUENTAS Y FASES DE PRESUPUESTOS PARTICIPATIVOS DE LA ALCALDÍA LOCAL DE SANTA FE EN EL MARCO DEL PROYECTO 1822 SANTA FE ABIERTA Y TRANSPARENTE.","Inversión","Un nuevo contrato social y ambiental para la Bogotá del Siglo XXI",57,{"$f":"IF(ISERROR(VLOOKUP(K167,Proposito_programa!$C$2:$E$59,2,FALSE)),\" \",VLOOKUP(K167,Proposito_programa!$C$2:$E$59,2,FALSE))","v":"Gestión pública local"},{"$f":"IF(ISERROR(VLOOKUP(K167,Proposito_programa!$C$2:$E$59,3,FALSE)),\" \",VLOOKUP(K167,Proposito_programa!$C$2:$E$59,3,FALSE))","v":"Propósito 5: Construir Bogotá - Región con gobierno abierto, transparente y ciudadanía consciente"},1822,6,9003009701,"INDUHOTEL SAS","Persona Jurídica",null,null,null,null,20000000,null,null,0,20000000,0,"2022-04-08","2022-04-11","2023-01-10",9,0,0,null,null,null,null,"En ejecución",0]
["FDLSF-CPS-156-2022",2022,"FDLSF-MC-004-2022","FDLSF-CPS-156-2022","Contratos de prestación de servicios","Contratación mínima cuantia","No aplica","Prestar, a monto agotable, el servicio de mantenimiento preventivo y correctivo con bolsa de repuestos a las plantas eléctrica-grupo electrógeno fija, planta eléctrica móvil, equipo de bombeo, motobombas y bombas de propiedad del Fondo de Desarrollo Local de Santa Fe","Funcionamiento",null,"No aplica",{"$f":"IF(ISERROR(VLOOKUP(K168,Proposito_programa!$C$2:$E$59,2,FALSE)),\" \",VLOOKUP(K168,Proposito_programa!$C$2:$E$59,2,FALSE))","v":" "},{"$f":"IF(ISERROR(VLOOKUP(K168,Proposito_programa!$C$2:$E$59,3,FALSE)),\" \",VLOOKUP(K168,Proposito_programa!$C$2:$E$59,3,FALSE))","v":" "},"No aplica",15,901173899,"MV MANTENIMIENTOS","Persona Jurídica",null,null,null,null,14000000,null,null,0,14000000,0,"2022-04-11","2022-05-09","2023-01-08",8,0,0,null,null,null,null,"En ejecución",0]
["FDLSF-CIS-157-2022",2022,"FDLSF-CMA-001-2022","FDLSF-CIS-157-2022","Consultoría","Concurso de méritos","No aplica","CONTRATAR LOS SERVICIOS ESPECIALIZADOS DE INTERMEDIACIÓN DE SEGUROS Y ASESORÍA INTEGRAL PARA LA FORMULACIÓN, IMPLEMENTACIÓN, MANEJO, ADMINISTRACIÓN, SEGUIMIENTO Y CONTROL DEL PROGRAMA DE SEGUROS, DESTINADOS A PROTEGER LAS PERSONAS, BIENES E INTERESES PATRIMONIALES DEL FONDO DE DESARROLLO LOCAL DE SANTA FE, O AQUELLOS POR LOS QUE SEA O LLEGARE A SER LEGALMENTE RESPONSABLE","Inversión","Un nuevo contrato social y ambiental para la Bogotá del Siglo XXI",null,{"$f":"IF(ISERROR(VLOOKUP(K169,Proposito_programa!$C$2:$E$59,2,FALSE)),\" \",VLOOKUP(K169,Proposito_programa!$C$2:$E$59,2,FALSE))","v":" "},{"$f":"IF(ISERROR(VLOOKUP(K169,Proposito_programa!$C$2:$E$59,3,FALSE)),\" \",VLOOKUP(K169,Proposito_programa!$C$2:$E$59,3,FALSE))","v":" "},null,2,"900357596-5","CAF ASESORES DE SEGUROS LTDA","Persona Jurídica",null,null,null,null,0,null,null,0,0,0,"2022-04-22","2022-05-02","2022-12-31",7,0,0,null,null,null,null,"Terminado","-"]
["FDLSF-CCV-158-2022",2022,"FDLSF-MC-007-2022","FDLSF-CCV-158-2022","Compraventa de bienes muebles","Contratación mínima cuantia","No aplica","ADQUIRIR A TÍTULO DE COMPRAVENTA UN (1) DESFIBRILADOR PORTÁTIL PARA LA ALCALDÍA LOCAL DE SANTA FE DE ACUERDO CON LAS CARACTERÍSTICAS Y CONDICIONES ESTABLECIDAS EN LA NORMATIVIDAD NACIONAL VIGENTE","Inversión","Un nuevo contrato social y ambiental para la Bogotá del Siglo XXI",57,{"$f":"IF(ISERROR(VLOOKUP(K170,Proposito_programa!$C$2:$E$59,2,FALSE)),\" \",VLOOKUP(K170,Proposito_programa!$C$2:$E$59,2,FALSE))","v":"Gestión pública local"},{"$f":"IF(ISERROR(VLOOKUP(K170,Proposito_programa!$C$2:$E$59,3,FALSE)),\" \",VLOOKUP(K170,Proposito_programa!$C$2:$E$59,3,FALSE))","v":"Propósito 5: Construir Bogotá - Región con gobierno abierto, transparente y ciudadanía consciente"},2105,4,"901074786-6","COMPOMEDICA SAS","Persona Jurídica",null,null,null,null,6427000,null,null,0,6427000,6427000,"2022-04-28","2022-05-03","2022-06-02",1,0,0,null,null,null,null,"Terminado",1]
["FDLSF-CPS-159-2022",2022,"FDLSF-MC-006-2022","FDLSF-CPS-159-2022","Contratos de prestación de servicios","Contratación mínima cuantia","No aplica","CONTRATAR LA PRESTACIÓN DE LOS SERVICIOS DE MANTENIMIENTO PREVENTIVO Y CORRECTIVO, CON SUMINISTRO DE AUTOPARTES Y MANO DE OBRA CALIFICADA, PARA LOS VEHÍCULOS QUE INTEGRAN EL PARQUE AUTOMOTOR DE LA ALCALDÍA LOCAL DE SANTA FE Y LOS QUE TENGA O LLEGARE A TENER EN CUIDADO O CUSTODIA O VENTA O PERMUTA.","Funcionamiento",null,"No aplica",{"$f":"IF(ISERROR(VLOOKUP(K171,Proposito_programa!$C$2:$E$59,2,FALSE)),\" \",VLOOKUP(K171,Proposito_programa!$C$2:$E$59,2,FALSE))","v":" "},{"$f":"IF(ISERROR(VLOOKUP(K171,Proposito_programa!$C$2:$E$59,3,FALSE)),\" \",VLOOKUP(K171,Proposito_programa!$C$2:$E$59,3,FALSE))","v":" "},"No aplica",4,"800240740-3","TOYOCAR'S INGENIERIA AUTOMOTRIZ LIMITADA TOYOCAR'S LTDA","Persona Jurídica",null,null,null,null,27000000,null,1,7200000,34200000,26011677,"28 de abril de 2022","2022-05-02","2023-03-01",10,0,0,null,null,null,null,"En ejecución",0.76057535087719297]
["FDLSF-CCV-160-2022",2022,"FDLSF-MC-010-2022","FDLSF-CCV-160-2022","Compraventa de bienes muebles","Contratación mínima cuantia","No aplica","ADQUISICIÓN A TÍTULO DE COMPRAVENTA DE IMPRESORA E INSUMOS PARA EL PROCESO DE CARNETIZACIÓN DE VENDEDORES INFORMALES DE LA LOCALIDAD DE SANTA FE","Inversión","Un nuevo contrato social y ambiental para la Bogotá del Siglo XXI",45,{"$f":"IF(ISERROR(VLOOKUP(K172,Proposito_programa!$C$2:$E$59,2,FALSE)),\" \",VLOOKUP(K172,Proposito_programa!$C$2:$E$59,2,FALSE))","v":"Espacio público más seguro y construido colectivamente"},{"$f":"IF(ISERROR(VLOOKUP(K172,Proposito_programa!$C$2:$E$59,3,FALSE)),\" \",VLOOKUP(K172,Proposito_programa!$C$2:$E$59,3,FALSE))","v":"Propósito 3: Inspirar confianza y legitimidad para vivir sin miedo y ser epicentro de cultura ciudadana, paz y reconciliación"},2130,4,9010770389,"TIC AMERICA SAS","Persona Jurídica",null,null,null,null,7523066,null,null,0,7523066,7523066,"2022-06-03","2022-06-08","2022-07-07",1,0,0,null,null,null,null,"Terminado",1]
["FDLSF-CPS-161-2022",2022,"FDLSF-MC-009-2022","FDLSF-CPS-161-2022","Contratos de prestación de servicios","Contratación mínima cuantia","No aplica","PRESTAR SERVICIOS DE RECARGA, REVISIÓN, INSPECCIÓN Y MANTENIMIENTO DE CINCUENTA Y\nCUATRO (54) EXTINTORES PROPIEDAD DEL FONDO DE DESARROLLO LOCAL DE SANTA FE, UBICADOS\nEN LAS DISTINTAS SEDES Y PUNTOS DE LA ALCALDÍA LOCAL DE SANTA FE","Funcionamiento",null,"No aplica",{"$f":"IF(ISERROR(VLOOKUP(K173,Proposito_programa!$C$2:$E$59,2,FALSE)),\" \",VLOOKUP(K173,Proposito_programa!$C$2:$E$59,2,FALSE))","v":" "},{"$f":"IF(ISERROR(VLOOKUP(K173,Proposito_programa!$C$2:$E$59,3,FALSE)),\" \",VLOOKUP(K173,Proposito_programa!$C$2:$E$59,3,FALSE))","v":" "},"No aplica",5,830068543,"A & R RODCOMERCIAL SAS  /   A&R RODCOMEX SAS","Persona Jurídica",null,null,null,null,726008,null,null,0,726008,726008,"2022-06-13","2022-07-15","2022-09-14",2,0,0,null,null,null,null,"Terminado",1]
["FDLSF-CPS-162-2022",2022,"FDLSF-MC-008-2022","FDLSF-CPS-162-2022","Contratos de prestación de servicios","Contratación mínima cuantia","No aplica","PRESTACIÓN DE SERVICIOS NECESARIOS PARA LA EJECUCIÓN DE UN EVENTO CON OCASION DE LA CONMEMORACIÓN DEL DÍA DE LA AFROCOLOMBIANIDAD EN LA LOCALIDAD SANTA FE.","Inversión","Un nuevo contrato social y ambiental para la Bogotá del Siglo XXI",21,{"$f":"IF(ISERROR(VLOOKUP(K174,Proposito_programa!$C$2:$E$59,2,FALSE)),\" \",VLOOKUP(K174,Proposito_programa!$C$2:$E$59,2,FALSE))","v":"Creación y vida cotidiana: Apropiación ciudadana del arte, la cultura y el patrimonio, para la democracia cultural"},{"$f":"IF(ISERROR(VLOOKUP(K174,Proposito_programa!$C$2:$E$59,3,FALSE)),\" \",VLOOKUP(K174,Proposito_programa!$C$2:$E$59,3,FALSE))","v":"Propósito 1: Hacer un nuevo contrato social para incrementar la inclusión social, productiva y política"},2110,3,"901233617-2","CORPORACION INTEGRAL PARA EL DESARROLLO DE LAS REGIONES COINDERE","Persona Jurídica",null,null,null,null,25885411,null,null,0,25885411,25885400,"2022-06-23","2022-07-21","2022-09-20",1,1,30,null,null,null,null,"Terminado",0.99999957505020876]
["FDLSF-CCV-163-2022",2022,"FDLSF-MC-011-2022","FDLSF-CCV-163-2022","Compraventa de bienes muebles","Contratación mínima cuantia","No aplica","ADQUISICION DE CHALECOS Y GORRAS PARA VENDEDORES INFORMALES DE LA LOCALIDAD SANTA FE QUE SE ENCUENTREN DENTRO DEL ACUERDO DE VENDEDORES BENEFICIADOS","Inversión","Un nuevo contrato social y ambiental para la Bogotá del Siglo XXI",45,{"$f":"IF(ISERROR(VLOOKUP(K175,Proposito_programa!$C$2:$E$59,2,FALSE)),\" \",VLOOKUP(K175,Proposito_programa!$C$2:$E$59,2,FALSE))","v":"Espacio público más seguro y construido colectivamente"},{"$f":"IF(ISERROR(VLOOKUP(K175,Proposito_programa!$C$2:$E$59,3,FALSE)),\" \",VLOOKUP(K175,Proposito_programa!$C$2:$E$59,3,FALSE))","v":"Propósito 3: Inspirar confianza y legitimidad para vivir sin miedo y ser epicentro de cultura ciudadana, paz y reconciliación"},2130,17,"901524576-8","SABANA COMPANY A&Y SAS / SC A&Y SAS","Persona Jurídica",null,null,null,null,28000000,null,null,0,28000000,27984003,"2022-07-06","2022-09-02","2022-11-01",2,0,0,null,null,null,null,"Terminado",0.99942867857142859]
["FDLSF-CPS-164-2022",2022,"FDLSF-CD-099-2022","FDLSF-CPS-164-2022","Contratos de prestación de servicios profesionales y de apoyo a la gestión","Contratación directa","Prestación de servicios profesionales y de apoyo a la gestión, o para la ejecución de trabajos artísticos que sólo puedan encomendarse a determinadas personas naturales","PRESTAR LOS SERVICIOS PROFESIONALES ESPECIALIZADOS PARA ADELANTAR LAS LIQUIDACIONES Y LIBERACIONES DE CONTRATOS Y CONVENIOS SUSCRITOS CONCARGO A LOS RECURSOS DEL FONDO DE DESARROLLO LOCAL DE SANTA FE, EPURACIÓN DE OBLIGACIONES POR PAGAR Y DEMÁS TRÁMITES PRE-CONTRACTUALES Y POS-CONTRACTUALES.","Inversión","Un nuevo contrato social y ambiental para la Bogotá del Siglo XXI",57,{"$f":"IF(ISERROR(VLOOKUP(K176,Proposito_programa!$C$2:$E$59,2,FALSE)),\" \",VLOOKUP(K176,Proposito_programa!$C$2:$E$59,2,FALSE))","v":"Gestión pública local"},{"$f":"IF(ISERROR(VLOOKUP(K176,Proposito_programa!$C$2:$E$59,3,FALSE)),\" \",VLOOKUP(K176,Proposito_programa!$C$2:$E$59,3,FALSE))","v":"Propósito 5: Construir Bogotá - Región con gobierno abierto, transparente y ciudadanía consciente"},2105,1,1014180831,"ADRIANA KATHERINE GUTIERREZ TORRES","Persona Natural",null,null,null,null,37500000,null,1,7500000,45000000,32250000,"2022-07-22","2022-07-22","2023-01-21",5,1,30,null,null,null,null,"Terminado",0.71666666666666667]
["FDLSF-CPS-165-2022",2022,"FDLSF-CD-100-2022","FDLSF-CPS-165-2022","Contratos de prestación de servicios profesionales y de apoyo a la gestión","Contratación directa","Prestación de servicios profesionales y de apoyo a la gestión, o para la ejecución de trabajos artísticos que sólo puedan encomendarse a determinadas personas naturales","PRESTAR LOS SERVICIOS PROFESIONALES Y ESPECIALIZADOS AL DESPACHO DE LA ALCALDIA LOCAL DE SANTA FE PARA LA COORDINACIÓN EN EL ÁREA GESTIÓN DEL DESARROLLO LOCAL EN TEMAS RELACIONADOS CON PLANEACIÓN E INFRAESTRUCTURA","Inversión","Un nuevo contrato social y ambiental para la Bogotá del Siglo XXI",57,{"$f":"IF(ISERROR(VLOOKUP(K177,Proposito_programa!$C$2:$E$59,2,FALSE)),\" \",VLOOKUP(K177,Proposito_programa!$C$2:$E$59,2,FALSE))","v":"Gestión pública local"},{"$f":"IF(ISERROR(VLOOKUP(K177,Proposito_programa!$C$2:$E$59,3,FALSE)),\" \",VLOOKUP(K177,Proposito_programa!$C$2:$E$59,3,FALSE))","v":"Propósito 5: Construir Bogotá - Región con gobierno abierto, transparente y ciudadanía consciente"},2105,1,80166444,"YERNEY ROLANDO RODRIGUEZ AVILA","Persona Natural",null,null,null,null,40390000,null,1,8078000,48468000,34735400,"2022-07-22","2022-07-22","2023-01-21",5,1,30,null,null,null,null,"Terminado",0.71666666666666667]
["FDLSF-CPS-166-2022",2022,"FDLSF-CD-101-2022","FDLSF-CPS-166-2022","Contratos de prestación de servicios profesionales y de apoyo a la gestión","Contratación directa","Prestación de servicios profesionales y de apoyo a la gestión, o para la ejecución de trabajos artísticos que sólo puedan encomendarse a determinadas personas naturales","APOYAR AL (A) ALCALDE (SA) LOCAL EN EL FORTALECIMIENTO E INCLUSIÓN DE LAS COMUNIDADES NEGRAS, AFROCOLOMBIANAS Y PALENQUERAS EN EL MARCO DE LA POLÍTICA PÚBLICA DISTRITAL AFRODESCENDIENTES Y LOS ESPACIOS DE PARTICIPACIÓN","Inversión","Un nuevo contrato social y ambiental para la Bogotá del Siglo XXI",57,{"$f":"IF(ISERROR(VLOOKUP(K178,Proposito_programa!$C$2:$E$59,2,FALSE)),\" \",VLOOKUP(K178,Proposito_programa!$C$2:$E$59,2,FALSE))","v":"Gestión pública local"},{"$f":"IF(ISERROR(VLOOKUP(K178,Proposito_programa!$C$2:$E$59,3,FALSE)),\" \",VLOOKUP(K178,Proposito_programa!$C$2:$E$59,3,FALSE))","v":"Propósito 5: Construir Bogotá - Región con gobierno abierto, transparente y ciudadanía consciente"},2105,1,1030633297,"EVELIN YESENIA QUIÑONES QUIÑONES","Persona Natural",null,null,null,null,24000000,null,null,0,24000000,18720000,"2022-08-03","2022-08-04","2022-12-31",4,0,0,null,null,null,null,"Terminado",0.78]
["FDLSF-CPS-167-2022",2022,"FDLSF-CD-102-2022","FDLSF-CPS-167-2022","Contratos de prestación de servicios profesionales y de apoyo a la gestión","Contratación directa","Prestación de servicios profesionales y de apoyo a la gestión, o para la ejecución de trabajos artísticos que sólo puedan encomendarse a determinadas personas naturales","PRESTAR LOS SERVICIOS PROFESIONALES EN EL DESPACHO DE LA ALCALDIA LOCAL EN LA EJECUCIÓN DE LAS ACTIVIDADES ADMINISTRATIVAS PROPIAS DE LA GESTIÓN LOCAL.","Inversión","Un nuevo contrato social y ambiental para la Bogotá del Siglo XXI",57,{"$f":"IF(ISERROR(VLOOKUP(K179,Proposito_programa!$C$2:$E$59,2,FALSE)),\" \",VLOOKUP(K179,Proposito_programa!$C$2:$E$59,2,FALSE))","v":"Gestión pública local"},{"$f":"IF(ISERROR(VLOOKUP(K179,Proposito_programa!$C$2:$E$59,3,FALSE)),\" \",VLOOKUP(K179,Proposito_programa!$C$2:$E$59,3,FALSE))","v":"Propósito 5: Construir Bogotá - Región con gobierno abierto, transparente y ciudadanía consciente"},2105,1,1081792430,"NINI CAROLINA MENDOZA JARABA","Persona Natural",null,null,null,null,24000000,null,null,0,24000000,18720000,"2022-07-29","2022-08-04","2022-12-31",4,0,0,null,null,null,null,"Terminado",0.78]
["FDLSF-CPS-168-2022",2022,"FDLSF-CD-103-2022","FDLSF-CPS-168-2022","Contratos de prestación de servicios profesionales y de apoyo a la gestión","Contratación directa","Prestación de servicios profesionales y de apoyo a la gestión, o para la ejecución de trabajos artísticos que sólo puedan encomendarse a determinadas personas naturales","APOYAR AL EQUIPO DE PRENSA Y COMUNICACIONES DE LA ALCALDÍA LOCAL EN LA REALIZACIÓN Y PUBLICACIÓN DE CONTENIDOS DE REDES SOCIALES Y CANALES DE DIVULGACIÓN DIGITAL (SITIO WEB) DE LA ALCALDÍA LOCAL.","Inversión","Un nuevo contrato social y ambiental para la Bogotá del Siglo XXI",57,{"$f":"IF(ISERROR(VLOOKUP(K180,Proposito_programa!$C$2:$E$59,2,FALSE)),\" \",VLOOKUP(K180,Proposito_programa!$C$2:$E$59,2,FALSE))","v":"Gestión pública local"},{"$f":"IF(ISERROR(VLOOKUP(K180,Proposito_programa!$C$2:$E$59,3,FALSE)),\" \",VLOOKUP(K180,Proposito_programa!$C$2:$E$59,3,FALSE))","v":"Propósito 5: Construir Bogotá - Región con gobierno abierto, transparente y ciudadanía consciente"},2105,1,1033731738,"NATALIA ANDREA RUBIANO FORERO","Persona Natural",null,null,null,null,25860000,null,null,0,25860000,20138400,"2022-07-29","2022-08-04","2022-12-31",4,0,0,null,null,null,null,"Terminado",0.7787470997679814]
["FDLSF-CPD-169-2022",2022,"FDLSF-CD-104-2022","FDLSF-CPD-169-2022","Contratos de prestación de servicios profesionales y de apoyo a la gestión","Contratación directa","Prestación de servicios profesionales y de apoyo a la gestión, o para la ejecución de trabajos artísticos que sólo puedan encomendarse a determinadas personas naturales","PRESTAR LOS SERVICIOS JURÍDICOS ESPECIALIZADOS PARA APOYAR AL DESPACHO DE LA ALCALDIA LOCAL DE SANTA FE, EN MATERIA DE CONTRATACIÓN ESTATAL Y DERECHO ADMINISTRATIVO.","Inversión","Un nuevo contrato social y ambiental para la Bogotá del Siglo XXI",57,{"$f":"IF(ISERROR(VLOOKUP(K181,Proposito_programa!$C$2:$E$59,2,FALSE)),\" \",VLOOKUP(K181,Proposito_programa!$C$2:$E$59,2,FALSE))","v":"Gestión pública local"},{"$f":"IF(ISERROR(VLOOKUP(K181,Proposito_programa!$C$2:$E$59,3,FALSE)),\" \",VLOOKUP(K181,Proposito_programa!$C$2:$E$59,3,FALSE))","v":"Propósito 5: Construir Bogotá - Región con gobierno abierto, transparente y ciudadanía consciente"},2105,1,80822570,"LENNIN LEANDRO TRIGOS SILVA","Persona Natural",null,null,null,null,40390000,null,1,8078000,48468000,33389067,"2022-07-27","2022-07-27","2023-01-26",5,1,30,null,null,null,null,"Terminado",0.68888889576627876]
["FDLSF-CPS-170-2022",2022,"FDLSF-CD-105-2022","FDLSF-CPS-170-2022","Contratos de prestación de servicios profesionales y de apoyo a la gestión","Contratación directa","Prestación de servicios profesionales y de apoyo a la gestión, o para la ejecución de trabajos artísticos que sólo puedan encomendarse a determinadas personas naturales","PRESTAR SERVICIOS PROFESIONALES EN EL ÁREA DE GESTIÓN POLÍCIVA DE LA ALCALDÍA LOCAL DE SANTA FE EN LO REFERENTE A LAS ACTUACIONES Y REGISTROS DE LAS VISITAS REALIZADAS A LOS CERROS ORIENTALES, EN CUMPLIMENTO DE LA ACCIÓN POPULAR N° 25000232500020050066203 Y DEMÁS ACTUACIONES ADMINISTRATIVAS QUE CURSAN EN LA ALCALDÍA LOCAL QUE LE SEAN ASIGNADAS","Inversión","Un nuevo contrato social y ambiental para la Bogotá del Siglo XXI",57,{"$f":"IF(ISERROR(VLOOKUP(K182,Proposito_programa!$C$2:$E$59,2,FALSE)),\" \",VLOOKUP(K182,Proposito_programa!$C$2:$E$59,2,FALSE))","v":"Gestión pública local"},{"$f":"IF(ISERROR(VLOOKUP(K182,Proposito_programa!$C$2:$E$59,3,FALSE)),\" \",VLOOKUP(K182,Proposito_programa!$C$2:$E$59,3,FALSE))","v":"Propósito 5: Construir Bogotá - Región con gobierno abierto, transparente y ciudadanía consciente"},2105,1,79913115,"ELKIN EMIR CABRERA BARRERA","Persona Natural",null,null,null,null,27500000,null,null,0,27500000,8249999,"2022-07-29","2022-08-02","2022-12-31",5,0,0,null,null,null,null,"Terminado",0.29999996363636361]
["FDLSF-CPS-171-2022",2022,"FDLSF-CD-106-2022","FDLSF-CPS-171-2022","Contratos de prestación de servicios profesionales y de apoyo a la gestión","Contratación directa","Prestación de servicios profesionales y de apoyo a la gestión, o para la ejecución de trabajos artísticos que sólo puedan encomendarse a determinadas personas naturales","PRESTAR SERVICIOS PROFESIONALES ESPECIALIZADOS PARA APOYAR LA ORGANIZACIÓN Y ESTRUCTURACIÓN DE LA GESTIÓN JURÍDICA DEL DESPACHO DE LA ALCALDÍA LOCAL DE SANTA FE Y LA DE LAS DEPENDENCIAS QUE LA CONFORMAN","Inversión","Un nuevo contrato social y ambiental para la Bogotá del Siglo XXI",57,{"$f":"IF(ISERROR(VLOOKUP(K183,Proposito_programa!$C$2:$E$59,2,FALSE)),\" \",VLOOKUP(K183,Proposito_programa!$C$2:$E$59,2,FALSE))","v":"Gestión pública local"},{"$f":"IF(ISERROR(VLOOKUP(K183,Proposito_programa!$C$2:$E$59,3,FALSE)),\" \",VLOOKUP(K183,Proposito_programa!$C$2:$E$59,3,FALSE))","v":"Propósito 5: Construir Bogotá - Región con gobierno abierto, transparente y ciudadanía consciente"},2105,1,63341944,"CARMEN TERESA CASTAÑEDA VILLAMIZAR","Persona Natural",null,null,null,null,40390000,null,null,0,40390000,32850533,"2022-07-27","2022-07-29","2022-12-28",5,0,0,null,null,null,null,"Terminado",0.81333332508046541]
["FDLSF-CPS-172-2022",2022,"FDLSF-CD-107-2022","FDLSF-CPS-172-2022","Contratos de prestación de servicios profesionales y de apoyo a la gestión","Contratación directa","Prestación de servicios profesionales y de apoyo a la gestión, o para la ejecución de trabajos artísticos que sólo puedan encomendarse a determinadas personas naturales","PRESTAR LOS SERVICIOS PROFESIONALES AL ÁREA DE GESTIÓN DEL DESARROLLO LOCAL DE LA ALCALDÍA LOCAL DE SANTA FE EN LOS TRÁMITES, PROCEDIMIENTOS Y APLICATIVOS CONTABLES DEL FONDO DE DESARROLLO DE SANTA FE","Inversión","Un nuevo contrato social y ambiental para la Bogotá del Siglo XXI",57,{"$f":"IF(ISERROR(VLOOKUP(K184,Proposito_programa!$C$2:$E$59,2,FALSE)),\" \",VLOOKUP(K184,Proposito_programa!$C$2:$E$59,2,FALSE))","v":"Gestión pública local"},{"$f":"IF(ISERROR(VLOOKUP(K184,Proposito_programa!$C$2:$E$59,3,FALSE)),\" \",VLOOKUP(K184,Proposito_programa!$C$2:$E$59,3,FALSE))","v":"Propósito 5: Construir Bogotá - Región con gobierno abierto, transparente y ciudadanía consciente"},2105,1,52808814,"LIZ VIBIANA TORRES BUITRAGO","Persona Natural",null,null,null,null,24000000,null,null,0,24000000,15040000,"2022-07-27","2022-07-27","2022-11-01",5,0,0,null,null,null,null,"Terminado",0.62666666666666671]
["FDLSF-CPS-173-2022",2022,"FDLSF-SAMC-002-2022","FDLSF-CPS-173-2022","Contratos de prestación de servicios","Selección abreviada","No aplica","PRESTAR SERVICIOS PARA PERSONAS CON DISCAPACIDAD Y SUS CUIDADORES/AS EN ACCIONES COMPLEMENTARIAS A TRAVÉS DE LA EJECUCIÓN DE LOS COMPONENTES DE SALUD MENTAL POSITIVA, HERRAMIENTAS VIRTUALES DE APRENDIZAJE PARA EL CUIDADO Y MEDIOS ALTERNATIVOS PARA SALUD Y BIENESTAR","Inversión","Un nuevo contrato social y ambiental para la Bogotá del Siglo XXI",6,{"$f":"IF(ISERROR(VLOOKUP(K185,Proposito_programa!$C$2:$E$59,2,FALSE)),\" \",VLOOKUP(K185,Proposito_programa!$C$2:$E$59,2,FALSE))","v":"Sistema Distrital de Cuidado"},{"$f":"IF(ISERROR(VLOOKUP(K185,Proposito_programa!$C$2:$E$59,3,FALSE)),\" \",VLOOKUP(K185,Proposito_programa!$C$2:$E$59,3,FALSE))","v":"Propósito 1: Hacer un nuevo contrato social para incrementar la inclusión social, productiva y política"},2188,4,"811000798-0","ASESORIAS Y CONSULTORIAS EN DESARROLLO SOCIAL Y SALUD SAS / ASCODES SAS","Persona Jurídica",null,null,null,null,93404921,null,null,0,93404921,0,"2022-08-02","2022-09-12","2023-03-12",6,0,0,null,null,null,null,"En ejecución",0]
["FDLSF-CPS-174-2022",2022,"FDLSF-CD-116-2022","FDLSF-CPS-174-2022","Contratos de prestación de servicios profesionales y de apoyo a la gestión","Contratación directa","Prestación de servicios profesionales y de apoyo a la gestión, o para la ejecución de trabajos artísticos que sólo puedan encomendarse a determinadas personas naturales","PRESTAR LOS SERVICIOS DE APOYO AL ÁREA DE GESTIÓN DEL DESARROLLO LOCAL, EN LO RELACIONADO CON LAS ACTIVIDADES DEL ALMACÉN DE LA ALCALDÍA LOCAL DE SANTA FE.","Inversión","Un nuevo contrato social y ambiental para la Bogotá del Siglo XXI",57,{"$f":"IF(ISERROR(VLOOKUP(K186,Proposito_programa!$C$2:$E$59,2,FALSE)),\" \",VLOOKUP(K186,Proposito_programa!$C$2:$E$59,2,FALSE))","v":"Gestión pública local"},{"$f":"IF(ISERROR(VLOOKUP(K186,Proposito_programa!$C$2:$E$59,3,FALSE)),\" \",VLOOKUP(K186,Proposito_programa!$C$2:$E$59,3,FALSE))","v":"Propósito 5: Construir Bogotá - Región con gobierno abierto, transparente y ciudadanía consciente"},2105,1,79290857,"VICTOR MANUEL BEJARANO","Persona Natural",null,null,null,null,13635000,null,null,0,13635000,9908100,"2022-08-11","2022-08-12","2022-12-31",4,0,0,null,null,null,null,"Terminado",0.72666666666666668]
["FDLSF-CPS-175-2022",2022,"FDLSF-CD-117-2022","FDLSF-CPS-175-2022","Contratos de prestación de servicios profesionales y de apoyo a la gestión","Contratación directa","Prestación de servicios profesionales y de apoyo a la gestión, o para la ejecución de trabajos artísticos que sólo puedan encomendarse a determinadas personas naturales","PRESTAR SERVICIOS PROFESIONALES ESPECIALIZADOS PARA APOYAR JURIDICAMENTE AL DESPACHO DE LA ALCALDIA LOCAL DE SANTA FE CON LOS PLANES DE MEJORAMIENTO Y DE CAPACITACIÓN DE LA ENTIDAD","Inversión","Un nuevo contrato social y ambiental para la Bogotá del Siglo XXI",57,{"$f":"IF(ISERROR(VLOOKUP(K187,Proposito_programa!$C$2:$E$59,2,FALSE)),\" \",VLOOKUP(K187,Proposito_programa!$C$2:$E$59,2,FALSE))","v":"Gestión pública local"},{"$f":"IF(ISERROR(VLOOKUP(K187,Proposito_programa!$C$2:$E$59,3,FALSE)),\" \",VLOOKUP(K187,Proposito_programa!$C$2:$E$59,3,FALSE))","v":"Propósito 5: Construir Bogotá - Región con gobierno abierto, transparente y ciudadanía consciente"},2105,1,79055269,"WILSON GIOVANI RODRIGUEZ RODRIGUEZ","Persona Natural",null,null,null,null,37800000,null,null,0,37800000,27468000,"2022-08-04","2022-08-04","2022-12-31",4,0,0,null,null,null,null,"Terminado",0.72666666666666668]
["FDLSF-CPS-176-2022",2022,"FDLSF-CD-118-2022","FDLSF-CPS-176-2022","Contratos de prestación de servicios profesionales y de apoyo a la gestión","Contratación directa","Prestación de servicios profesionales y de apoyo a la gestión, o para la ejecución de trabajos artísticos que sólo puedan encomendarse a determinadas personas naturales","PRESTAR SERVICIOS PROFESIONALES EN EL ÁREA DE GESTIÓN DE DESARROLLO LOCAL PARA LA PLANEACIÓN, ESTRUCTURACIÓN, VIABILIZACIÓN, EVALUACIÓN Y SEGUIMIENTO DE LOS PROYECTOS DE INVERSIÓN  DE  LA  ALCALDIA  LOCAL  DE  SANTA  FE  RELACIONADOS  CON  LA  GESTIÓN  AMBIENTAL  DE  LA LOCALIDAD DE SANTA FE.","Inversión","Un nuevo contrato social y ambiental para la Bogotá del Siglo XXI",57,{"$f":"IF(ISERROR(VLOOKUP(K188,Proposito_programa!$C$2:$E$59,2,FALSE)),\" \",VLOOKUP(K188,Proposito_programa!$C$2:$E$59,2,FALSE))","v":"Gestión pública local"},{"$f":"IF(ISERROR(VLOOKUP(K188,Proposito_programa!$C$2:$E$59,3,FALSE)),\" \",VLOOKUP(K188,Proposito_programa!$C$2:$E$59,3,FALSE))","v":"Propósito 5: Construir Bogotá - Región con gobierno abierto, transparente y ciudadanía consciente"},2105,1,52225347,"ADRIANA ISSIS RAMOS DOMINGUEZ","Persona Natural",null,null,null,null,24000000,null,null,0,24000000,17440000,"2022-08-09","2022-08-12","2022-12-31",4,0,0,null,null,null,null,"Terminado",0.72666666666666668]
["FDLSF-CPS-177-2022",2022,"FDLSF-CD-119-2022","FDLSF-CPS-177-2022","Contratos de prestación de servicios profesionales y de apoyo a la gestión","Contratación directa","Prestación de servicios profesionales y de apoyo a la gestión, o para la ejecución de trabajos artísticos que sólo puedan encomendarse a determinadas personas naturales","PRESTAR LOS SERVICIOS TÉCNICOS AL FONDO DE DESARROLLO LOCAL DE SANTA FE, EN LA GESTIÓN DE TEMAS RELACIONADOS CON SEGURIDAD CIUDADANA Y CONVIVENCIA DE LA LOCALIDAD","Inversión","Un nuevo contrato social y ambiental para la Bogotá del Siglo XXI",57,{"$f":"IF(ISERROR(VLOOKUP(K189,Proposito_programa!$C$2:$E$59,2,FALSE)),\" \",VLOOKUP(K189,Proposito_programa!$C$2:$E$59,2,FALSE))","v":"Gestión pública local"},{"$f":"IF(ISERROR(VLOOKUP(K189,Proposito_programa!$C$2:$E$59,3,FALSE)),\" \",VLOOKUP(K189,Proposito_programa!$C$2:$E$59,3,FALSE))","v":"Propósito 5: Construir Bogotá - Región con gobierno abierto, transparente y ciudadanía consciente"},2105,1,80033800,"DAVID RUBIO JIMENEZ","Persona Natural",null,null,null,null,14550000,null,null,0,14550000,10573000,"2022-08-12","2022-08-12","2023-01-11",5,0,11,null,null,null,null,"Terminado",0.72666666666666668]
["FDLSF-CS-178-2022",2022,"FDLSF-SAMC-001-2022","FDLSF-CS-178-2022","Seguro","Selección abreviada","Selección abreviada por menor cuantía ","CONTRATAR LOS SEGUROS QUE AMPAREN LOS INTERESES PATRIMONIALES ACTUALES Y FUTUROS, ASÍ COMO LOS BIENES DE PROPIEDAD DEL FONDO DE DESARROLLO LOCAL DE SANTA FE QUE ESTÉN BAJO SU RESPONSABILIDAD Y CUSTODIA Y AQUELLOS QUE SEAN ADQUIRIDOS PARA DESARROLLAR LAS FUNCIONES INHERENTES A SU ACTIVIDAD, ASÍ COMO LA EXPEDICIÓN DE UNA PÓLIZA COLECTIVA DE SEGURO DE VIDA PARA LOS EDILES DE LA LOCALIDAD Y CUALQUIER OTRA PÓLIZA DE SEGUROS QUE REQUIERA LA ENTIDAD EN EL DESARROLLO DE SU ACTIVIDAD","Funcionamiento",null,"No aplica",{"$f":"IF(ISERROR(VLOOKUP(K190,Proposito_programa!$C$2:$E$59,2,FALSE)),\" \",VLOOKUP(K190,Proposito_programa!$C$2:$E$59,2,FALSE))","v":" "},{"$f":"IF(ISERROR(VLOOKUP(K190,Proposito_programa!$C$2:$E$59,3,FALSE)),\" \",VLOOKUP(K190,Proposito_programa!$C$2:$E$59,3,FALSE))","v":" "},"No aplica",4,860002184,"AXA COLPATRIA SEGUROS S.A","Persona Jurídica",null,null,null,null,3778600,null,null,0,3778600,3778600,"2022-08-09","2022-08-15","2023-08-14",0,0,0,null,null,null,null,"Terminado",1]
["FDLSF-CS-178-2022",2022,"FDLSF-SAMC-001-2022","FDLSF-CS-178-2022","Seguro","Selección abreviada","Selección abreviada por menor cuantía ","CONTRATAR LOS SEGUROS QUE AMPAREN LOS INTERESES PATRIMONIALES ACTUALES Y FUTUROS, ASÍ COMO LOS BIENES DE PROPIEDAD DEL FONDO DE DESARROLLO LOCAL DE SANTA FE QUE ESTÉN BAJO SU RESPONSABILIDAD Y CUSTODIA Y AQUELLOS QUE SEAN ADQUIRIDOS PARA DESARROLLAR LAS FUNCIONES INHERENTES A SU ACTIVIDAD, ASÍ COMO LA EXPEDICIÓN DE UNA PÓLIZA COLECTIVA DE SEGURO DE VIDA PARA LOS EDILES DE LA LOCALIDAD Y CUALQUIER OTRA PÓLIZA DE SEGUROS QUE REQUIERA LA ENTIDAD EN EL DESARROLLO DE SU ACTIVIDAD","Funcionamiento",null,"No aplica",{"$f":"IF(ISERROR(VLOOKUP(K191,Proposito_programa!$C$2:$E$59,2,FALSE)),\" \",VLOOKUP(K191,Proposito_programa!$C$2:$E$59,2,FALSE))","v":" "},{"$f":"IF(ISERROR(VLOOKUP(K191,Proposito_programa!$C$2:$E$59,3,FALSE)),\" \",VLOOKUP(K191,Proposito_programa!$C$2:$E$59,3,FALSE))","v":" "},"No aplica",4,860002184,"AXA COLPATRIA SEGUROS S.A","Persona Jurídica",null,null,null,null,6887125,null,null,0,6887125,6887125,"2022-08-09","2022-08-15","2023-08-14",0,0,0,null,null,null,null,"Terminado",1]
["FDLSF-CS-178-2022",2022,"FDLSF-SAMC-001-2022","FDLSF-CS-178-2022","Seguro","Selección abreviada","Selección abreviada por menor cuantía ","CONTRATAR LOS SEGUROS QUE AMPAREN LOS INTERESES PATRIMONIALES ACTUALES Y FUTUROS, ASÍ COMO LOS BIENES DE PROPIEDAD DEL FONDO DE DESARROLLO LOCAL DE SANTA FE QUE ESTÉN BAJO SU RESPONSABILIDAD Y CUSTODIA Y AQUELLOS QUE SEAN ADQUIRIDOS PARA DESARROLLAR LAS FUNCIONES INHERENTES A SU ACTIVIDAD, ASÍ COMO LA EXPEDICIÓN DE UNA PÓLIZA COLECTIVA DE SEGURO DE VIDA PARA LOS EDILES DE LA LOCALIDAD Y CUALQUIER OTRA PÓLIZA DE SEGUROS QUE REQUIERA LA ENTIDAD EN EL DESARROLLO DE SU ACTIVIDAD","Funcionamiento",null,"No aplica",{"$f":"IF(ISERROR(VLOOKUP(K192,Proposito_programa!$C$2:$E$59,2,FALSE)),\" \",VLOOKUP(K192,Proposito_programa!$C$2:$E$59,2,FALSE))","v":" "},{"$f":"IF(ISERROR(VLOOKUP(K192,Proposito_programa!$C$2:$E$59,3,FALSE)),\" \",VLOOKUP(K192,Proposito_programa!$C$2:$E$59,3,FALSE))","v":" "},"No aplica",4,860002184,"AXA COLPATRIA SEGUROS S.A","Persona Jurídica",null,null,null,null,12508926,null,null,0,12508926,12508926,"2022-08-09","2022-08-15","2023-08-14",0,0,0,null,null,null,null,"Terminado",1]
["FDLSF-CS-178-2022",2022,"FDLSF-SAMC-001-2022","FDLSF-CS-178-2022","Seguro","Selección abreviada","Selección abreviada por menor cuantía ","CONTRATAR LOS SEGUROS QUE AMPAREN LOS INTERESES PATRIMONIALES ACTUALES Y FUTUROS, ASÍ COMO LOS BIENES DE PROPIEDAD DEL FONDO DE DESARROLLO LOCAL DE SANTA FE QUE ESTÉN BAJO SU RESPONSABILIDAD Y CUSTODIA Y AQUELLOS QUE SEAN ADQUIRIDOS PARA DESARROLLAR LAS FUNCIONES INHERENTES A SU ACTIVIDAD, ASÍ COMO LA EXPEDICIÓN DE UNA PÓLIZA COLECTIVA DE SEGURO DE VIDA PARA LOS EDILES DE LA LOCALIDAD Y CUALQUIER OTRA PÓLIZA DE SEGUROS QUE REQUIERA LA ENTIDAD EN EL DESARROLLO DE SU ACTIVIDAD","Funcionamiento",null,"No aplica",{"$f":"IF(ISERROR(VLOOKUP(K193,Proposito_programa!$C$2:$E$59,2,FALSE)),\" \",VLOOKUP(K193,Proposito_programa!$C$2:$E$59,2,FALSE))","v":" "},{"$f":"IF(ISERROR(VLOOKUP(K193,Proposito_programa!$C$2:$E$59,3,FALSE)),\" \",VLOOKUP(K193,Proposito_programa!$C$2:$E$59,3,FALSE))","v":" "},"No aplica",4,860002184,"AXA COLPATRIA SEGUROS S.A","Persona Jurídica",null,null,null,null,83895000,null,null,0,83895000,83895000,"2022-08-09","2022-08-15","2023-08-14",0,0,0,null,null,null,null,"Terminado",1]
["FDLSF-CS-178-2022",2022,"FDLSF-SAMC-001-2022","FDLSF-CS-178-2022","Seguro","Selección abreviada","Selección abreviada por menor cuantía ","CONTRATAR LOS SEGUROS QUE AMPAREN LOS INTERESES PATRIMONIALES ACTUALES Y FUTUROS, ASÍ COMO LOS BIENES DE PROPIEDAD DEL FONDO DE DESARROLLO LOCAL DE SANTA FE QUE ESTÉN BAJO SU RESPONSABILIDAD Y CUSTODIA Y AQUELLOS QUE SEAN ADQUIRIDOS PARA DESARROLLAR LAS FUNCIONES INHERENTES A SU ACTIVIDAD, ASÍ COMO LA EXPEDICIÓN DE UNA PÓLIZA COLECTIVA DE SEGURO DE VIDA PARA LOS EDILES DE LA LOCALIDAD Y CUALQUIER OTRA PÓLIZA DE SEGUROS QUE REQUIERA LA ENTIDAD EN EL DESARROLLO DE SU ACTIVIDAD","Funcionamiento",null,"No aplica",{"$f":"IF(ISERROR(VLOOKUP(K194,Proposito_programa!$C$2:$E$59,2,FALSE)),\" \",VLOOKUP(K194,Proposito_programa!$C$2:$E$59,2,FALSE))","v":" "},{"$f":"IF(ISERROR(VLOOKUP(K194,Proposito_programa!$C$2:$E$59,3,FALSE)),\" \",VLOOKUP(K194,Proposito_programa!$C$2:$E$59,3,FALSE))","v":" "},"No aplica",4,860002184,"AXA COLPATRIA SEGUROS S.A","Persona Jurídica",null,null,null,null,5950000,null,null,0,5950000,5950000,"2022-08-09","2022-08-15","2023-08-14",0,0,0,null,null,null,null,"Terminado",1]
["FDLSF-CS-179-2022",2022,"FDLSF-SAMC-001-2022","FDLSF-CS-179-2022","Seguro","Selección abreviada","Selección abreviada por menor cuantía ","CONTRATAR LOS SEGUROS QUE AMPAREN LOS INTERESES PATRIMONIALES ACTUALES Y FUTUROS, ASÍ COMO LOS BIENES DE PROPIEDAD DEL FONDO DE DESARROLLO LOCAL DE SANTA FE QUE ESTÉN BAJO SU RESPONSABILIDAD Y CUSTODIA Y AQUELLOS QUE SEAN ADQUIRIDOS PARA DESARROLLAR LAS FUNCIONES INHERENTES A SU ACTIVIDAD, ASÍ COMO LA EXPEDICIÓN DE UNA PÓLIZA COLECTIVA DE SEGURO DE VIDA PARA LOS EDILES DE LA LOCALIDAD Y CUALQUIER OTRA PÓLIZA DE SEGUROS QUE REQUIERA LA ENTIDAD EN EL DESARROLLO DE SU ACTIVIDAD","Funcionamiento",null,"No aplica",{"$f":"IF(ISERROR(VLOOKUP(K195,Proposito_programa!$C$2:$E$59,2,FALSE)),\" \",VLOOKUP(K195,Proposito_programa!$C$2:$E$59,2,FALSE))","v":" "},{"$f":"IF(ISERROR(VLOOKUP(K195,Proposito_programa!$C$2:$E$59,3,FALSE)),\" \",VLOOKUP(K195,Proposito_programa!$C$2:$E$59,3,FALSE))","v":" "},"No aplica",4,860037013,"COMPAÑÍA MUNDIAL DE SEGUROS S.A","Persona Jurídica",null,null,null,null,9870000,null,null,0,9870000,0,"2022-08-08","2022-11-20","2023-11-19",0,0,0,null,null,null,null,"En ejecución",0]
["FDLSF-CPS-180-2022",2022,"FDLSF-CD-115-2022","FDLSF-CPS-180-2022","Contratos de prestación de servicios profesionales y de apoyo a la gestión","Contratación directa","Prestación de servicios profesionales y de apoyo a la gestión, o para la ejecución de trabajos artísticos que sólo puedan encomendarse a determinadas personas naturales","PRESTAR SUS SERVICIOS PROFESIONALES PARA LA ESTRUCTURACIÓN, VIABILIZACIÓN, EVALUACIÓN Y SEGUIMIENTO DE LOS PROYECTOS DEL PRESUPUESTO DEL FONDO DE DESARROLLO LOCAL DE SANTA FE QUE LE SEAN ASIGNADOS.","Inversión","Un nuevo contrato social y ambiental para la Bogotá del Siglo XXI",57,{"$f":"IF(ISERROR(VLOOKUP(K196,Proposito_programa!$C$2:$E$59,2,FALSE)),\" \",VLOOKUP(K196,Proposito_programa!$C$2:$E$59,2,FALSE))","v":"Gestión pública local"},{"$f":"IF(ISERROR(VLOOKUP(K196,Proposito_programa!$C$2:$E$59,3,FALSE)),\" \",VLOOKUP(K196,Proposito_programa!$C$2:$E$59,3,FALSE))","v":"Propósito 5: Construir Bogotá - Región con gobierno abierto, transparente y ciudadanía consciente"},2105,1,80098547," ALBERT ANDRES RINCON BELLO","Persona Natural",null,null,null,null,30500000,null,null,0,30500000,23586666,"2022-08-04","2022-08-05","2022-12-31",4,0,0,null,null,null,null,"Terminado",0.77333331147540985]
["FDLSF-CPS-181-2022",2022,"FDLSF-CD-110-2022","FDLSF-CPS-181-2022","Contratos de prestación de servicios profesionales y de apoyo a la gestión","Contratación directa","Prestación de servicios profesionales y de apoyo a la gestión, o para la ejecución de trabajos artísticos que sólo puedan encomendarse a determinadas personas naturales","PRESTAR SUS SERVICIOS COMO APOYO EN LAS ACTIVIDADES PREVISTAS PARA LA IMPLEMENTACIÓN DE PROCESOS DE FORMACIÓN DEPORTIVA Y ACONDICIONAMIENTO FÍSICO DEL ADULTO MAYOR EN LA LOCALIDAD DE SANTA FE","Inversión","Un nuevo contrato social y ambiental para la Bogotá del Siglo XXI",20,{"$f":"IF(ISERROR(VLOOKUP(K197,Proposito_programa!$C$2:$E$59,2,FALSE)),\" \",VLOOKUP(K197,Proposito_programa!$C$2:$E$59,2,FALSE))","v":"Bogotá, referente en cultura, deporte, recreación y actividad física, con parques para el desarrollo y la salud"},{"$f":"IF(ISERROR(VLOOKUP(K197,Proposito_programa!$C$2:$E$59,3,FALSE)),\" \",VLOOKUP(K197,Proposito_programa!$C$2:$E$59,3,FALSE))","v":"Propósito 1: Hacer un nuevo contrato social para incrementar la inclusión social, productiva y política"},2100,1,1010201281,"MONICA ALEJANDRA RUIZ BELTRAN","Persona Natural",null,null,null,null,8000000,null,null,0,8000000,5546667,"2022-08-10","2022-08-17","2022-12-31",4,0,0,null,null,null,null,"Terminado",0.69333337500000003]
["FDLSF-CPS-182-2022",2022,"FDLSF-CD-110-2022","FDLSF-CPS-182-2022","Contratos de prestación de servicios profesionales y de apoyo a la gestión","Contratación directa","Prestación de servicios profesionales y de apoyo a la gestión, o para la ejecución de trabajos artísticos que sólo puedan encomendarse a determinadas personas naturales","PRESTAR SUS SERVICIOS COMO APOYO EN LAS ACTIVIDADES PREVISTAS PARA LA IMPLEMENTACIÓN DE PROCESOS DE FORMACIÓN DEPORTIVA Y ACONDICIONAMIENTO FÍSICO DEL ADULTO MAYOR EN LA LOCALIDAD DE SANTA FE","Inversión","Un nuevo contrato social y ambiental para la Bogotá del Siglo XXI",20,{"$f":"IF(ISERROR(VLOOKUP(K198,Proposito_programa!$C$2:$E$59,2,FALSE)),\" \",VLOOKUP(K198,Proposito_programa!$C$2:$E$59,2,FALSE))","v":"Bogotá, referente en cultura, deporte, recreación y actividad física, con parques para el desarrollo y la salud"},{"$f":"IF(ISERROR(VLOOKUP(K198,Proposito_programa!$C$2:$E$59,3,FALSE)),\" \",VLOOKUP(K198,Proposito_programa!$C$2:$E$59,3,FALSE))","v":"Propósito 1: Hacer un nuevo contrato social para incrementar la inclusión social, productiva y política"},2100,1,1026300965,"MARLON DAVID CHAVES MELENDEZ ","Persona Natural",null,null,null,null,8000000,null,1,1600000,9600000,5546667,"2022-08-11","2022-08-17","2023-01-31",4,1,30,null,null,null,null,"Terminado",{"$f":"IF(ISERROR(AB198/AA198),\"-\",(AB198/AA198))","v":0.57777781250000004}]
["FDLSF-CPS-183-2022",2022,"FDLSF-CD-110-2022","FDLSF-CPS-183-2022","Contratos de prestación de servicios profesionales y de apoyo a la gestión","Contratación directa","Prestación de servicios profesionales y de apoyo a la gestión, o para la ejecución de trabajos artísticos que sólo puedan encomendarse a determinadas personas naturales","PRESTAR SUS SERVICIOS COMO APOYO EN LAS ACTIVIDADES PREVISTAS PARA LA IMPLEMENTACIÓN DE PROCESOS DE FORMACIÓN DEPORTIVA Y ACONDICIONAMIENTO FÍSICO DEL ADULTO MAYOR EN LA LOCALIDAD DE SANTA FE","Inversión","Un nuevo contrato social y ambiental para la Bogotá del Siglo XXI",20,{"$f":"IF(ISERROR(VLOOKUP(K199,Proposito_programa!$C$2:$E$59,2,FALSE)),\" \",VLOOKUP(K199,Proposito_programa!$C$2:$E$59,2,FALSE))","v":"Bogotá, referente en cultura, deporte, recreación y actividad física, con parques para el desarrollo y la salud"},{"$f":"IF(ISERROR(VLOOKUP(K199,Proposito_programa!$C$2:$E$59,3,FALSE)),\" \",VLOOKUP(K199,Proposito_programa!$C$2:$E$59,3,FALSE))","v":"Propósito 1: Hacer un nuevo contrato social para incrementar la inclusión social, productiva y política"},2100,1,1026281709,"FRANCY NATALIA VALENCIA ALBA","Persona Natural",null,null,null,null,8000000,null,1,1600000,9600000,5973333,"2022-08-09","2022-08-09","2023-01-31",5,1,30,null,null,null,null,"Terminado",0.62222218750000002]
["FDLSF-CPS-184-2022",2022,"FDLSF-CD-110-2022","FDLSF-CPS-184-2022","Contratos de prestación de servicios profesionales y de apoyo a la gestión","Contratación directa","Prestación de servicios profesionales y de apoyo a la gestión, o para la ejecución de trabajos artísticos que sólo puedan encomendarse a determinadas personas naturales","PRESTAR SUS SERVICIOS COMO APOYO EN LAS ACTIVIDADES PREVISTAS PARA LA IMPLEMENTACIÓN DE PROCESOS DE FORMACIÓN DEPORTIVA Y ACONDICIONAMIENTO FÍSICO DEL ADULTO MAYOR EN LA LOCALIDAD DE SANTA FE","Inversión","Un nuevo contrato social y ambiental para la Bogotá del Siglo XXI",20,{"$f":"IF(ISERROR(VLOOKUP(K200,Proposito_programa!$C$2:$E$59,2,FALSE)),\" \",VLOOKUP(K200,Proposito_programa!$C$2:$E$59,2,FALSE))","v":"Bogotá, referente en cultura, deporte, recreación y actividad física, con parques para el desarrollo y la salud"},{"$f":"IF(ISERROR(VLOOKUP(K200,Proposito_programa!$C$2:$E$59,3,FALSE)),\" \",VLOOKUP(K200,Proposito_programa!$C$2:$E$59,3,FALSE))","v":"Propósito 1: Hacer un nuevo contrato social para incrementar la inclusión social, productiva y política"},2100,1,1022326119,"LEIDY JOHANNA CUMBE SOUSA","Persona Natural",null,null,null,null,8000000,null,null,0,8000000,5546667,"2022-08-09","2022-08-17","2022-12-31",4,0,0,null,null,null,null,"Terminado",0.69333337500000003]
["FDLSF-CPS-185-2022",2022,"FDLSF-CD-110-2022","FDLSF-CPS-185-2022","Contratos de prestación de servicios profesionales y de apoyo a la gestión","Contratación directa","Prestación de servicios profesionales y de apoyo a la gestión, o para la ejecución de trabajos artísticos que sólo puedan encomendarse a determinadas personas naturales","PRESTAR SUS SERVICIOS COMO APOYO EN LAS ACTIVIDADES PREVISTAS PARA LA IMPLEMENTACIÓN DE PROCESOS DE FORMACIÓN DEPORTIVA Y ACONDICIONAMIENTO FÍSICO DEL ADULTO MAYOR EN LA LOCALIDAD DE SANTA FE","Inversión","Un nuevo contrato social y ambiental para la Bogotá del Siglo XXI",20,{"$f":"IF(ISERROR(VLOOKUP(K201,Proposito_programa!$C$2:$E$59,2,FALSE)),\" \",VLOOKUP(K201,Proposito_programa!$C$2:$E$59,2,FALSE))","v":"Bogotá, referente en cultura, deporte, recreación y actividad física, con parques para el desarrollo y la salud"},{"$f":"IF(ISERROR(VLOOKUP(K201,Proposito_programa!$C$2:$E$59,3,FALSE)),\" \",VLOOKUP(K201,Proposito_programa!$C$2:$E$59,3,FALSE))","v":"Propósito 1: Hacer un nuevo contrato social para incrementar la inclusión social, productiva y política"},2100,1,1010242178,"NICOLE DAYANNA RIVERA VEGA","Persona Natural",null,null,null,null,8000000,null,1,1600000,9600000,5546667,"2022-08-09","2022-08-17","2023-01-31",4,1,30,null,null,null,null,"Terminado",0.57777781250000004]
["FDLSF-CPS-186-2022",2022,"FDLSF-CD-110-2022","FDLSF-CPS-186-2022","Contratos de prestación de servicios profesionales y de apoyo a la gestión","Contratación directa","Prestación de servicios profesionales y de apoyo a la gestión, o para la ejecución de trabajos artísticos que sólo puedan encomendarse a determinadas personas naturales","PRESTAR SUS SERVICIOS COMO APOYO EN LAS ACTIVIDADES PREVISTAS PARA LA IMPLEMENTACIÓN DE PROCESOS DE FORMACIÓN DEPORTIVA Y ACONDICIONAMIENTO FÍSICO DEL ADULTO MAYOR EN LA LOCALIDAD DE SANTA FE","Inversión","Un nuevo contrato social y ambiental para la Bogotá del Siglo XXI",20,{"$f":"IF(ISERROR(VLOOKUP(K202,Proposito_programa!$C$2:$E$59,2,FALSE)),\" \",VLOOKUP(K202,Proposito_programa!$C$2:$E$59,2,FALSE))","v":"Bogotá, referente en cultura, deporte, recreación y actividad física, con parques para el desarrollo y la salud"},{"$f":"IF(ISERROR(VLOOKUP(K202,Proposito_programa!$C$2:$E$59,3,FALSE)),\" \",VLOOKUP(K202,Proposito_programa!$C$2:$E$59,3,FALSE))","v":"Propósito 1: Hacer un nuevo contrato social para incrementar la inclusión social, productiva y política"},2100,1,1010236964,"JUAN SEBASTIAN ALARCON VANEGAS","Persona Natural",null,null,null,null,8000000,null,1,1600000,9600000,5546667,"2022-08-10","2022-08-17","2023-01-31",4,1,30,null,null,null,null,"Terminado",0.57777781250000004]
["FDLSF-CPS-187-2022",2022,"FDLSF-CD-110-2022","FDLSF-CPS-187-2022","Contratos de prestación de servicios profesionales y de apoyo a la gestión","Contratación directa","Prestación de servicios profesionales y de apoyo a la gestión, o para la ejecución de trabajos artísticos que sólo puedan encomendarse a determinadas personas naturales","PRESTAR SUS SERVICIOS COMO APOYO EN LAS ACTIVIDADES PREVISTAS PARA LA IMPLEMENTACIÓN DE PROCESOS DE FORMACIÓN DEPORTIVA Y ACONDICIONAMIENTO FÍSICO DEL ADULTO MAYOR EN LA LOCALIDAD DE SANTA FE","Inversión","Un nuevo contrato social y ambiental para la Bogotá del Siglo XXI",20,{"$f":"IF(ISERROR(VLOOKUP(K203,Proposito_programa!$C$2:$E$59,2,FALSE)),\" \",VLOOKUP(K203,Proposito_programa!$C$2:$E$59,2,FALSE))","v":"Bogotá, referente en cultura, deporte, recreación y actividad física, con parques para el desarrollo y la salud"},{"$f":"IF(ISERROR(VLOOKUP(K203,Proposito_programa!$C$2:$E$59,3,FALSE)),\" \",VLOOKUP(K203,Proposito_programa!$C$2:$E$59,3,FALSE))","v":"Propósito 1: Hacer un nuevo contrato social para incrementar la inclusión social, productiva y política"},2100,1,1010238165,"HELBERTH  SEBASTIAN DIAZ BEJARANO","Persona Natural",null,null,null,null,8000000,null,1,1600000,9600000,5546667,"2022-08-09","2022-08-17","2023-01-31",4,1,30,null,null,null,null,"Terminado",0.57777781250000004]
["FDLSF-CPS-188-2022",2022,"FDLSF-CD-108-2022","FDLSF-CPS-188-2022","Contratos de prestación de servicios profesionales y de apoyo a la gestión","Contratación directa","Prestación de servicios profesionales y de apoyo a la gestión, o para la ejecución de trabajos artísticos que sólo puedan encomendarse a determinadas personas naturales","PRESTAR SERVICIOS COMO INSTRUCTOR EN PROCESOS DE FORMACIÓN DEPORTIVA Y ACONDICIONAMIENTO FÍSICO DEL ADULTO MAYOR EN LA LOCALIDAD DE SANTA FE","Inversión","Un nuevo contrato social y ambiental para la Bogotá del Siglo XXI",20,{"$f":"IF(ISERROR(VLOOKUP(K204,Proposito_programa!$C$2:$E$59,2,FALSE)),\" \",VLOOKUP(K204,Proposito_programa!$C$2:$E$59,2,FALSE))","v":"Bogotá, referente en cultura, deporte, recreación y actividad física, con parques para el desarrollo y la salud"},{"$f":"IF(ISERROR(VLOOKUP(K204,Proposito_programa!$C$2:$E$59,3,FALSE)),\" \",VLOOKUP(K204,Proposito_programa!$C$2:$E$59,3,FALSE))","v":"Propósito 1: Hacer un nuevo contrato social para incrementar la inclusión social, productiva y política"},2100,1,94070749,"JORGE ELIVER RIOS ASPRILLA","Persona Natural",null,null,null,null,"$14.800.000,00",null,null,0,14800000,10261333,"2022-08-09","2022-08-17","2022-12-31",4,0,0,null,null,null,null,"Terminado",0.69333331081081084]
["FDLSF-CPS-189-2022",2022,"FDLSF-CD-108-2022","FDLSF-CPS-189-2022","Contratos de prestación de servicios profesionales y de apoyo a la gestión","Contratación directa","Prestación de servicios profesionales y de apoyo a la gestión, o para la ejecución de trabajos artísticos que sólo puedan encomendarse a determinadas personas naturales","PRESTAR SERVICIOS COMO INSTRUCTOR EN PROCESOS DE FORMACIÓN DEPORTIVA Y ACONDICIONAMIENTO FÍSICO DEL ADULTO MAYOR EN LA LOCALIDAD DE SANTA FE","Inversión","Un nuevo contrato social y ambiental para la Bogotá del Siglo XXI",20,{"$f":"IF(ISERROR(VLOOKUP(K205,Proposito_programa!$C$2:$E$59,2,FALSE)),\" \",VLOOKUP(K205,Proposito_programa!$C$2:$E$59,2,FALSE))","v":"Bogotá, referente en cultura, deporte, recreación y actividad física, con parques para el desarrollo y la salud"},{"$f":"IF(ISERROR(VLOOKUP(K205,Proposito_programa!$C$2:$E$59,3,FALSE)),\" \",VLOOKUP(K205,Proposito_programa!$C$2:$E$59,3,FALSE))","v":"Propósito 1: Hacer un nuevo contrato social para incrementar la inclusión social, productiva y política"},2100,1,1030675885,"YOHAN DAVID QUIÑONES MOSQUERA","Persona Natural",null,null,null,null,"$14.800.000,00",null,null,0,14800000,10261333,"2022-08-09","2022-08-17","2022-12-31",4,0,0,null,null,null,null,"Terminado",0.69333331081081084]
["FDLSF-CPS-190-2022",2022,"FDLSF-CD-108-2022","FDLSF-CPS-190-2022","Contratos de prestación de servicios profesionales y de apoyo a la gestión","Contratación directa","Prestación de servicios profesionales y de apoyo a la gestión, o para la ejecución de trabajos artísticos que sólo puedan encomendarse a determinadas personas naturales","PRESTAR SERVICIOS COMO INSTRUCTOR EN PROCESOS DE FORMACIÓN DEPORTIVA Y ACONDICIONAMIENTO FÍSICO DEL ADULTO MAYOR EN LA LOCALIDAD DE SANTA FE","Inversión","Un nuevo contrato social y ambiental para la Bogotá del Siglo XXI",20,{"$f":"IF(ISERROR(VLOOKUP(K206,Proposito_programa!$C$2:$E$59,2,FALSE)),\" \",VLOOKUP(K206,Proposito_programa!$C$2:$E$59,2,FALSE))","v":"Bogotá, referente en cultura, deporte, recreación y actividad física, con parques para el desarrollo y la salud"},{"$f":"IF(ISERROR(VLOOKUP(K206,Proposito_programa!$C$2:$E$59,3,FALSE)),\" \",VLOOKUP(K206,Proposito_programa!$C$2:$E$59,3,FALSE))","v":"Propósito 1: Hacer un nuevo contrato social para incrementar la inclusión social, productiva y política"},2100,1,1149444759,"JORDY FREICER MOSQUERA VALENCIA","Persona Natural",null,null,null,null,"$14.800.000,00",null,null,0,14800000,10261333,"2022-08-10","2022-08-17","2022-12-31",4,0,0,null,null,null,null,"Terminado",0.69333331081081084]
["FDLSF-CPS-191-2022",2022,"FDLSF-CD-110-2022","FDLSF-CPS-191-2022","Contratos de prestación de servicios profesionales y de apoyo a la gestión","Contratación directa","Prestación de servicios profesionales y de apoyo a la gestión, o para la ejecución de trabajos artísticos que sólo puedan encomendarse a determinadas personas naturales","PRESTAR SUS SERVICIOS COMO APOYO EN LAS ACTIVIDADES PREVISTAS PARA LA IMPLEMENTACIÓN DE PROCESOS DE FORMACIÓN DEPORTIVA Y ACONDICIONAMIENTO FÍSICO DEL ADULTO MAYOR EN LA LOCALIDAD DE SANTA FE","Inversión","Un nuevo contrato social y ambiental para la Bogotá del Siglo XXI",20,{"$f":"IF(ISERROR(VLOOKUP(K207,Proposito_programa!$C$2:$E$59,2,FALSE)),\" \",VLOOKUP(K207,Proposito_programa!$C$2:$E$59,2,FALSE))","v":"Bogotá, referente en cultura, deporte, recreación y actividad física, con parques para el desarrollo y la salud"},{"$f":"IF(ISERROR(VLOOKUP(K207,Proposito_programa!$C$2:$E$59,3,FALSE)),\" \",VLOOKUP(K207,Proposito_programa!$C$2:$E$59,3,FALSE))","v":"Propósito 1: Hacer un nuevo contrato social para incrementar la inclusión social, productiva y política"},2100,1,1026305458,"DANIEL ALBERTO VEGA LOPEZ","Persona Natural",null,null,null,null,8000000,null,null,0,8000000,5440000,"2022-08-10","2022-08-19","2022-12-31",4,0,0,null,null,null,null,"Terminado",0.68]
["FDLSF-CPS-192-2022",2022,"FDLSF-CD-110-2022","FDLSF-CPS-192-2022","Contratos de prestación de servicios profesionales y de apoyo a la gestión","Contratación directa","Prestación de servicios profesionales y de apoyo a la gestión, o para la ejecución de trabajos artísticos que sólo puedan encomendarse a determinadas personas naturales","PRESTAR SUS SERVICIOS COMO APOYO EN LAS ACTIVIDADES PREVISTAS PARA LA IMPLEMENTACIÓN DE PROCESOS DE FORMACIÓN DEPORTIVA Y ACONDICIONAMIENTO FÍSICO DEL ADULTO MAYOR EN LA LOCALIDAD DE SANTA FE","Inversión","Un nuevo contrato social y ambiental para la Bogotá del Siglo XXI",20,{"$f":"IF(ISERROR(VLOOKUP(K208,Proposito_programa!$C$2:$E$59,2,FALSE)),\" \",VLOOKUP(K208,Proposito_programa!$C$2:$E$59,2,FALSE))","v":"Bogotá, referente en cultura, deporte, recreación y actividad física, con parques para el desarrollo y la salud"},{"$f":"IF(ISERROR(VLOOKUP(K208,Proposito_programa!$C$2:$E$59,3,FALSE)),\" \",VLOOKUP(K208,Proposito_programa!$C$2:$E$59,3,FALSE))","v":"Propósito 1: Hacer un nuevo contrato social para incrementar la inclusión social, productiva y política"},2100,1,1019039231,"JHON JAIRO GALINDO RONDON","Persona Natural",null,null,null,null,8000000,null,null,0,8000000,3893333,"2022-08-10","2022-08-18","2022-12-31",4,0,0,null,null,null,null,"Terminado",0.48666662500000002]
["FDLSF-CPS-193-2022",2022,"FDLSF-CD-110-2022","FDLSF-CPS-193-2022","Contratos de prestación de servicios profesionales y de apoyo a la gestión","Contratación directa","Prestación de servicios profesionales y de apoyo a la gestión, o para la ejecución de trabajos artísticos que sólo puedan encomendarse a determinadas personas naturales","PRESTAR SUS SERVICIOS COMO APOYO EN LAS ACTIVIDADES PREVISTAS PARA LA IMPLEMENTACIÓN DE PROCESOS DE FORMACIÓN DEPORTIVA Y ACONDICIONAMIENTO FÍSICO DEL ADULTO MAYOR EN LA LOCALIDAD DE SANTA FE","Inversión","Un nuevo contrato social y ambiental para la Bogotá del Siglo XXI",20,{"$f":"IF(ISERROR(VLOOKUP(K209,Proposito_programa!$C$2:$E$59,2,FALSE)),\" \",VLOOKUP(K209,Proposito_programa!$C$2:$E$59,2,FALSE))","v":"Bogotá, referente en cultura, deporte, recreación y actividad física, con parques para el desarrollo y la salud"},{"$f":"IF(ISERROR(VLOOKUP(K209,Proposito_programa!$C$2:$E$59,3,FALSE)),\" \",VLOOKUP(K209,Proposito_programa!$C$2:$E$59,3,FALSE))","v":"Propósito 1: Hacer un nuevo contrato social para incrementar la inclusión social, productiva y política"},2100,1,1032452170,"SERGIO ANDRES PINZON TORRES","Persona Natural",null,null,null,null,8000000,null,null,0,8000000,5493333,"2022-08-10","2022-08-18","2022-12-31",4,0,0,null,null,null,null,"Terminado",0.68666662499999997]
["FDLSF-CPS-194-2022",2022,"FDLSF-CD-109-2022","FDLSF-CPS-194-2022","Contratos de prestación de servicios profesionales y de apoyo a la gestión","Contratación directa","Prestación de servicios profesionales y de apoyo a la gestión, o para la ejecución de trabajos artísticos que sólo puedan encomendarse a determinadas personas naturales","PRESTAR SERVICIOS COMO INSTRUCTOR EN PROCESOS DE FORMACIÓN DEPORTIVA Y ACONDICIONAMIENTO FÍSICO DEL ADULTO MAYOR EN LA LOCALIDAD DE SANTA FE","Inversión","Un nuevo contrato social y ambiental para la Bogotá del Siglo XXI",20,{"$f":"IF(ISERROR(VLOOKUP(K210,Proposito_programa!$C$2:$E$59,2,FALSE)),\" \",VLOOKUP(K210,Proposito_programa!$C$2:$E$59,2,FALSE))","v":"Bogotá, referente en cultura, deporte, recreación y actividad física, con parques para el desarrollo y la salud"},{"$f":"IF(ISERROR(VLOOKUP(K210,Proposito_programa!$C$2:$E$59,3,FALSE)),\" \",VLOOKUP(K210,Proposito_programa!$C$2:$E$59,3,FALSE))","v":"Propósito 1: Hacer un nuevo contrato social para incrementar la inclusión social, productiva y política"},2100,1,1019064630,"RUBEN ULISES SERRANO BURGOS","Persona Natural",null,null,null,null,14800000,null,null,0,{"$f":"+W210+X210+Z210","v":14800000},10162667,"2022-08-11","2022-08-18","2022-12-31",4,0,0,null,null,null,null,"Terminado",0.68666668918918916]
["FDLSF-CPS-195-2022",2022,"FDLSF-CD-108-2022","FDLSF-CPS-195-2022","Contratos de prestación de servicios profesionales y de apoyo a la gestión","Contratación directa","Prestación de servicios profesionales y de apoyo a la gestión, o para la ejecución de trabajos artísticos que sólo puedan encomendarse a determinadas personas naturales","PRESTAR SERVICIOS COMO INSTRUCTOR EN PROCESOS DE FORMACIÓN DEPORTIVA Y ACONDICIONAMIENTO FÍSICO DEL ADULTO MAYOR EN LA LOCALIDAD DE SANTA FE","Inversión","Un nuevo contrato social y ambiental para la Bogotá del Siglo XXI",20,{"$f":"IF(ISERROR(VLOOKUP(K211,Proposito_programa!$C$2:$E$59,2,FALSE)),\" \",VLOOKUP(K211,Proposito_programa!$C$2:$E$59,2,FALSE))","v":"Bogotá, referente en cultura, deporte, recreación y actividad física, con parques para el desarrollo y la salud"},{"$f":"IF(ISERROR(VLOOKUP(K211,Proposito_programa!$C$2:$E$59,3,FALSE)),\" \",VLOOKUP(K211,Proposito_programa!$C$2:$E$59,3,FALSE))","v":"Propósito 1: Hacer un nuevo contrato social para incrementar la inclusión social, productiva y política"},2100,1,1033760005,"DUBAN SLATER FINO REINOSO","Persona Natural",null,null,null,null,"$14.800.000,00",null,null,0,{"$f":"+W211+X211+Z211","v":14800000},8485333,"2022-08-11","2022-08-17","2022-12-31",4,0,0,null,null,null,null,"Terminado",0.57333331081081085]
["FDLSF-CPS-196-2022",2022,"FDLSF-CD-114-2022","FDLSF-CPS-196-2022","Contratos de prestación de servicios profesionales y de apoyo a la gestión","Contratación directa","Prestación de servicios profesionales y de apoyo a la gestión, o para la ejecución de trabajos artísticos que sólo puedan encomendarse a determinadas personas naturales","PRESTAR  LOS  SERVICIOS  COMO  OPERARIO(A)  PARA  LA  GESTIÓN  EN ACTIVIDADES OPERATIVAS DE AGRICULTURA URBANA, PLANTACIÓN, RECUPERACIÓN Y MANTENIMIENTO  DE  LAS  COBERTURAS  VEGETALES  Y  RECUPERACIÓN  DE  ESPACIO  PÚBLICO  EN  LA  LOCALIDAD  DE  SANTA  FE  EN  EL  MARCO  DE  LAS  INICIATIVAS CIUDADANAS  DE  PRESUPUESTOS PARTICIPATIVOS.","Inversión","Un nuevo contrato social y ambiental para la Bogotá del Siglo XXI",24,{"$f":"IF(ISERROR(VLOOKUP(K212,Proposito_programa!$C$2:$E$59,2,FALSE)),\" \",VLOOKUP(K212,Proposito_programa!$C$2:$E$59,2,FALSE))","v":"Bogotá región emprendedora e innovadora"},{"$f":"IF(ISERROR(VLOOKUP(K212,Proposito_programa!$C$2:$E$59,3,FALSE)),\" \",VLOOKUP(K212,Proposito_programa!$C$2:$E$59,3,FALSE))","v":"Propósito 1: Hacer un nuevo contrato social para incrementar la inclusión social, productiva y política"},2123,1,79957713,"GUILLERMO FERREIRA GIRALDO","Persona Natural",null,null,null,null,11500000,null,1,1686652,13186652,2146666,"2022-08-10","2022-09-02","2023-04-02",3,3,92,79957713,"GUILLERMO FERREIRA GIRALDO","2022-09-19",null,"Terminado",0.1627908281798898]
["FDLSF-CPS-197-2022",2022,"FDLSF-CD-114-2022","FDLSF-CPS-197-2022","Contratos de prestación de servicios profesionales y de apoyo a la gestión","Contratación directa","Prestación de servicios profesionales y de apoyo a la gestión, o para la ejecución de trabajos artísticos que sólo puedan encomendarse a determinadas personas naturales","PRESTAR  LOS  SERVICIOS  COMO  OPERARIO(A)  PARA  LA  GESTIÓN  EN ACTIVIDADES OPERATIVAS DE AGRICULTURA URBANA, PLANTACIÓN, RECUPERACIÓN Y MANTENIMIENTO  DE  LAS  COBERTURAS  VEGETALES  Y  RECUPERACIÓN  DE  ESPACIO  PÚBLICO  EN  LA  LOCALIDAD  DE  SANTA  FE  EN  EL  MARCO  DE  LAS  INICIATIVAS CIUDADANAS  DE  PRESUPUESTOS PARTICIPATIVOS.","Inversión","Un nuevo contrato social y ambiental para la Bogotá del Siglo XXI",24,{"$f":"IF(ISERROR(VLOOKUP(K213,Proposito_programa!$C$2:$E$59,2,FALSE)),\" \",VLOOKUP(K213,Proposito_programa!$C$2:$E$59,2,FALSE))","v":"Bogotá región emprendedora e innovadora"},{"$f":"IF(ISERROR(VLOOKUP(K213,Proposito_programa!$C$2:$E$59,3,FALSE)),\" \",VLOOKUP(K213,Proposito_programa!$C$2:$E$59,3,FALSE))","v":"Propósito 1: Hacer un nuevo contrato social para incrementar la inclusión social, productiva y política"},2123,1,1019100145,"YEISON STEVEN CASTAÑEDA SÁNCHEZ","Persona Natural",null,null,null,null,11500000,null,1,1609986,13109986,6823333,"2022-08-31","2022-09-02","2023-01-31",3,1,30,null,null,null,null,"Terminado",0.52046836663288576]
["FDLSF-CPS-198-2022",2022,"FDLSF-CD-108-2022","FDLSF-CPS-198-2022","Contratos de prestación de servicios profesionales y de apoyo a la gestión","Contratación directa","Prestación de servicios profesionales y de apoyo a la gestión, o para la ejecución de trabajos artísticos que sólo puedan encomendarse a determinadas personas naturales","PRESTAR SERVICIOS COMO INSTRUCTOR EN PROCESOS DE FORMACIÓN DEPORTIVA Y ACONDICIONAMIENTO FÍSICO DEL ADULTO MAYOR EN LA LOCALIDAD DE SANTA FE","Inversión","Un nuevo contrato social y ambiental para la Bogotá del Siglo XXI",20,{"$f":"IF(ISERROR(VLOOKUP(K214,Proposito_programa!$C$2:$E$59,2,FALSE)),\" \",VLOOKUP(K214,Proposito_programa!$C$2:$E$59,2,FALSE))","v":"Bogotá, referente en cultura, deporte, recreación y actividad física, con parques para el desarrollo y la salud"},{"$f":"IF(ISERROR(VLOOKUP(K214,Proposito_programa!$C$2:$E$59,3,FALSE)),\" \",VLOOKUP(K214,Proposito_programa!$C$2:$E$59,3,FALSE))","v":"Propósito 1: Hacer un nuevo contrato social para incrementar la inclusión social, productiva y política"},2100,1,1130804367,"WANDER MOSQUERA MENA ","Persona Natural",null,null,null,null,"$14.800.000,00",null,1,3920662,{"$f":"+W214+X214+Z214","v":18720662},10261333,"2022-08-12","2022-08-18","2023-02-06",4,1,37,null,null,null,null,"Terminado",0.5481287467291488]
["FDLSF-CPS-199-2022",2022,"FDLSF-CD-108-2022","FDLSF-CPS-199-2022","Contratos de prestación de servicios profesionales y de apoyo a la gestión","Contratación directa","Prestación de servicios profesionales y de apoyo a la gestión, o para la ejecución de trabajos artísticos que sólo puedan encomendarse a determinadas personas naturales","PRESTAR SERVICIOS COMO INSTRUCTOR EN PROCESOS DE FORMACIÓN DEPORTIVA Y ACONDICIONAMIENTO FÍSICO DEL ADULTO MAYOR EN LA LOCALIDAD DE SANTA FE","Inversión","Un nuevo contrato social y ambiental para la Bogotá del Siglo XXI",20,{"$f":"IF(ISERROR(VLOOKUP(K215,Proposito_programa!$C$2:$E$59,2,FALSE)),\" \",VLOOKUP(K215,Proposito_programa!$C$2:$E$59,2,FALSE))","v":"Bogotá, referente en cultura, deporte, recreación y actividad física, con parques para el desarrollo y la salud"},{"$f":"IF(ISERROR(VLOOKUP(K215,Proposito_programa!$C$2:$E$59,3,FALSE)),\" \",VLOOKUP(K215,Proposito_programa!$C$2:$E$59,3,FALSE))","v":"Propósito 1: Hacer un nuevo contrato social para incrementar la inclusión social, productiva y política"},2100,1,1019152900,"LARRY CERCHAR CHINCHILLA","Persona Natural",null,null,null,null,"$14.800.000,00",null,1,3551996,{"$f":"+W215+X215+Z215","v":18351996},10261333,"2022-08-10","2022-08-18","2023-02-06",4,1,37,null,null,null,null,"Terminado",0.55913988865298359]
["FDLSF-CPS-200-2022",2022,"FDLSF-CD-111-2022","FDLSF-CPS-200-2022","Contratos de prestación de servicios profesionales y de apoyo a la gestión","Contratación directa","Prestación de servicios profesionales y de apoyo a la gestión, o para la ejecución de trabajos artísticos que sólo puedan encomendarse a determinadas personas naturales","PRESTAR SERVICIOS PROFESIONALES COMO COORDINADOR(A) DE ADULTO MAYOR PARA LA VIGENCIA 2022 EN EL MARCO DE LAS INICIATIVAS CIUDADANAS PROPUESTAS Y RELACIONADAS CON FORMACIÓN DEPORTIVA EN EL PROYECTO 2100 SANTA FE, REFERENTE EN CULTURA, DEPORTE, RECREACIÓN Y ACTIVIDAD FÍSICA, CON PARQUES PARA EL DESARROLLO Y LA SALUD","Inversión","Un nuevo contrato social y ambiental para la Bogotá del Siglo XXI",20,{"$f":"IF(ISERROR(VLOOKUP(K216,Proposito_programa!$C$2:$E$59,2,FALSE)),\" \",VLOOKUP(K216,Proposito_programa!$C$2:$E$59,2,FALSE))","v":"Bogotá, referente en cultura, deporte, recreación y actividad física, con parques para el desarrollo y la salud"},{"$f":"IF(ISERROR(VLOOKUP(K216,Proposito_programa!$C$2:$E$59,3,FALSE)),\" \",VLOOKUP(K216,Proposito_programa!$C$2:$E$59,3,FALSE))","v":"Propósito 1: Hacer un nuevo contrato social para incrementar la inclusión social, productiva y política"},2100,1,1030574330,"DIANA MARCELA AVILA RINCON","Persona Natural",null,null,null,null,24000000,null,null,0,{"$f":"+W216+X216+Z216","v":24000000},16320000,"2022-08-12","2022-08-19","2022-12-31",4,0,0,null,null,null,null,"Terminado",0.68]
["FDLSF-CPS-201-2022",2022,"FDLSF-CD-112-2022","FDLSF-CPS-201-2022","Contratos de prestación de servicios profesionales y de apoyo a la gestión","Contratación directa","Prestación de servicios profesionales y de apoyo a la gestión, o para la ejecución de trabajos artísticos que sólo puedan encomendarse a determinadas personas naturales","PRESTAR SERVICIOS PROFESIONALES COMO COORDINADOR(A) DE LAS ESCUELAS DEPORTIVAS PARA LA VIGENCIA 2022 EN MARCO DE LAS INICIATIVAS CIUDADANAS PROPUESTAS Y RELACIONADAS CON FORMACIÓN DEPORTIVA EN EL PROYECTO 2100 SANTA FE , REFERENTE EN CULTURA, DEPORTE, RECREACIÓN Y ACTIVIDAD FÍSICA, CON PARQUES PARA EL DESARROLLO Y LA SALUD","Inversión","Un nuevo contrato social y ambiental para la Bogotá del Siglo XXI",20,{"$f":"IF(ISERROR(VLOOKUP(K217,Proposito_programa!$C$2:$E$59,2,FALSE)),\" \",VLOOKUP(K217,Proposito_programa!$C$2:$E$59,2,FALSE))","v":"Bogotá, referente en cultura, deporte, recreación y actividad física, con parques para el desarrollo y la salud"},{"$f":"IF(ISERROR(VLOOKUP(K217,Proposito_programa!$C$2:$E$59,3,FALSE)),\" \",VLOOKUP(K217,Proposito_programa!$C$2:$E$59,3,FALSE))","v":"Propósito 1: Hacer un nuevo contrato social para incrementar la inclusión social, productiva y política"},2100,1,1013634964,"JUAN DAVID PINTO RODRIGUEZ","Persona Natural",null,null,null,null,24000000,null,null,0,24000000,16320000,"2022-08-12","2022-08-19","2022-12-31",4,0,0,null,null,null,null,"Terminado",0.68]
["FDLSF-CIA-202-2022",2022,"FDLSF-CD-123-2022","FDLSF-CIA-202-2022","Convenios/Contratos interadministrativos","Contratación directa","Contratos interadministrativos","AUNAR ESFUERZOS TÉCNICOS, ADMINISTRATIVOS, FINANCIEROS Y LOGÍSTICOS PARA FORTALECER A TRAVÉS DE PROCESOS ASISTENCIA TÉCNICA PARA ELABORACIÓN DE PLANES DE INVERSIÓN Y CAPITALIZACIÓN A MIPYMES EN LA LOCALIDAD DE SANTA FE, CON EL FIN DE PROMOVER LA SOSTENIBILIDAD DE LOS NEGOCIOS PERTENECIENTES A LA POBLACIÓN CON MAYORES BRECHAS SOCIALES Y ECONÓMICAS EN EL MARCO DE LA POST PANDEMIA A TRAVES DE LA RUTA AL ÉXITO – PROGRAMA MICROEMPRESA LOCAL 3.0","Inversión","Un nuevo contrato social y ambiental para la Bogotá del Siglo XXI",6,{"$f":"IF(ISERROR(VLOOKUP(K218,Proposito_programa!$C$2:$E$59,2,FALSE)),\" \",VLOOKUP(K218,Proposito_programa!$C$2:$E$59,2,FALSE))","v":"Sistema Distrital de Cuidado"},{"$f":"IF(ISERROR(VLOOKUP(K218,Proposito_programa!$C$2:$E$59,3,FALSE)),\" \",VLOOKUP(K218,Proposito_programa!$C$2:$E$59,3,FALSE))","v":"Propósito 1: Hacer un nuevo contrato social para incrementar la inclusión social, productiva y política"},2188,1,"800250713-2","CORPORACION PARA EL DESARROLLO DE LAS MICROEMPRESAS PROPAIS","Persona Jurídica",null,null,null,null,663594480,null,null,0,663594480,597301391,"2022-08-19","2022-08-22","2023-03-31",7,0,0,null,null,null,null,"Terminado",0.90009999932488893]
["FDLSF-CPS-203-2022",2022,"FDLSF-CD-108-2022","FDLSF-CPS-203-2022","Contratos de prestación de servicios profesionales y de apoyo a la gestión","Contratación directa","Prestación de servicios profesionales y de apoyo a la gestión, o para la ejecución de trabajos artísticos que sólo puedan encomendarse a determinadas personas naturales","PRESTAR SERVICIOS COMO INSTRUCTOR EN PROCESOS DE FORMACIÓN DEPORTIVA Y ACONDICIONAMIENTO FÍSICO DEL ADULTO MAYOR EN LA LOCALIDAD DE SANTA FE","Inversión","Un nuevo contrato social y ambiental para la Bogotá del Siglo XXI",20,{"$f":"IF(ISERROR(VLOOKUP(K219,Proposito_programa!$C$2:$E$59,2,FALSE)),\" \",VLOOKUP(K219,Proposito_programa!$C$2:$E$59,2,FALSE))","v":"Bogotá, referente en cultura, deporte, recreación y actividad física, con parques para el desarrollo y la salud"},{"$f":"IF(ISERROR(VLOOKUP(K219,Proposito_programa!$C$2:$E$59,3,FALSE)),\" \",VLOOKUP(K219,Proposito_programa!$C$2:$E$59,3,FALSE))","v":"Propósito 1: Hacer un nuevo contrato social para incrementar la inclusión social, productiva y política"},2100,1,1073696542,"OMAR DAVID MUNAR GUEVARA","Persona Natural",null,null,null,null,"$14.800.000,00",null,1,3551996,{"$f":"+W219+X219+Z219","v":18351996},10064000,"2022-08-17","2022-08-19","2023-02-06",4,1,37,null,null,null,null,"Terminado",0.54838721630061382]
["FDLSF-CPS-204-2022",2022,"FDLSF-CD-120-2022","FDLSF-CPS-204-2022","Contratos de prestación de servicios profesionales y de apoyo a la gestión","Contratación directa","Prestación de servicios profesionales y de apoyo a la gestión, o para la ejecución de trabajos artísticos que sólo puedan encomendarse a determinadas personas naturales","PRESTAR APOYO AL ÁREA GESTIÓN POLICÍVA Y ÁREA DE GESTIÓN DE DESARROLLO LOCAL EN LA CONDUCCIÓN DEL PARQUE AUTOMOTOR DEL FDLSF QUE LE SEA ASIGNADO","Inversión","Un nuevo contrato social y ambiental para la Bogotá del Siglo XXI",57,{"$f":"IF(ISERROR(VLOOKUP(K220,Proposito_programa!$C$2:$E$59,2,FALSE)),\" \",VLOOKUP(K220,Proposito_programa!$C$2:$E$59,2,FALSE))","v":"Gestión pública local"},{"$f":"IF(ISERROR(VLOOKUP(K220,Proposito_programa!$C$2:$E$59,3,FALSE)),\" \",VLOOKUP(K220,Proposito_programa!$C$2:$E$59,3,FALSE))","v":"Propósito 5: Construir Bogotá - Región con gobierno abierto, transparente y ciudadanía consciente"},2105,1,79750912,"JHON ALEXANDER SANABRIA","Persona Natural",null,null,null,null,10800000,null,1,2700000,13500000,9000000,"2022-08-17","2022-08-21","2023-01-20",4,1,30,null,null,null,null,"Terminado",0.66666666666666663]
["FDLSF-CPS-205-2022",2022,"FDLSF-CD-108-2022","FDLSF-CPS-205-2022","Contratos de prestación de servicios profesionales y de apoyo a la gestión","Contratación directa","Prestación de servicios profesionales y de apoyo a la gestión, o para la ejecución de trabajos artísticos que sólo puedan encomendarse a determinadas personas naturales","PRESTAR SERVICIOS COMO INSTRUCTOR EN PROCESOS DE FORMACIÓN DEPORTIVA Y ACONDICIONAMIENTO FÍSICO DEL ADULTO MAYOR EN LA LOCALIDAD DE SANTA FE","Inversión","Un nuevo contrato social y ambiental para la Bogotá del Siglo XXI",20,{"$f":"IF(ISERROR(VLOOKUP(K221,Proposito_programa!$C$2:$E$59,2,FALSE)),\" \",VLOOKUP(K221,Proposito_programa!$C$2:$E$59,2,FALSE))","v":"Bogotá, referente en cultura, deporte, recreación y actividad física, con parques para el desarrollo y la salud"},{"$f":"IF(ISERROR(VLOOKUP(K221,Proposito_programa!$C$2:$E$59,3,FALSE)),\" \",VLOOKUP(K221,Proposito_programa!$C$2:$E$59,3,FALSE))","v":"Propósito 1: Hacer un nuevo contrato social para incrementar la inclusión social, productiva y política"},2100,1,1016104623,"DIEGO FERNANDO URREGO HERNANDEZ","Persona Natural",null,null,null,null,"$14.800.000,00",null,1,3650000,{"$f":"+W221+X221+Z221","v":18450000},10064000,"2022-08-17","2022-08-19","2023-02-06",4,1,37,null,null,null,null,"Terminado",0.5454742547425474]
["FDLSF-CPS-206-2022",2022,"FDLSF-CD-122-2022","FDLSF-CPS-206-2022","Contratos de prestación de servicios profesionales y de apoyo a la gestión","Contratación directa","Prestación de servicios profesionales y de apoyo a la gestión, o para la ejecución de trabajos artísticos que sólo puedan encomendarse a determinadas personas naturales","APOYAR AL ALCALDE LOCAL EN LA FORMULACIÓN, SEGUIMIENTO E IMPLEMENTACIÓN DE LA ESTRATEGIA LOCAL PARA LA TERMINACIÓN JURÍDICA O INACTIVACIÓN DE LAS ACTUACIONES ADMINISTRATIVAS QUE CURSAN EN LA ALCALDÍA LOCAL","Inversión","Un nuevo contrato social y ambiental para la Bogotá del Siglo XXI",57,{"$f":"IF(ISERROR(VLOOKUP(K222,Proposito_programa!$C$2:$E$59,2,FALSE)),\" \",VLOOKUP(K222,Proposito_programa!$C$2:$E$59,2,FALSE))","v":"Gestión pública local"},{"$f":"IF(ISERROR(VLOOKUP(K222,Proposito_programa!$C$2:$E$59,3,FALSE)),\" \",VLOOKUP(K222,Proposito_programa!$C$2:$E$59,3,FALSE))","v":"Propósito 5: Construir Bogotá - Región con gobierno abierto, transparente y ciudadanía consciente"},2105,1,80109395,"OSCAR MAURICIO ALARCON VELEZ","Persona Natural",null,null,null,null,30240000,null,1,7560000,37800000,21168000,"2022-08-19","2022-08-19","2023-01-18",4,1,30,80109395,"OSCAR MAURICIO ALARCON VELEZ","2022-09-16",null,"Terminado",0.56000000000000005]
["FDLSF-CPS-207-2022",2022,"FDLSF-CD-108-2022","FDLSF-CPS-207-2022","Contratos de prestación de servicios profesionales y de apoyo a la gestión","Contratación directa","Prestación de servicios profesionales y de apoyo a la gestión, o para la ejecución de trabajos artísticos que sólo puedan encomendarse a determinadas personas naturales","PRESTAR SERVICIOS COMO INSTRUCTOR EN PROCESOS DE FORMACIÓN DEPORTIVA Y ACONDICIONAMIENTO FÍSICO DEL ADULTO MAYOR EN LA LOCALIDAD DE SANTA FE","Inversión","Un nuevo contrato social y ambiental para la Bogotá del Siglo XXI",20,{"$f":"IF(ISERROR(VLOOKUP(K223,Proposito_programa!$C$2:$E$59,2,FALSE)),\" \",VLOOKUP(K223,Proposito_programa!$C$2:$E$59,2,FALSE))","v":"Bogotá, referente en cultura, deporte, recreación y actividad física, con parques para el desarrollo y la salud"},{"$f":"IF(ISERROR(VLOOKUP(K223,Proposito_programa!$C$2:$E$59,3,FALSE)),\" \",VLOOKUP(K223,Proposito_programa!$C$2:$E$59,3,FALSE))","v":"Propósito 1: Hacer un nuevo contrato social para incrementar la inclusión social, productiva y política"},2100,1,17339507,"JHON ISLEN LOPEZ GONZALEZ","Persona Natural",null,null,null,null,"$14.800.000,00",null,null,0,{"$f":"+W223+X223+Z223","v":14800000},9768000,"2022-08-19","2022-08-22","2022-12-31",4,0,0,null,null,null,null,"Terminado",0.66]
["FDLSF-CPS-208-2022",2022,"FDLSF-CD-124-2022","FDLSF-CPS-208-2022","Contratos de prestación de servicios profesionales y de apoyo a la gestión","Contratación directa","Prestación de servicios profesionales y de apoyo a la gestión, o para la ejecución de trabajos artísticos que sólo puedan encomendarse a determinadas personas naturales","PRESTAR SERVICIOS PROFESIONALES EN EL ÁREA DE GESTIÓN DEL DESARROLLO LOCAL EN LOS TEMAS RELACIONADOS CON PRESUPUESTO DE LA ALCALDÍA LOCAL DE SANTA FE.","Inversión","Un nuevo contrato social y ambiental para la Bogotá del Siglo XXI",57,{"$f":"IF(ISERROR(VLOOKUP(K224,Proposito_programa!$C$2:$E$59,2,FALSE)),\" \",VLOOKUP(K224,Proposito_programa!$C$2:$E$59,2,FALSE))","v":"Gestión pública local"},{"$f":"IF(ISERROR(VLOOKUP(K224,Proposito_programa!$C$2:$E$59,3,FALSE)),\" \",VLOOKUP(K224,Proposito_programa!$C$2:$E$59,3,FALSE))","v":"Propósito 5: Construir Bogotá - Región con gobierno abierto, transparente y ciudadanía consciente"},2105,1,52808814,"LIZ VIBIANA TORRES BUITRAGO","Persona Natural",null,null,null,null,24400000,null,1,8540000,32940000,20740000,"2022-08-19","2022-08-19","2023-01-31",4,1,42,52808814,"LIZ VIBIANA TORRES BUITRAGO","2022-10-31",null,"Terminado",0.62962962962962965]
["FDLSF-CPS-209-2022",2022,"FDLSF-CD-125-2022","FDLSF-CPS-209-2022","Contratos de prestación de servicios profesionales y de apoyo a la gestión","Contratación directa","Prestación de servicios profesionales y de apoyo a la gestión, o para la ejecución de trabajos artísticos que sólo puedan encomendarse a determinadas personas naturales","PRESTAR LOS SERVICIOS PROFESIONALES PARA EL ÁREA DE GESTIÓN DEL DESARROLLO LOCAL, EN LO RELACIONADO CON LAS ACTIVIDADES DEL ALMACÉN DE LA ALCALDÍA LOCAL DE SANTA FE","Inversión","Un nuevo contrato social y ambiental para la Bogotá del Siglo XXI",57,{"$f":"IF(ISERROR(VLOOKUP(K225,Proposito_programa!$C$2:$E$59,2,FALSE)),\" \",VLOOKUP(K225,Proposito_programa!$C$2:$E$59,2,FALSE))","v":"Gestión pública local"},{"$f":"IF(ISERROR(VLOOKUP(K225,Proposito_programa!$C$2:$E$59,3,FALSE)),\" \",VLOOKUP(K225,Proposito_programa!$C$2:$E$59,3,FALSE))","v":"Propósito 5: Construir Bogotá - Región con gobierno abierto, transparente y ciudadanía consciente"},2105,1,79323784,"CESAR MAURICIO PATIÑO CADENA","Persona Natural",null,null,null,null,14400000,null,1,7200000,21600000,15200000,"2022-08-25","2022-08-26","2023-01-09",3,1,45,null,null,null,null,"Terminado",0.70370370370370372]
["FDLSF-CPS-210-2022",2022,"FDLSF-CD-126-2022","FDLSF-CPS-210-2022","Contratos de prestación de servicios profesionales y de apoyo a la gestión","Contratación directa","Prestación de servicios profesionales y de apoyo a la gestión, o para la ejecución de trabajos artísticos que sólo puedan encomendarse a determinadas personas naturales","PRESTAR SERVICIOS PROFESIONALES AL ÁREA DE GESTIÓN DEL DESARROLLO LOCAL, REALIZANDO ACTIVIDADES INHERENTES AL CONSEJO LOCAL DE GESTIÓN DEL RIESGO, DE LA LOCALIDAD DESANTA FE","Inversión","Un nuevo contrato social y ambiental para la Bogotá del Siglo XXI",57,{"$f":"IF(ISERROR(VLOOKUP(K226,Proposito_programa!$C$2:$E$59,2,FALSE)),\" \",VLOOKUP(K226,Proposito_programa!$C$2:$E$59,2,FALSE))","v":"Gestión pública local"},{"$f":"IF(ISERROR(VLOOKUP(K226,Proposito_programa!$C$2:$E$59,3,FALSE)),\" \",VLOOKUP(K226,Proposito_programa!$C$2:$E$59,3,FALSE))","v":"Propósito 5: Construir Bogotá - Región con gobierno abierto, transparente y ciudadanía consciente"},2105,1,52790286,"JESYCA ROSY ORJUELA AYA","Persona Natural",null,null,null,null,18300000,null,1,7320000,25620000,19316667,"2022-08-25","2022-08-26","2022-12-31",3,1,36,null,null,null,null,"Terminado",0.75396826697892272]
["FDLSF-CPS-211-2022",2022,"FDLSF-CD-141-2022","FDLSF-CPS-211-2022","Contratos de prestación de servicios profesionales y de apoyo a la gestión","Contratación directa","Prestación de servicios profesionales y de apoyo a la gestión, o para la ejecución de trabajos artísticos que sólo puedan encomendarse a determinadas personas naturales","APOYAR EN LAS TAREAS OPERATIVAS DE CARÁCTER ARCHIVÍSTICO DESARROLLADAS EN LA ALCALDÍA LOCAL PARA GARANTIZAR LA APLICACIÓN CORRECTA DE LOS PROCEDIMIENTOS TÉCNICOS","Inversión","Un nuevo contrato social y ambiental para la Bogotá del Siglo XXI",57,{"$f":"IF(ISERROR(VLOOKUP(K227,Proposito_programa!$C$2:$E$59,2,FALSE)),\" \",VLOOKUP(K227,Proposito_programa!$C$2:$E$59,2,FALSE))","v":"Gestión pública local"},{"$f":"IF(ISERROR(VLOOKUP(K227,Proposito_programa!$C$2:$E$59,3,FALSE)),\" \",VLOOKUP(K227,Proposito_programa!$C$2:$E$59,3,FALSE))","v":"Propósito 5: Construir Bogotá - Región con gobierno abierto, transparente y ciudadanía consciente"},2105,1,52039924,"MARYBEL GAITAN CORTES","Persona Natural",null,null,null,null,10980000,null,1,2684000,13664000,10004000,"2022-09-02","2022-09-09","2023-01-02",3,0,22,null,null,null,null,"Terminado",0.7321428571428571]
["FDLSF-CPS-212-2022",2022,"FDLSF-SAMC-003-2022","FDLSF-CPS-212-2022","Contratos de prestación de servicios","Selección abreviada","No aplica","PRESTAR LOS SERVICIOS TÉCNICOS Y LOGÍSTICOS PARA LA COORDINACIÓN, PREPARACIÓN Y DESARROLLO DE LAS ECO-CAMINATAS RECREATIVAS PARA LA LOCALIDAD DE SANTA FE","Inversión","Un nuevo contrato social y ambiental para la Bogotá del Siglo XXI",20,{"$f":"IF(ISERROR(VLOOKUP(K228,Proposito_programa!$C$2:$E$59,2,FALSE)),\" \",VLOOKUP(K228,Proposito_programa!$C$2:$E$59,2,FALSE))","v":"Bogotá, referente en cultura, deporte, recreación y actividad física, con parques para el desarrollo y la salud"},{"$f":"IF(ISERROR(VLOOKUP(K228,Proposito_programa!$C$2:$E$59,3,FALSE)),\" \",VLOOKUP(K228,Proposito_programa!$C$2:$E$59,3,FALSE))","v":"Propósito 1: Hacer un nuevo contrato social para incrementar la inclusión social, productiva y política"},2100,12,901004465,"ESTRATEGIA Y LOGISTICA DE EVENTOS SAS","Persona Jurídica",null,null,null,null,61153300,null,null,0,61153300,0,"2022-08-24","2022-09-06","2022-12-31",4,0,0,null,null,null,null,"En ejecución",0]
["FDLSF-CPS-213-2022",2022,"FDLSF-CD-127-2022","FDLSF-CPS-213-2022","Contratos de prestación de servicios profesionales y de apoyo a la gestión","Contratación directa","Prestación de servicios profesionales y de apoyo a la gestión, o para la ejecución de trabajos artísticos que sólo puedan encomendarse a determinadas personas naturales","PRESTAR SERVICIOS PROFESIONALES ESPECIALIZADOS AL DESPACHO, APOYANDO LA SUPERVISIÓN DEL GRUPO DE PROFESIONALES QUE REALIZAN LA PROMOCIÓN, ACOMPAÑAMIENTO Y ATENCIÓN DE LAS INSTANCIAS INTERINSTITUCIONALES Y LAS INSTANCIAS DE PARTICIPACIÓN LOCALES, ASÍ COMO LOS PROCESOS COMUNITARIOS EN LA LOCALIDAD DE SANTA FE","Inversión","Un nuevo contrato social y ambiental para la Bogotá del Siglo XXI",57,{"$f":"IF(ISERROR(VLOOKUP(K229,Proposito_programa!$C$2:$E$59,2,FALSE)),\" \",VLOOKUP(K229,Proposito_programa!$C$2:$E$59,2,FALSE))","v":"Gestión pública local"},{"$f":"IF(ISERROR(VLOOKUP(K229,Proposito_programa!$C$2:$E$59,3,FALSE)),\" \",VLOOKUP(K229,Proposito_programa!$C$2:$E$59,3,FALSE))","v":"Propósito 5: Construir Bogotá - Región con gobierno abierto, transparente y ciudadanía consciente"},2105,1,79851423,"DIEGO ALBERTO YARA PALENCIA","Persona Natural",null,null,null,null,22680000,null,1,9072000,31752000,24192000,"2022-08-24","2022-08-25","2022-12-31",3,1,36,null,null,null,null,"Terminado",0.76190476190476186]
["FDLSF-CPS-214-2022",2022,"FDLSF-CD-128-2022","FDLSF-CPS-214-2022","Contratos de prestación de servicios profesionales y de apoyo a la gestión","Contratación directa","Prestación de servicios profesionales y de apoyo a la gestión, o para la ejecución de trabajos artísticos que sólo puedan encomendarse a determinadas personas naturales","APOYAR AL EQUIPO DE PRENSA Y COMUNICACIONES DE LA ALCALDÍA LOCAL EN LA REALIZACIÓN DE PRODUCTOS Y PIEZAS DIGITALES, IMPRESAS Y PUBLICITARIAS DE GRAN FORMATO Y DE ANIMACIÓN GRAFICA, ASÍ́COMO APOYAR LA PRODUCCIÓN Y MONTAJE DE EVENTOS","Inversión","Un nuevo contrato social y ambiental para la Bogotá del Siglo XXI",57,{"$f":"IF(ISERROR(VLOOKUP(K230,Proposito_programa!$C$2:$E$59,2,FALSE)),\" \",VLOOKUP(K230,Proposito_programa!$C$2:$E$59,2,FALSE))","v":"Gestión pública local"},{"$f":"IF(ISERROR(VLOOKUP(K230,Proposito_programa!$C$2:$E$59,3,FALSE)),\" \",VLOOKUP(K230,Proposito_programa!$C$2:$E$59,3,FALSE))","v":"Propósito 5: Construir Bogotá - Región con gobierno abierto, transparente y ciudadanía consciente"},2105,1,1019065822,"DIEGO ALEJANDRO SANTIESTEBAN RAMIREZ","Persona Natural",null,null,null,null,15900000,null,1,7950000,23850000,16783333,"2022-08-25","2022-08-26","2023-01-09",3,1,45,null,null,null,null,"Terminado",0.70370368972746333]
["FDLSF-CIA-215-2022",2022,"FDLSF-CD-129-2022","FDLSF-CIA-215-2022","Convenios/Contratos interadministrativos","Contratación directa","Contratos interadministrativos","AUNAR ESFUERZOS TÉCNICOS, ADMINISTRATIVOS, JURÍDICOS Y FINANCIEROS ENTRE LA AGENCIA DISTRITAL PARA LA EDUCACIÓN SUPERIOR, LA CIENCIA Y LA TECNOLOGÍA - ATENEA Y EL FONDO DE DESARROLLO LOCAL DE SANTA FÉ, PARA LA IMPLEMENTACIÓN DE UN NUEVO MODELO INCLUSIVO, EFICIENTE Y FLEXIBLE PARA EL ACCESO Y LA PERMANENCIA DE LAS Y LOS JÓVENES EGRESADOS DE INSTITUCIONES DE EDUCACIÓN MEDIA A PROGRAMAS DE EDUCACIÓN SUPERIOR Y POSMEDIA ","Inversión","Un nuevo contrato social y ambiental para la Bogotá del Siglo XXI",17,{"$f":"IF(ISERROR(VLOOKUP(K231,Proposito_programa!$C$2:$E$59,2,FALSE)),\" \",VLOOKUP(K231,Proposito_programa!$C$2:$E$59,2,FALSE))","v":"Jóvenes con capacidades: Proyecto de vida para la ciudadanía, la innovación y el trabajo del siglo XXI"},{"$f":"IF(ISERROR(VLOOKUP(K231,Proposito_programa!$C$2:$E$59,3,FALSE)),\" \",VLOOKUP(K231,Proposito_programa!$C$2:$E$59,3,FALSE))","v":"Propósito 1: Hacer un nuevo contrato social para incrementar la inclusión social, productiva y política"},2095,1,901508361,"AGENCIA DISTRITAL PARA LA EDUCACIÓN SUPERIOR, LA CIENCIA Y LA TECNOLOGÍA, ATENEA","Persona Jurídica",null,null,null,null,1259613126,null,null,0,1259613126,1259613126,"2022-08-25","2022-08-25","2028-08-24",72,0,0,null,null,null,null,"Terminado",1]
["FDLSF-CPS-216-2022",2022,"FDLSF-CD-132-2022","FDLSF-CPS-216-2022","Contratos de prestación de servicios profesionales y de apoyo a la gestión","Contratación directa","Prestación de servicios profesionales y de apoyo a la gestión, o para la ejecución de trabajos artísticos que sólo puedan encomendarse a determinadas personas naturales","PRESTAR APOYO AL ÁREA GESTIÓN POLICÍVA Y ÁREA DE GESTIÓN DE DESARROLLO LOCAL EN LA CONDUCCIÓN DEL PARQUE AUTOMOTOR DEL FDLSF QUE LE SEA ASIGNADO.","Inversión","Un nuevo contrato social y ambiental para la Bogotá del Siglo XXI",57,{"$f":"IF(ISERROR(VLOOKUP(K232,Proposito_programa!$C$2:$E$59,2,FALSE)),\" \",VLOOKUP(K232,Proposito_programa!$C$2:$E$59,2,FALSE))","v":"Gestión pública local"},{"$f":"IF(ISERROR(VLOOKUP(K232,Proposito_programa!$C$2:$E$59,3,FALSE)),\" \",VLOOKUP(K232,Proposito_programa!$C$2:$E$59,3,FALSE))","v":"Propósito 5: Construir Bogotá - Región con gobierno abierto, transparente y ciudadanía consciente"},2105,1,79977098,"MIGUEL ANGEL RODRIGUEZ COLORADO","Persona Natural",null,null,null,null,8100000,null,1,3060000,11160000,8460000,"2022-08-25","2022-08-27","2022-12-31",3,1,34,null,null,null,null,"Terminado",0.75806451612903225]
["FDLSF-CPS-217-2022",2022,"FDLSF-CD-130-2022","FDLSF-CPS-217-2022","Contratos de prestación de servicios profesionales y de apoyo a la gestión","Contratación directa","Prestación de servicios profesionales y de apoyo a la gestión, o para la ejecución de trabajos artísticos que sólo puedan encomendarse a determinadas personas naturales","APOYAR JURÍDICAMENTE LA EJECUCIÓN DE LAS ACCIONES REQUERIDAS PARA LA DEPURACIÓN DE LAS ACTUACIONES ADMINISTRATIVAS QUE CURSAN EN LA ALCALDÍA LOCAL DE SANTA FE","Inversión","Un nuevo contrato social y ambiental para la Bogotá del Siglo XXI",57,{"$f":"IF(ISERROR(VLOOKUP(K233,Proposito_programa!$C$2:$E$59,2,FALSE)),\" \",VLOOKUP(K233,Proposito_programa!$C$2:$E$59,2,FALSE))","v":"Gestión pública local"},{"$f":"IF(ISERROR(VLOOKUP(K233,Proposito_programa!$C$2:$E$59,3,FALSE)),\" \",VLOOKUP(K233,Proposito_programa!$C$2:$E$59,3,FALSE))","v":"Propósito 5: Construir Bogotá - Región con gobierno abierto, transparente y ciudadanía consciente"},2105,1,1109291034,"YEIMMY LORENA RIAÑO TORO","Persona Natural",null,null,null,null,14400000,null,1,4800000,19200000,14560000,"2022-08-26","2022-08-30","2022-12-31",3,1,30,null,null,null,null,"Terminado",0.7583333333333333]
["FDLSF-CPS-218-2022",2022,"FDLSF-CD-133-2022","FDLSF-CPS-218-2022","Contratos de prestación de servicios profesionales y de apoyo a la gestión","Contratación directa","Prestación de servicios profesionales y de apoyo a la gestión, o para la ejecución de trabajos artísticos que sólo puedan encomendarse a determinadas personas naturales","APOYAR AL ALCALDE LOCAL EN LA PROMOCIÓN, ACOMPAÑAMIENTO, COORDINACIÓN Y ATENCIÓN DE LAS INSTANCIAS DE COORDINACIÓN INTERINSTITUCIONALES Y LAS INSTANCIAS DE PARTICIPACIÓN LOCALES, ASÍ COMO LOS PROCESOS COMUNITARIOS EN LA LOCALIDAD","Inversión","Un nuevo contrato social y ambiental para la Bogotá del Siglo XXI",57,{"$f":"IF(ISERROR(VLOOKUP(K234,Proposito_programa!$C$2:$E$59,2,FALSE)),\" \",VLOOKUP(K234,Proposito_programa!$C$2:$E$59,2,FALSE))","v":"Gestión pública local"},{"$f":"IF(ISERROR(VLOOKUP(K234,Proposito_programa!$C$2:$E$59,3,FALSE)),\" \",VLOOKUP(K234,Proposito_programa!$C$2:$E$59,3,FALSE))","v":"Propósito 5: Construir Bogotá - Región con gobierno abierto, transparente y ciudadanía consciente"},2105,1,53046666,"YEIMY CAROLINA BELLO CALIXTO","Persona Natural",null,null,null,null,14400000,null,1,4960000,19360000,14560000,"2022-08-26","2022-08-30","2022-12-31",3,1,31,null,null,null,null,"Terminado",0.75206611570247939]
["FDLSF-CPS-219-2022",2022,"FDLSF-CD-134-2022","FDLSF-CPS-219-2022","Contratos de prestación de servicios profesionales y de apoyo a la gestión","Contratación directa","Prestación de servicios profesionales y de apoyo a la gestión, o para la ejecución de trabajos artísticos que sólo puedan encomendarse a determinadas personas naturales","PRESTAR SERVICIOS PROFESIONALES PARA APOYAR LA COORDINACIÓN Y DESARROLLO DE PROYECTOS DEL LABORATORIO DE INNOVACIÓN DE LA LOCALIDAD DE SANTA FE","Inversión","Un nuevo contrato social y ambiental para la Bogotá del Siglo XXI",57,{"$f":"IF(ISERROR(VLOOKUP(K235,Proposito_programa!$C$2:$E$59,2,FALSE)),\" \",VLOOKUP(K235,Proposito_programa!$C$2:$E$59,2,FALSE))","v":"Gestión pública local"},{"$f":"IF(ISERROR(VLOOKUP(K235,Proposito_programa!$C$2:$E$59,3,FALSE)),\" \",VLOOKUP(K235,Proposito_programa!$C$2:$E$59,3,FALSE))","v":"Propósito 5: Construir Bogotá - Región con gobierno abierto, transparente y ciudadanía consciente"},2105,1,52392065,"CLAUDIA PATRICIA YOPASA POVEDA","Persona Natural",null,null,null,null,18300000,null,1,6303333,24603333,18503333,"2022-08-26","2022-08-30","2022-12-31",3,1,31,null,null,null,null,"Terminado",0.75206611234339671]
["FDLSF-CPS-220-2022",2022,"FDLSF-CD-113-2022","FDLSF-CPS-220-2022","Contratos de prestación de servicios profesionales y de apoyo a la gestión","Contratación directa","Prestación de servicios profesionales y de apoyo a la gestión, o para la ejecución de trabajos artísticos que sólo puedan encomendarse a determinadas personas naturales","PRESTAR LOS SERVICIOS TÉCNICOS DE APOYO EN CAMPO PARA LA IMPLEMENTACIÓN DE ACCIONES PARA EL FOMENTO DE LA AGRICULTURA URBANA Y COBERTURAS VERDES EN LA LOCALIDAD DE SANTA FE EN EL MARCO DE LAS INICIATIVAS DE PRESUPUESTOS PARTICIPATIVOS","Inversión","Un nuevo contrato social y ambiental para la Bogotá del Siglo XXI",24,{"$f":"IF(ISERROR(VLOOKUP(K236,Proposito_programa!$C$2:$E$59,2,FALSE)),\" \",VLOOKUP(K236,Proposito_programa!$C$2:$E$59,2,FALSE))","v":"Bogotá región emprendedora e innovadora"},{"$f":"IF(ISERROR(VLOOKUP(K236,Proposito_programa!$C$2:$E$59,3,FALSE)),\" \",VLOOKUP(K236,Proposito_programa!$C$2:$E$59,3,FALSE))","v":"Propósito 1: Hacer un nuevo contrato social para incrementar la inclusión social, productiva y política"},2123,1,80768937,"EDWIN ALONSO NIÑO FERRER","Persona Natural",null,null,null,null,15775000,null,null,0,15775000,9990833,"2022-08-25","2022-08-26","2023-01-25",4,0,25,null,null,null,null,"Terminado",0.63333331220285261]
["FDLSF-CPS-221-2022",2022,"FDLSF-CD-114-2022","FDLSF-CPS-221-2022","Contratos de prestación de servicios profesionales y de apoyo a la gestión","Contratación directa","Prestación de servicios profesionales y de apoyo a la gestión, o para la ejecución de trabajos artísticos que sólo puedan encomendarse a determinadas personas naturales","PRESTAR  LOS  SERVICIOS  COMO  OPERARIO(A)  PARA  LA  GESTIÓN  EN ACTIVIDADES OPERATIVAS DE AGRICULTURA URBANA, PLANTACIÓN, RECUPERACIÓN Y MANTENIMIENTO  DE  LAS  COBERTURAS  VEGETALES  Y  RECUPERACIÓN  DE  ESPACIO  PÚBLICO  EN  LA  LOCALIDAD  DE  SANTA  FE  EN  EL  MARCO  DE  LAS  INICIATIVAS CIUDADANAS  DE  PRESUPUESTOS PARTICIPATIVOS.","Inversión","Un nuevo contrato social y ambiental para la Bogotá del Siglo XXI",24,{"$f":"IF(ISERROR(VLOOKUP(K237,Proposito_programa!$C$2:$E$59,2,FALSE)),\" \",VLOOKUP(K237,Proposito_programa!$C$2:$E$59,2,FALSE))","v":"Bogotá región emprendedora e innovadora"},{"$f":"IF(ISERROR(VLOOKUP(K237,Proposito_programa!$C$2:$E$59,3,FALSE)),\" \",VLOOKUP(K237,Proposito_programa!$C$2:$E$59,3,FALSE))","v":"Propósito 1: Hacer un nuevo contrato social para incrementar la inclusión social, productiva y política"},2123,1,52851657,"MAGDA MORELY DEVIA SARMIENTO","Persona Natural",null,null,null,null,11500000,null,1,1686652,13186652,6440000,"2022-08-25","2022-09-07","2023-01-31",5,1,30,null,null,null,null,"Terminado",0.48837263620818994]
["FDLSF-CPS-222-2022",2022,"FDLSF-CD-114-2022","FDLSF-CPS-222-2022","Contratos de prestación de servicios profesionales y de apoyo a la gestión","Contratación directa","Prestación de servicios profesionales y de apoyo a la gestión, o para la ejecución de trabajos artísticos que sólo puedan encomendarse a determinadas personas naturales","PRESTAR  LOS  SERVICIOS  COMO  OPERARIO(A)  PARA  LA  GESTIÓN  EN ACTIVIDADES OPERATIVAS DE AGRICULTURA URBANA, PLANTACIÓN, RECUPERACIÓN Y MANTENIMIENTO  DE  LAS  COBERTURAS  VEGETALES  Y  RECUPERACIÓN  DE  ESPACIO  PÚBLICO  EN  LA  LOCALIDAD  DE  SANTA  FE  EN  EL  MARCO  DE  LAS  INICIATIVAS CIUDADANAS  DE  PRESUPUESTOS PARTICIPATIVOS.","Inversión","Un nuevo contrato social y ambiental para la Bogotá del Siglo XXI",24,{"$f":"IF(ISERROR(VLOOKUP(K238,Proposito_programa!$C$2:$E$59,2,FALSE)),\" \",VLOOKUP(K238,Proposito_programa!$C$2:$E$59,2,FALSE))","v":"Bogotá región emprendedora e innovadora"},{"$f":"IF(ISERROR(VLOOKUP(K238,Proposito_programa!$C$2:$E$59,3,FALSE)),\" \",VLOOKUP(K238,Proposito_programa!$C$2:$E$59,3,FALSE))","v":"Propósito 1: Hacer un nuevo contrato social para incrementar la inclusión social, productiva y política"},2123,1,53129126,"LEIDY MILENA MORENO ARIAS","Persona Natural",null,null,null,null,11500000,null,1,1686652,13186652,3833333,"2022-08-26","2022-09-07","2023-01-31",5,1,30,null,null,null,null,"Terminado",0.29069797246488344]
["FDLSF-CPS-223-2022",2022,"FDLSF-CD-140-2022","FDLSF-CPS-223-2022","Contratos de prestación de servicios profesionales y de apoyo a la gestión","Contratación directa","Prestación de servicios profesionales y de apoyo a la gestión, o para la ejecución de trabajos artísticos que sólo puedan encomendarse a determinadas personas naturales","PRESTAR SERVICIOS COMO INSTRUCTOR EN PROCESOS DE FORMACIÓN DEPORTIVA Y ACONDICIONAMIENTO FÍSICO DEL ADULTO MAYOR EN LA LOCALIDAD DE SANTA FE","Inversión","Un nuevo contrato social y ambiental para la Bogotá del Siglo XXI",20,{"$f":"IF(ISERROR(VLOOKUP(K239,Proposito_programa!$C$2:$E$59,2,FALSE)),\" \",VLOOKUP(K239,Proposito_programa!$C$2:$E$59,2,FALSE))","v":"Bogotá, referente en cultura, deporte, recreación y actividad física, con parques para el desarrollo y la salud"},{"$f":"IF(ISERROR(VLOOKUP(K239,Proposito_programa!$C$2:$E$59,3,FALSE)),\" \",VLOOKUP(K239,Proposito_programa!$C$2:$E$59,3,FALSE))","v":"Propósito 1: Hacer un nuevo contrato social para incrementar la inclusión social, productiva y política"},2100,1,1073712953,"SNEYDER GONZALO VARGAS PEDRAZA","Persona Natural",null,null,null,null,"$8.880.000,00",null,null,0,{"$f":"+W239+X239+Z239","v":8880000},7696000,"9 de septiembre de 2022","2022-09-07","2022-12-16",3,0,0,null,null,null,null,"Terminado",0.8666666666666667]
["FDLSF-CPS-224-2022",2022,"FDLSF-CD-157-2022","FDLSF-CPS-224-2022","Contratos de prestación de servicios profesionales y de apoyo a la gestión","Contratación directa","Prestación de servicios profesionales y de apoyo a la gestión, o para la ejecución de trabajos artísticos que sólo puedan encomendarse a determinadas personas naturales","APOYAR TÉCNICAMENTE LAS DISTINTAS ETAPAS DE LOS PROCESO DE COMPETENCIA DE LAS INSPECCIONES DE POLICÍA DE LA LOCALIDAD DE SANTA FE, SEGÚN REPARTO","Inversión","Un nuevo contrato social y ambiental para la Bogotá del Siglo XXI",57,{"$f":"IF(ISERROR(VLOOKUP(K240,Proposito_programa!$C$2:$E$59,2,FALSE)),\" \",VLOOKUP(K240,Proposito_programa!$C$2:$E$59,2,FALSE))","v":"Gestión pública local"},{"$f":"IF(ISERROR(VLOOKUP(K240,Proposito_programa!$C$2:$E$59,3,FALSE)),\" \",VLOOKUP(K240,Proposito_programa!$C$2:$E$59,3,FALSE))","v":"Propósito 5: Construir Bogotá - Región con gobierno abierto, transparente y ciudadanía consciente"},2105,1,79688709,"JONATHAN LOAIZA MANTILLA","Persona Natural",null,null,null,null,18300000,null,null,0,18300000,15046667,"2022-09-09","2022-09-17","2022-12-16",3,0,0,null,null,null,null,"Terminado",0.82222224043715852]
["FDLSF-CPS-225-2022",2022,"FDLSF-CD-137-2022","FDLSF-CPS-225-2022","Contratos de prestación de servicios profesionales y de apoyo a la gestión","Contratación directa","Prestación de servicios profesionales y de apoyo a la gestión, o para la ejecución de trabajos artísticos que sólo puedan encomendarse a determinadas personas naturales","PRESTAR LOS SERVICIOS TÉCNICOS AL FONDO DE DESARROLLO LOCAL DE SANTA FE EN LA GESTIÓN DE LOS TRÁMITES ADMINISTRATIVOS RELACIONADOS CON SEGURIDAD CIUDADANA Y CONVIVENCIA DE LA LOCALIDAD","Inversión","Un nuevo contrato social y ambiental para la Bogotá del Siglo XXI",57,{"$f":"IF(ISERROR(VLOOKUP(K241,Proposito_programa!$C$2:$E$59,2,FALSE)),\" \",VLOOKUP(K241,Proposito_programa!$C$2:$E$59,2,FALSE))","v":"Gestión pública local"},{"$f":"IF(ISERROR(VLOOKUP(K241,Proposito_programa!$C$2:$E$59,3,FALSE)),\" \",VLOOKUP(K241,Proposito_programa!$C$2:$E$59,3,FALSE))","v":"Propósito 5: Construir Bogotá - Región con gobierno abierto, transparente y ciudadanía consciente"},2105,1,1123160607,"CARLOS FABIAN RAMIREZ","Persona Natural",null,null,null,null,8880000,null,1,2960000,11840000,8880000,"2022-08-29","2022-09-01","2022-12-31",3,1,30,null,null,null,null,"Terminado",0.75]
["FDLSF.CPS-226-2022",2022,"FDLSF-CD-136-2022","FDLSF.CPS-226-2022","Contratos de prestación de servicios profesionales y de apoyo a la gestión","Contratación directa","Prestación de servicios profesionales y de apoyo a la gestión, o para la ejecución de trabajos artísticos que sólo puedan encomendarse a determinadas personas naturales","PRESTAR SERVICIOS DE APOYO ADMINISTRATIVO Y ASISTENCIAL A LA JUNTA ADMINISTRADORA LOCAL DE SANTA FE","Inversión","Un nuevo contrato social y ambiental para la Bogotá del Siglo XXI",57,{"$f":"IF(ISERROR(VLOOKUP(K242,Proposito_programa!$C$2:$E$59,2,FALSE)),\" \",VLOOKUP(K242,Proposito_programa!$C$2:$E$59,2,FALSE))","v":"Gestión pública local"},{"$f":"IF(ISERROR(VLOOKUP(K242,Proposito_programa!$C$2:$E$59,3,FALSE)),\" \",VLOOKUP(K242,Proposito_programa!$C$2:$E$59,3,FALSE))","v":"Propósito 5: Construir Bogotá - Región con gobierno abierto, transparente y ciudadanía consciente"},2105,1,1010187248,"JULIETH JOHANNA SILVA AREVALO","Persona Natural",null,null,null,null,7050000,null,null,0,7050000,7050000,"2022-08-29","2022-09-01","2022-11-30",3,0,0,null,null,null,null,"Terminado",1]
["FDLSF-CPS-227-2022",2022,"FDLSF-CD-114-2022","FDLSF-CPS-227-2022","Contratos de prestación de servicios profesionales y de apoyo a la gestión","Contratación directa","Prestación de servicios profesionales y de apoyo a la gestión, o para la ejecución de trabajos artísticos que sólo puedan encomendarse a determinadas personas naturales","PRESTAR  LOS  SERVICIOS  COMO  OPERARIO(A)  PARA  LA  GESTIÓN  EN ACTIVIDADES OPERATIVAS DE AGRICULTURA URBANA, PLANTACIÓN, RECUPERACIÓN Y MANTENIMIENTO  DE  LAS  COBERTURAS  VEGETALES  Y  RECUPERACIÓN  DE  ESPACIO  PÚBLICO  EN  LA  LOCALIDAD  DE  SANTA  FE  EN  EL  MARCO  DE  LAS  INICIATIVAS CIUDADANAS  DE  PRESUPUESTOS PARTICIPATIVOS.","Inversión","Un nuevo contrato social y ambiental para la Bogotá del Siglo XXI",24,{"$f":"IF(ISERROR(VLOOKUP(K243,Proposito_programa!$C$2:$E$59,2,FALSE)),\" \",VLOOKUP(K243,Proposito_programa!$C$2:$E$59,2,FALSE))","v":"Bogotá región emprendedora e innovadora"},{"$f":"IF(ISERROR(VLOOKUP(K243,Proposito_programa!$C$2:$E$59,3,FALSE)),\" \",VLOOKUP(K243,Proposito_programa!$C$2:$E$59,3,FALSE))","v":"Propósito 1: Hacer un nuevo contrato social para incrementar la inclusión social, productiva y política"},2123,1,80228295,"ALONSO RODRIGUEZ PERDOMO","Persona Natural",null,null,null,null,11500000,null,1,1609986,13109986,6286666,"2022-09-02","2022-09-09","2023-01-31",4,1,30,null,null,null,null,"Terminado",0.47953262497763155]
["FDLSF-CPS-228-2022",2022,"FDLSF-CD-147-2022","FDLSF-CPS-228-2022","Contratos de prestación de servicios profesionales y de apoyo a la gestión","Contratación directa","Prestación de servicios profesionales y de apoyo a la gestión, o para la ejecución de trabajos artísticos que sólo puedan encomendarse a determinadas personas naturales","APOYAR LA FORMULACIÓN, EJECUCIÓN, SEGUIMIENTO Y MEJORA CONTINUA DE LAS HERRAMIENTAS QUE CONFORMAN LA GESTIÓN AMBIENTAL INSTITUCIONAL DE LA ALCALDÍA LOCAL","Inversión","Un nuevo contrato social y ambiental para la Bogotá del Siglo XXI",57,{"$f":"IF(ISERROR(VLOOKUP(K244,Proposito_programa!$C$2:$E$59,2,FALSE)),\" \",VLOOKUP(K244,Proposito_programa!$C$2:$E$59,2,FALSE))","v":"Gestión pública local"},{"$f":"IF(ISERROR(VLOOKUP(K244,Proposito_programa!$C$2:$E$59,3,FALSE)),\" \",VLOOKUP(K244,Proposito_programa!$C$2:$E$59,3,FALSE))","v":"Propósito 5: Construir Bogotá - Región con gobierno abierto, transparente y ciudadanía consciente"},2105,1,1016067742,"BRAYAN ESTHEP ROJAS MAHECHA ","Persona Natural",null,null,null,null,14400000,null,1,4640000,19040000,14240000,"2022-08-31","2022-09-02","2023-01-07",0,0,30,null,null,null,null,"Terminado",0.74789915966386555]
["FDLSF-CPS-229-2022",2022,"FDLSF-CD-135-2022","FDLSF-CPS-229-2022","Contratos de prestación de servicios profesionales y de apoyo a la gestión","Contratación directa","Prestación de servicios profesionales y de apoyo a la gestión, o para la ejecución de trabajos artísticos que sólo puedan encomendarse a determinadas personas naturales","PRESTAR SERVICOS TÉCNICOS EN LOS ASUNTOS RELACIONADOS CON LOS TEMAS DE PARTICIPACIÓN Y RELACIONES COMUNITARIAS DE LA ALCALDIA LOCAL DE SANTA FE","Inversión","Un nuevo contrato social y ambiental para la Bogotá del Siglo XXI",57,{"$f":"IF(ISERROR(VLOOKUP(K245,Proposito_programa!$C$2:$E$59,2,FALSE)),\" \",VLOOKUP(K245,Proposito_programa!$C$2:$E$59,2,FALSE))","v":"Gestión pública local"},{"$f":"IF(ISERROR(VLOOKUP(K245,Proposito_programa!$C$2:$E$59,3,FALSE)),\" \",VLOOKUP(K245,Proposito_programa!$C$2:$E$59,3,FALSE))","v":"Propósito 5: Construir Bogotá - Región con gobierno abierto, transparente y ciudadanía consciente"},2105,1,1022351156,"JHON FREDY ALVAREZ BARRERA","Persona Natural",null,null,null,null,10980000,null,null,0,10980000,10248000,"2022-09-03","2022-09-07","2022-12-06",3,0,0,null,null,null,null,"Terminado",0.93333333333333335]
["FDLSF-CPS-230-2022",2022,"FDLSF-CD-144-2022","FDLSF-CPS-230-2022","Contratos de prestación de servicios profesionales y de apoyo a la gestión","Contratación directa","Prestación de servicios profesionales y de apoyo a la gestión, o para la ejecución de trabajos artísticos que sólo puedan encomendarse a determinadas personas naturales","APOYAR Y DAR SOPORTE TÉCNICO AL ADMINISTRADOR Y USUARIO FINAL DE LA RED DE SISTEMAS Y TECNOLOGIA E INFORMACIÓN DE LA ALCALDIA LOCAL DE SANTA FE","Inversión","Un nuevo contrato social y ambiental para la Bogotá del Siglo XXI",57,{"$f":"IF(ISERROR(VLOOKUP(K246,Proposito_programa!$C$2:$E$59,2,FALSE)),\" \",VLOOKUP(K246,Proposito_programa!$C$2:$E$59,2,FALSE))","v":"Gestión pública local"},{"$f":"IF(ISERROR(VLOOKUP(K246,Proposito_programa!$C$2:$E$59,3,FALSE)),\" \",VLOOKUP(K246,Proposito_programa!$C$2:$E$59,3,FALSE))","v":"Propósito 5: Construir Bogotá - Región con gobierno abierto, transparente y ciudadanía consciente"},2105,1,1082879244,"RAFAEL RICARDO BALAGUERA BONITTO","Persona Natural",null,null,null,null,10980000,null,1,3538000,14518000,10858000,"2022-09-01","2022-09-02","2022-12-31",3,0,29,null,null,null,null,"Terminado",0.74789915966386555]
["FDLSF-CPS-231-2022",2022,"FDLSF-CD-148-2022","FDLSF-CPS-231-2022","Contratos de prestación de servicios profesionales y de apoyo a la gestión","Contratación directa","Prestación de servicios profesionales y de apoyo a la gestión, o para la ejecución de trabajos artísticos que sólo puedan encomendarse a determinadas personas naturales","APOYAR AL ALCALDE LOCAL EN LA PROMOCIÓN, ARTICULACIÓN, ACOMPAÑAMIENTO Y SEGUIMIENTO PARA LA ATENCIÓN Y PROTECCIÓN DE LOS ANIMALES DOMÉSTICOS Y SILVESTRES DE LA LOCALIDAD.","Inversión","Un nuevo contrato social y ambiental para la Bogotá del Siglo XXI",34,{"$f":"IF(ISERROR(VLOOKUP(K247,Proposito_programa!$C$2:$E$59,2,FALSE)),\" \",VLOOKUP(K247,Proposito_programa!$C$2:$E$59,2,FALSE))","v":"Bogotá protectora de los animales"},{"$f":"IF(ISERROR(VLOOKUP(K247,Proposito_programa!$C$2:$E$59,3,FALSE)),\" \",VLOOKUP(K247,Proposito_programa!$C$2:$E$59,3,FALSE))","v":"Propósito 2 : Cambiar Nuestros Hábitos de Vida para Reverdecer a Bogotá y Adaptarnos y Mitigar la Crisis Climática"},2074,1,1018474047,"SANTIAGO SANCHEZ GUZMAN","Persona Natural",null,null,null,null,19200000,null,null,0,19200000,14240000,"2022-09-01","2022-09-02","2022-12-31",4,0,0,null,null,null,null,"Terminado",0.7416666666666667]
["FDLSF-CPS-232-2022",2022,"FDLSF-CD-114-2022","FDLSF-CPS-232-2022","Contratos de prestación de servicios profesionales y de apoyo a la gestión","Contratación directa","Prestación de servicios profesionales y de apoyo a la gestión, o para la ejecución de trabajos artísticos que sólo puedan encomendarse a determinadas personas naturales","PRESTAR  LOS  SERVICIOS  COMO  OPERARIO(A)  PARA  LA  GESTIÓN  EN ACTIVIDADES OPERATIVAS DE AGRICULTURA URBANA, PLANTACIÓN, RECUPERACIÓN Y MANTENIMIENTO  DE  LAS  COBERTURAS  VEGETALES  Y  RECUPERACIÓN  DE  ESPACIO  PÚBLICO  EN  LA  LOCALIDAD  DE  SANTA  FE  EN  EL  MARCO  DE  LAS  INICIATIVAS CIUDADANAS  DE  PRESUPUESTOS PARTICIPATIVOS.","Inversión","Un nuevo contrato social y ambiental para la Bogotá del Siglo XXI",24,{"$f":"IF(ISERROR(VLOOKUP(K248,Proposito_programa!$C$2:$E$59,2,FALSE)),\" \",VLOOKUP(K248,Proposito_programa!$C$2:$E$59,2,FALSE))","v":"Bogotá región emprendedora e innovadora"},{"$f":"IF(ISERROR(VLOOKUP(K248,Proposito_programa!$C$2:$E$59,3,FALSE)),\" \",VLOOKUP(K248,Proposito_programa!$C$2:$E$59,3,FALSE))","v":"Propósito 1: Hacer un nuevo contrato social para incrementar la inclusión social, productiva y política"},2123,1,1026580557,"CAMILO ANDRES AVELLA SARMIENTO","Persona Natural",null,null,null,null,11500000,null,1,1609986,13109986,5520000,"2022-09-02","2022-09-19","2023-02-18",5,0,49,null,null,null,null,"Terminado",0.42105308121610502]
["FDLSF-CPS-233-2022",2022,"FDLSF-CD-149-2022","FDLSF-CPS-233-2022","Contratos de prestación de servicios profesionales y de apoyo a la gestión","Contratación directa","Prestación de servicios profesionales y de apoyo a la gestión, o para la ejecución de trabajos artísticos que sólo puedan encomendarse a determinadas personas naturales","PRESTAR LOS SERVICIOS TECNICOS EN LO REFERENTE A LAS ACTIVIDADES ADMINISTRATIVAS, EDUCATIVAS, DE CAMPO Y CAPACITACIÓN EN LOS PROCESOS DE SEPARACIÓN EN LA FUENTE Y RECUPERACIÓN DE PUNTOS CRITICOS ACORDE A LOS LINEAMIENTOS ESTABLECIDOS PARA TAL FIN, EN EL MARCO DE LAS INICIATIVAS DE PRESUPUESTOS PARTICIPATIVOS EN LA LOCALIDAD DE SANTA FE","Inversión","Un nuevo contrato social y ambiental para la Bogotá del Siglo XXI",38,{"$f":"IF(ISERROR(VLOOKUP(K249,Proposito_programa!$C$2:$E$59,2,FALSE)),\" \",VLOOKUP(K249,Proposito_programa!$C$2:$E$59,2,FALSE))","v":"Ecoeficiencia, reciclaje, manejo de residuos e inclusión de la población recicladora"},{"$f":"IF(ISERROR(VLOOKUP(K249,Proposito_programa!$C$2:$E$59,3,FALSE)),\" \",VLOOKUP(K249,Proposito_programa!$C$2:$E$59,3,FALSE))","v":"Propósito 2 : Cambiar Nuestros Hábitos de Vida para Reverdecer a Bogotá y Adaptarnos y Mitigar la Crisis Climática"},2131,1,1022393863,"NAYIBETH LORENA FLOREZ DUQUE","Persona Natural",null,null,null,null,15600000,null,null,0,15600000,10140000,"2022-09-01","2022-09-13","2023-01-12",4,0,12,null,null,null,null,"Terminado",0.65]
["FDLSF-CPS-234-2022",2022,"FDLSF-CD-136-2022","FDLSF-CPS-234-2022","Contratos de prestación de servicios profesionales y de apoyo a la gestión","Contratación directa","Prestación de servicios profesionales y de apoyo a la gestión, o para la ejecución de trabajos artísticos que sólo puedan encomendarse a determinadas personas naturales","PRESTAR SERVICIOS DE APOYO ADMINISTRATIVO Y ASISTENCIAL A LA JUNTA ADMINISTRADORA LOCAL DE SANTA FE","Inversión","Un nuevo contrato social y ambiental para la Bogotá del Siglo XXI",57,{"$f":"IF(ISERROR(VLOOKUP(K250,Proposito_programa!$C$2:$E$59,2,FALSE)),\" \",VLOOKUP(K250,Proposito_programa!$C$2:$E$59,2,FALSE))","v":"Gestión pública local"},{"$f":"IF(ISERROR(VLOOKUP(K250,Proposito_programa!$C$2:$E$59,3,FALSE)),\" \",VLOOKUP(K250,Proposito_programa!$C$2:$E$59,3,FALSE))","v":"Propósito 5: Construir Bogotá - Región con gobierno abierto, transparente y ciudadanía consciente"},2105,1,1026282016,"NATALIA MATEUS CAMARGO","Persona Natural",null,null,null,null,7050000,null,1,1175000,8225000,5875000,"2022-09-01","2022-09-16","2022-12-31",3,0,15,null,null,null,null,"Terminado",0.7142857142857143]
["FDLSF-CPS-235-2022",2022,"FDLSF-CD-114-2022","FDLSF-CPS-235-2022","Contratos de prestación de servicios profesionales y de apoyo a la gestión","Contratación directa","Prestación de servicios profesionales y de apoyo a la gestión, o para la ejecución de trabajos artísticos que sólo puedan encomendarse a determinadas personas naturales","PRESTAR  LOS  SERVICIOS  COMO  OPERARIO(A)  PARA  LA  GESTIÓN  EN ACTIVIDADES OPERATIVAS DE AGRICULTURA URBANA, PLANTACIÓN, RECUPERACIÓN Y MANTENIMIENTO  DE  LAS  COBERTURAS  VEGETALES  Y  RECUPERACIÓN  DE  ESPACIO  PÚBLICO  EN  LA  LOCALIDAD  DE  SANTA  FE  EN  EL  MARCO  DE  LAS  INICIATIVAS CIUDADANAS  DE  PRESUPUESTOS PARTICIPATIVOS.","Inversión","Un nuevo contrato social y ambiental para la Bogotá del Siglo XXI",24,{"$f":"IF(ISERROR(VLOOKUP(K251,Proposito_programa!$C$2:$E$59,2,FALSE)),\" \",VLOOKUP(K251,Proposito_programa!$C$2:$E$59,2,FALSE))","v":"Bogotá región emprendedora e innovadora"},{"$f":"IF(ISERROR(VLOOKUP(K251,Proposito_programa!$C$2:$E$59,3,FALSE)),\" \",VLOOKUP(K251,Proposito_programa!$C$2:$E$59,3,FALSE))","v":"Propósito 1: Hacer un nuevo contrato social para incrementar la inclusión social, productiva y política"},2123,1,80109084,"JUVENAL BERNATE","Persona Natural",null,null,null,null,11500000,null,1,1609986,13109986,5826666,"2022-09-02","2022-09-15","2023-01-31",5,1,30,null,null,null,null,"Terminado",0.44444486820962281]
["FDLSF-CPS-236-2022",2022,"FDLSF-CD-157-2022","FDLSF-CPS-236-2022","Contratos de prestación de servicios profesionales y de apoyo a la gestión","Contratación directa","Prestación de servicios profesionales y de apoyo a la gestión, o para la ejecución de trabajos artísticos que sólo puedan encomendarse a determinadas personas naturales","APOYAR TÉCNICAMENTE LAS DISTINTAS ETAPAS DE LOS PROCESO DE COMPETENCIA DE LAS INSPECCIONES DE POLICÍA DE LA LOCALIDAD DE SANTA FE, SEGÚN REPARTO","Inversión","Un nuevo contrato social y ambiental para la Bogotá del Siglo XXI",57,{"$f":"IF(ISERROR(VLOOKUP(K252,Proposito_programa!$C$2:$E$59,2,FALSE)),\" \",VLOOKUP(K252,Proposito_programa!$C$2:$E$59,2,FALSE))","v":"Gestión pública local"},{"$f":"IF(ISERROR(VLOOKUP(K252,Proposito_programa!$C$2:$E$59,3,FALSE)),\" \",VLOOKUP(K252,Proposito_programa!$C$2:$E$59,3,FALSE))","v":"Propósito 5: Construir Bogotá - Región con gobierno abierto, transparente y ciudadanía consciente"},2105,1,52475976,"ANGELA PATRICIA GALINDO CARO","Persona Natural",null,null,null,null,18300000,null,null,0,18300000,15656666,"2022-09-09","2022-09-14","2022-12-31",3,0,18,null,null,null,null,"Terminado",0.85555551912568306]
["FDLSF-CPS-237-2022",2022,"FDLSF-CD-150-2022","FDLSF-CPS-237-2022","Contratos de prestación de servicios profesionales y de apoyo a la gestión","Contratación directa","Prestación de servicios profesionales y de apoyo a la gestión, o para la ejecución de trabajos artísticos que sólo puedan encomendarse a determinadas personas naturales"," APOYAR JURÍDICAMENTE LA EJECUCIÓN DE LAS ACCIONES REQUERIDAS PARA LA DEPURACIÓN DE LAS ACTUACIONES ADMINISTRATIVAS QUE CURSAN EN LA ALCALDÍA LOCAL DE SANTA FE","Inversión","Un nuevo contrato social y ambiental para la Bogotá del Siglo XXI",57,{"$f":"IF(ISERROR(VLOOKUP(K253,Proposito_programa!$C$2:$E$59,2,FALSE)),\" \",VLOOKUP(K253,Proposito_programa!$C$2:$E$59,2,FALSE))","v":"Gestión pública local"},{"$f":"IF(ISERROR(VLOOKUP(K253,Proposito_programa!$C$2:$E$59,3,FALSE)),\" \",VLOOKUP(K253,Proposito_programa!$C$2:$E$59,3,FALSE))","v":"Propósito 5: Construir Bogotá - Región con gobierno abierto, transparente y ciudadanía consciente"},2105,1,1098700541,"JOSE KARLORLANDO LOPEZ URBINA","Persona Natural",null,null,null,null,18300000,null,1,5083333,23383333,17283333,"2022-09-05","2022-09-06","2023-01-04",3,0,25,null,null,null,null,"Terminado",0.73913043106386933]
["FDLSF-CPS-238-2022",2022,"FDLSF-CD-150-2022","FDLSF-CPS-238-2022","Contratos de prestación de servicios profesionales y de apoyo a la gestión","Contratación directa","Prestación de servicios profesionales y de apoyo a la gestión, o para la ejecución de trabajos artísticos que sólo puedan encomendarse a determinadas personas naturales"," APOYAR JURÍDICAMENTE LA EJECUCIÓN DE LAS ACCIONES REQUERIDAS PARA LA DEPURACIÓN DE LAS ACTUACIONES ADMINISTRATIVAS QUE CURSAN EN LA ALCALDÍA LOCAL DE SANTA FE","Inversión","Un nuevo contrato social y ambiental para la Bogotá del Siglo XXI",57,{"$f":"IF(ISERROR(VLOOKUP(K254,Proposito_programa!$C$2:$E$59,2,FALSE)),\" \",VLOOKUP(K254,Proposito_programa!$C$2:$E$59,2,FALSE))","v":"Gestión pública local"},{"$f":"IF(ISERROR(VLOOKUP(K254,Proposito_programa!$C$2:$E$59,3,FALSE)),\" \",VLOOKUP(K254,Proposito_programa!$C$2:$E$59,3,FALSE))","v":"Propósito 5: Construir Bogotá - Región con gobierno abierto, transparente y ciudadanía consciente"},2105,1,1013593466,"OMAR DAVID CASTILLO AMADOR","Persona Natural",null,null,null,null,18300000,null,1,5083333,23383333,17283333,"2022-09-05","2022-09-06","2023-01-04",3,0,25,null,null,null,null,"Terminado",0.73913043106386933]
["FDLSF-CPS-239-2022",2022,"FDLSF-CD-151-2022","FDLSF-CPS-239-2022","Contratos de prestación de servicios profesionales y de apoyo a la gestión","Contratación directa","Prestación de servicios profesionales y de apoyo a la gestión, o para la ejecución de trabajos artísticos que sólo puedan encomendarse a determinadas personas naturales","APOYA EL CUBRIMIENTO DE LAS ACTIVIDADES, CRONOGRAMAS Y AGENDA DE LA ALCALDÍA LOCAL A NIVEL INTERNO Y EXTERNO, ASÍ COMO LA GENERACIÓN DE CONTENIDOS PERIODÍSTICOS","Inversión","Un nuevo contrato social y ambiental para la Bogotá del Siglo XXI",57,{"$f":"IF(ISERROR(VLOOKUP(K255,Proposito_programa!$C$2:$E$59,2,FALSE)),\" \",VLOOKUP(K255,Proposito_programa!$C$2:$E$59,2,FALSE))","v":"Gestión pública local"},{"$f":"IF(ISERROR(VLOOKUP(K255,Proposito_programa!$C$2:$E$59,3,FALSE)),\" \",VLOOKUP(K255,Proposito_programa!$C$2:$E$59,3,FALSE))","v":"Propósito 5: Construir Bogotá - Región con gobierno abierto, transparente y ciudadanía consciente"},2105,1,79765185,"ALDO FERNANDO GOMEZ ARTEAGA","Persona Natural",null,null,null,null,15900000,null,null,0,15900000,8656666,"2022-09-06","2022-09-08","2023-01-10",3,0,34,79765185,"ALDO FERNANDO GOMEZ ARTEAGA","2022-10-03",null,"Terminado",0.54444440251572324]
["FDLSF-COP-240-2022",2022,"FDLSF-LP-002-2022","FDLSF-COP-240-2022","Obra pública","Licitación pública","No aplica","APROPIACION Y/O AJUSTES A ESTUDIOS, DISEÑOS Y CONSTRUCCIÓN DEL INMUEBLE UBICADO EN LA DIRECCION CALLE 1d No. 7-59 BARRIO LAS CRUCES, DE LA LOCALIDAD DE SANTA FE","Inversión","Un nuevo contrato social y ambiental para la Bogotá del Siglo XXI",55,{"$f":"IF(ISERROR(VLOOKUP(K256,Proposito_programa!$C$2:$E$59,2,FALSE)),\" \",VLOOKUP(K256,Proposito_programa!$C$2:$E$59,2,FALSE))","v":"Fortalecimiento de cultura ciudadana y su institucionalidad"},{"$f":"IF(ISERROR(VLOOKUP(K256,Proposito_programa!$C$2:$E$59,3,FALSE)),\" \",VLOOKUP(K256,Proposito_programa!$C$2:$E$59,3,FALSE))","v":"Propósito 5: Construir Bogotá - Región con gobierno abierto, transparente y ciudadanía consciente"},2156,11,"315781-0","UT CRUCES 527","Unión Temporal","800229583","CONSTRUCCIONES\nVAREGO SAS",0.5,null,2752836002.9499998,null,null,0,2752836002.9499998,0,"2022-09-19","2022-12-13","2023-08-19",8,0,0,null,null,null,null,"Terminado",0]
["FDLSF-COP-240-2022",2022,"FDLSF-LP-002-2022","FDLSF-COP-240-2022","Obra pública","Licitación pública","No aplica","APROPIACION Y/O AJUSTES A ESTUDIOS, DISEÑOS Y CONSTRUCCIÓN DEL INMUEBLE UBICADO EN LA DIRECCION CALLE 1d No. 7-59 BARRIO LAS CRUCES, DE LA LOCALIDAD DE SANTA FE","Inversión","Un nuevo contrato social y ambiental para la Bogotá del Siglo XXI",55,{"$f":"IF(ISERROR(VLOOKUP(K257,Proposito_programa!$C$2:$E$59,2,FALSE)),\" \",VLOOKUP(K257,Proposito_programa!$C$2:$E$59,2,FALSE))","v":"Fortalecimiento de cultura ciudadana y su institucionalidad"},{"$f":"IF(ISERROR(VLOOKUP(K257,Proposito_programa!$C$2:$E$59,3,FALSE)),\" \",VLOOKUP(K257,Proposito_programa!$C$2:$E$59,3,FALSE))","v":"Propósito 5: Construir Bogotá - Región con gobierno abierto, transparente y ciudadanía consciente"},2156,null,"315781-0","UT CRUCES 527","Unión Temporal","900388354","VAREGO SAS",0.5,null,0,null,null,0,0,0,"2022-09-19","2022-12-13","2023-08-19",8,0,0,null,null,null,null,"Terminado","-"]
["FDLSF-CPS-241-2022",2022,"FDLSF-CD-133-2022","FDLSF-CPS-241-2022","Contratos de prestación de servicios profesionales y de apoyo a la gestión","Contratación directa","Prestación de servicios profesionales y de apoyo a la gestión, o para la ejecución de trabajos artísticos que sólo puedan encomendarse a determinadas personas naturales","APOYAR AL ALCALDE LOCAL EN LA PROMOCIÓN, ACOMPAÑAMIENTO, COORDINACIÓN Y ATENCIÓN DE LAS INSTANCIAS DE COORDINACIÓN INTERINSTITUCIONALES Y LAS INSTANCIAS DE PARTICIPACIÓN LOCALES, ASÍ COMO LOS PROCESOS COMUNITARIOS EN LA LOCALIDAD","Inversión","Un nuevo contrato social y ambiental para la Bogotá del Siglo XXI",57,{"$f":"IF(ISERROR(VLOOKUP(K258,Proposito_programa!$C$2:$E$59,2,FALSE)),\" \",VLOOKUP(K258,Proposito_programa!$C$2:$E$59,2,FALSE))","v":"Gestión pública local"},{"$f":"IF(ISERROR(VLOOKUP(K258,Proposito_programa!$C$2:$E$59,3,FALSE)),\" \",VLOOKUP(K258,Proposito_programa!$C$2:$E$59,3,FALSE))","v":"Propósito 5: Construir Bogotá - Región con gobierno abierto, transparente y ciudadanía consciente"},2105,1,1018418087,"NELSON ARNULFO FRESNEDA GUZMAN","Persona Natural",null,null,null,null,14400000,null,null,0,14400000,13280000,"2022-09-06","2022-09-08","2022-12-07",3,0,0,null,null,null,null,"Terminado",0.92222222222222228]
["FDLSF-CON-242-2022",2022,"FDLSF-CMA-002-2022","FDLSF-CON-242-2022","Consultoría","Concurso de méritos","No aplica","REALIZAR LOS DIAGNÓSTICOS, ESTUDIOS Y DISEÑOS PARA LA CONSERVACIÓN DE LA MALLA VIAL, DE PUENTES VEHICULARES DE ESCALA LOCAL SOBRE CUERPOS DE AGUA Y OBRAS COMPLEMENTARIAS EN LA LOCALIDAD DE SANTA FE","Inversión","Un nuevo contrato social y ambiental para la Bogotá del Siglo XXI",49,{"$f":"IF(ISERROR(VLOOKUP(K259,Proposito_programa!$C$2:$E$59,2,FALSE)),\" \",VLOOKUP(K259,Proposito_programa!$C$2:$E$59,2,FALSE))","v":"Movilidad segura, sostenible y accesible"},{"$f":"IF(ISERROR(VLOOKUP(K259,Proposito_programa!$C$2:$E$59,3,FALSE)),\" \",VLOOKUP(K259,Proposito_programa!$C$2:$E$59,3,FALSE))","v":"Propósito 4: Hacer de Bogotá Región un modelo de movilidad multimodal, incluyente y sostenible"},2145,15,"901628929-1","CONSORCIO DISEÑOS SANTAFE","Consorcio","901489163","EMUNAH COLOMBIA S.A.S",0.95,null,411078598,null,null,0,411078598,0,"2022-09-09","2022-12-13","2023-05-12",5,0,0,null,null,null,null,"Terminado",0]
["FDLSF-CON-242-2022",2022,"FDLSF-CMA-002-2022","FDLSF-CON-242-2022","Consultoría","Concurso de méritos","No aplica","REALIZAR LOS DIAGNÓSTICOS, ESTUDIOS Y DISEÑOS PARA LA CONSERVACIÓN DE LA MALLA VIAL, DE PUENTES VEHICULARES DE ESCALA LOCAL SOBRE CUERPOS DE AGUA Y OBRAS COMPLEMENTARIAS EN LA LOCALIDAD DE SANTA FE","Inversión","Un nuevo contrato social y ambiental para la Bogotá del Siglo XXI",49,{"$f":"IF(ISERROR(VLOOKUP(K260,Proposito_programa!$C$2:$E$59,2,FALSE)),\" \",VLOOKUP(K260,Proposito_programa!$C$2:$E$59,2,FALSE))","v":"Movilidad segura, sostenible y accesible"},{"$f":"IF(ISERROR(VLOOKUP(K260,Proposito_programa!$C$2:$E$59,3,FALSE)),\" \",VLOOKUP(K260,Proposito_programa!$C$2:$E$59,3,FALSE))","v":"Propósito 4: Hacer de Bogotá Región un modelo de movilidad multimodal, incluyente y sostenible"},2145,null,"901628929-1","CONSORCIO DISEÑOS SANTAFE","Consorcio","900692921","INFRAESTRUCTURA COLOMBIANA S.A.S.",0.05,null,0,null,null,0,0,0,"2022-09-09","2022-12-13","2023-05-12",5,0,0,null,null,null,null,"Terminado"]
["FDLSF-CPS-243-2022",2022,"FDLSF-CD-153-2022","FDLSF-CPS-243-2022","Contratos de prestación de servicios profesionales y de apoyo a la gestión","Contratación directa","Prestación de servicios profesionales y de apoyo a la gestión, o para la ejecución de trabajos artísticos que sólo puedan encomendarse a determinadas personas naturales","PRESTAR SUS SERVICIOS PROFESIONALES PARA APOYAR LA ESTRUCTURACIÓN, EJECUCIÓN Y SEGUIMIENTO DE LAS ESTRATEGIAS DEL PROYECTO 2104 -SANTA FE MEJORA LA GESTIÓN EN SALUD- PARA LA LOCALIDAD DE SANTA FE.","Inversión","Un nuevo contrato social y ambiental para la Bogotá del Siglo XXI",7,{"$f":"IF(ISERROR(VLOOKUP(K261,Proposito_programa!$C$2:$E$59,2,FALSE)),\" \",VLOOKUP(K261,Proposito_programa!$C$2:$E$59,2,FALSE))","v":"Mejora de la gestión de instituciones de salud"},{"$f":"IF(ISERROR(VLOOKUP(K261,Proposito_programa!$C$2:$E$59,3,FALSE)),\" \",VLOOKUP(K261,Proposito_programa!$C$2:$E$59,3,FALSE))","v":"Propósito 1: Hacer un nuevo contrato social para incrementar la inclusión social, productiva y política"},2104,1,1018408513,"PAOLA MARCELA DEL PILAR BALLESTEROS BERNAL ","Persona Natural",null,null,null,null,19200000,null,null,0,19200000,8960000,"2022-09-13","2022-09-20","2023-01-31",0,1,30,null,null,null,null,"Terminado",{"$f":"IF(ISERROR(AB261/AA261),\"-\",(AB261/AA261))","v":0.46666666666666667}]
["FDLSF-CPS-244-2022",2022,"FDLSF-CD-153-2022","FDLSF-CPS-244-2022","Contratos de prestación de servicios profesionales y de apoyo a la gestión","Contratación directa","Prestación de servicios profesionales y de apoyo a la gestión, o para la ejecución de trabajos artísticos que sólo puedan encomendarse a determinadas personas naturales","PRESTAR SUS SERVICIOS PROFESIONALES PARA APOYAR LA ESTRUCTURACIÓN, EJECUCIÓN Y SEGUIMIENTO DE LAS ESTRATEGIAS DEL PROYECTO 2104 -SANTA FE MEJORA LA GESTIÓN EN SALUD- PARA LA LOCALIDAD DE SANTA FE.","Inversión","Un nuevo contrato social y ambiental para la Bogotá del Siglo XXI",7,{"$f":"IF(ISERROR(VLOOKUP(K262,Proposito_programa!$C$2:$E$59,2,FALSE)),\" \",VLOOKUP(K262,Proposito_programa!$C$2:$E$59,2,FALSE))","v":"Mejora de la gestión de instituciones de salud"},{"$f":"IF(ISERROR(VLOOKUP(K262,Proposito_programa!$C$2:$E$59,3,FALSE)),\" \",VLOOKUP(K262,Proposito_programa!$C$2:$E$59,3,FALSE))","v":"Propósito 1: Hacer un nuevo contrato social para incrementar la inclusión social, productiva y política"},2104,1,52540454,"ALBA LUCIA CRUZ CARDENAS","Persona Natural",null,null,null,null,19200000,null,null,0,19200000,11360000,"2022-09-12","2022-09-20","2023-01-19",0,0,19,null,null,null,null,"Terminado",0.59166666666666667]
["FDLSF-CPS-245-2022",2022,"FDLSF-CD-153-2022","FDLSF-CPS-245-2022","Contratos de prestación de servicios profesionales y de apoyo a la gestión","Contratación directa","Prestación de servicios profesionales y de apoyo a la gestión, o para la ejecución de trabajos artísticos que sólo puedan encomendarse a determinadas personas naturales","PRESTAR SUS SERVICIOS PROFESIONALES PARA APOYAR LA ESTRUCTURACIÓN, EJECUCIÓN Y SEGUIMIENTO DE LAS ESTRATEGIAS DEL PROYECTO 2104 -SANTA FE MEJORA LA GESTIÓN EN SALUD- PARA LA LOCALIDAD DE SANTA FE.","Inversión","Un nuevo contrato social y ambiental para la Bogotá del Siglo XXI",7,{"$f":"IF(ISERROR(VLOOKUP(K263,Proposito_programa!$C$2:$E$59,2,FALSE)),\" \",VLOOKUP(K263,Proposito_programa!$C$2:$E$59,2,FALSE))","v":"Mejora de la gestión de instituciones de salud"},{"$f":"IF(ISERROR(VLOOKUP(K263,Proposito_programa!$C$2:$E$59,3,FALSE)),\" \",VLOOKUP(K263,Proposito_programa!$C$2:$E$59,3,FALSE))","v":"Propósito 1: Hacer un nuevo contrato social para incrementar la inclusión social, productiva y política"},2104,1,79908023,"TELEMACO DE JESUS TORRES GARZON","Persona Natural",null,null,null,null,19200000,null,null,0,19200000,11360000,"2022-09-12","2022-09-20","2023-01-19",0,0,19,null,null,null,null,"Terminado",0.59166666666666667]
["FDLSF-CPS-246-2022",2022,"FDLSF-CD-154-2022","FDLSF-CPS-246-2022","Contratos de prestación de servicios profesionales y de apoyo a la gestión","Contratación directa","Prestación de servicios profesionales y de apoyo a la gestión, o para la ejecución de trabajos artísticos que sólo puedan encomendarse a determinadas personas naturales","PRESTAR SUS SERVICIOS PROFESIONALES PARA APOYAR EN LA COORDINACIÓN DE LA ESTRUCTURACIÓN, EJECUCIÓN Y SEGUIMIENTO DE LAS ESTRATEGIAS DEL PROYECTO 2104 -SANTA FE MEJORA LA GESTIÓN EN SALUD PARA LA LOCALIDAD DE SANTA FE.","Inversión","Un nuevo contrato social y ambiental para la Bogotá del Siglo XXI",7,{"$f":"IF(ISERROR(VLOOKUP(K264,Proposito_programa!$C$2:$E$59,2,FALSE)),\" \",VLOOKUP(K264,Proposito_programa!$C$2:$E$59,2,FALSE))","v":"Mejora de la gestión de instituciones de salud"},{"$f":"IF(ISERROR(VLOOKUP(K264,Proposito_programa!$C$2:$E$59,3,FALSE)),\" \",VLOOKUP(K264,Proposito_programa!$C$2:$E$59,3,FALSE))","v":"Propósito 1: Hacer un nuevo contrato social para incrementar la inclusión social, productiva y política"},2104,1,74322674,"GUILLERMO COY RORIGUEZ","Persona Natural",null,null,null,null,20688000,null,null,0,20688000,12240400,"2022-09-16","2022-09-20","2023-01-19",0,0,19,null,null,null,null,"Terminado",0.59166666666666667]
["FDLSF-CPS-247-2022",2022,"FDLSF-CD-155-2022","FDLSF-CPS-247-2022","Contratos de prestación de servicios profesionales y de apoyo a la gestión","Contratación directa","Prestación de servicios profesionales y de apoyo a la gestión, o para la ejecución de trabajos artísticos que sólo puedan encomendarse a determinadas personas naturales","APOYAR AL ALCALDE LOCAL EN LA PROMOCIÓN, ACOMPAÑAMIENTO, COORDINACIÓN Y ATENCIÓN DE LAS INSTANCIAS DE COORDINACIÓN INTERINSTITUCIONALES Y LAS INSTANCIAS DE PARTICIPACIÓN LOCALES, ASÍ COMO LOS PROCESOS COMUNITARIOS EN LA LOCALIDAD","Inversión","Un nuevo contrato social y ambiental para la Bogotá del Siglo XXI",57,{"$f":"IF(ISERROR(VLOOKUP(K265,Proposito_programa!$C$2:$E$59,2,FALSE)),\" \",VLOOKUP(K265,Proposito_programa!$C$2:$E$59,2,FALSE))","v":"Gestión pública local"},{"$f":"IF(ISERROR(VLOOKUP(K265,Proposito_programa!$C$2:$E$59,3,FALSE)),\" \",VLOOKUP(K265,Proposito_programa!$C$2:$E$59,3,FALSE))","v":"Propósito 5: Construir Bogotá - Región con gobierno abierto, transparente y ciudadanía consciente"},2105,1,79115862,"FERNANDO ZULUAGA FLOREZ","Persona Natural",null,null,null,null,15516000,null,1,3792800,19308800,14136800,"2022-09-08","2022-09-09","2022-12-30",3,0,22,null,null,null,null,"Terminado",0.7321428571428571]
["FDLSF-CPS-248-2022",2022,"FDLSF-CD-157-2022","FDLSF-CPS-248-2022","Contratos de prestación de servicios profesionales y de apoyo a la gestión","Contratación directa","Prestación de servicios profesionales y de apoyo a la gestión, o para la ejecución de trabajos artísticos que sólo puedan encomendarse a determinadas personas naturales","APOYAR TÉCNICAMENTE LAS DISTINTAS ETAPAS DE LOS PROCESO DE COMPETENCIA DE LAS INSPECCIONES DE POLICÍA DE LA LOCALIDAD DE SANTA FE, SEGÚN REPARTO","Inversión","Un nuevo contrato social y ambiental para la Bogotá del Siglo XXI",57,{"$f":"IF(ISERROR(VLOOKUP(K266,Proposito_programa!$C$2:$E$59,2,FALSE)),\" \",VLOOKUP(K266,Proposito_programa!$C$2:$E$59,2,FALSE))","v":"Gestión pública local"},{"$f":"IF(ISERROR(VLOOKUP(K266,Proposito_programa!$C$2:$E$59,3,FALSE)),\" \",VLOOKUP(K266,Proposito_programa!$C$2:$E$59,3,FALSE))","v":"Propósito 5: Construir Bogotá - Región con gobierno abierto, transparente y ciudadanía consciente"},2105,1,19455951,"ALBERTO RODRIGUEZ GOMEZ","Persona Natural",null,null,null,null,18300000,null,null,0,18300000,0,"2022-09-09","2022-09-14","2022-12-13",3,0,0,null,null,null,null,"En ejecución",0]
["FDLSF-CPS-249-2022",2022,"FDLSF-CD-140-2022","FDLSF-CPS-249-2022","Contratos de prestación de servicios profesionales y de apoyo a la gestión","Contratación directa","Prestación de servicios profesionales y de apoyo a la gestión, o para la ejecución de trabajos artísticos que sólo puedan encomendarse a determinadas personas naturales","PRESTAR SERVICIOS COMO INSTRUCTOR EN PROCESOS DE FORMACIÓN DEPORTIVA Y ACONDICIONAMIENTO FÍSICO DEL ADULTO MAYOR EN LA LOCALIDAD DE SANTA FE","Inversión","Un nuevo contrato social y ambiental para la Bogotá del Siglo XXI",20,{"$f":"IF(ISERROR(VLOOKUP(K267,Proposito_programa!$C$2:$E$59,2,FALSE)),\" \",VLOOKUP(K267,Proposito_programa!$C$2:$E$59,2,FALSE))","v":"Bogotá, referente en cultura, deporte, recreación y actividad física, con parques para el desarrollo y la salud"},{"$f":"IF(ISERROR(VLOOKUP(K267,Proposito_programa!$C$2:$E$59,3,FALSE)),\" \",VLOOKUP(K267,Proposito_programa!$C$2:$E$59,3,FALSE))","v":"Propósito 1: Hacer un nuevo contrato social para incrementar la inclusión social, productiva y política"},2100,1,1032477431,"BRANDON  DAVID HERRERA MARTIN","Persona Natural",null,null,null,null,8880000,null,1,2170667,11050667,8090667,"2022-09-09","2022-09-09","2022-12-30",3,0,22,null,null,null,null,"Terminado",0.73214286522252459]
["FDLSF-CPS-250-2022",2022,"FDLSF-CD-157-2022","FDLSF-CPS-250-2022","Contratos de prestación de servicios profesionales y de apoyo a la gestión","Contratación directa","Prestación de servicios profesionales y de apoyo a la gestión, o para la ejecución de trabajos artísticos que sólo puedan encomendarse a determinadas personas naturales","APOYAR TÉCNICAMENTE LAS DISTINTAS ETAPAS DE LOS PROCESO DE COMPETENCIA DE LAS INSPECCIONES DE POLICÍA DE LA LOCALIDAD DE SANTA FE, SEGÚN REPARTO","Inversión","Un nuevo contrato social y ambiental para la Bogotá del Siglo XXI",57,{"$f":"IF(ISERROR(VLOOKUP(K268,Proposito_programa!$C$2:$E$59,2,FALSE)),\" \",VLOOKUP(K268,Proposito_programa!$C$2:$E$59,2,FALSE))","v":"Gestión pública local"},{"$f":"IF(ISERROR(VLOOKUP(K268,Proposito_programa!$C$2:$E$59,3,FALSE)),\" \",VLOOKUP(K268,Proposito_programa!$C$2:$E$59,3,FALSE))","v":"Propósito 5: Construir Bogotá - Región con gobierno abierto, transparente y ciudadanía consciente"},2105,1,79747514,"FANOR EDILSON CUBILLOS GOMEZ","Persona Natural",null,null,null,null,18300000,null,null,0,18300000,15656667,"2022-09-09","2022-09-14","2022-12-30",3,0,17,null,null,null,null,"Terminado",0.85555557377049185]
["FDLSF-CPS-251-2022",2022,"FDLSF-CD-133-2022","FDLSF-CPS-251-2022","Contratos de prestación de servicios profesionales y de apoyo a la gestión","Contratación directa","Prestación de servicios profesionales y de apoyo a la gestión, o para la ejecución de trabajos artísticos que sólo puedan encomendarse a determinadas personas naturales","APOYAR AL ALCALDE LOCAL EN LA PROMOCIÓN, ACOMPAÑAMIENTO, COORDINACIÓN Y ATENCIÓN DE LAS INSTANCIAS DE COORDINACIÓN INTERINSTITUCIONALES Y LAS INSTANCIAS DE PARTICIPACIÓN LOCALES, ASÍ COMO LOS PROCESOS COMUNITARIOS EN LA LOCALIDAD","Inversión","Un nuevo contrato social y ambiental para la Bogotá del Siglo XXI",57,{"$f":"IF(ISERROR(VLOOKUP(K269,Proposito_programa!$C$2:$E$59,2,FALSE)),\" \",VLOOKUP(K269,Proposito_programa!$C$2:$E$59,2,FALSE))","v":"Gestión pública local"},{"$f":"IF(ISERROR(VLOOKUP(K269,Proposito_programa!$C$2:$E$59,3,FALSE)),\" \",VLOOKUP(K269,Proposito_programa!$C$2:$E$59,3,FALSE))","v":"Propósito 5: Construir Bogotá - Región con gobierno abierto, transparente y ciudadanía consciente"},2105,1,52869352," NANCY DEL PILAR CUBILLOS RODRIGUEZ","Persona Natural",null,null,null,null,14400000,null,null,0,14400000,12480000,"2022-09-09","2022-09-13","2023-01-08",3,0,18,null,null,null,null,"Terminado",0.8666666666666667]
["FDLSF-CPS-252-2022",2022,"FDLSF-CD-159-2022","FDLSF-CPS-252-2022","Contratos de prestación de servicios profesionales y de apoyo a la gestión","Contratación directa","Prestación de servicios profesionales y de apoyo a la gestión, o para la ejecución de trabajos artísticos que sólo puedan encomendarse a determinadas personas naturales","PRESTAR SERVICIOS DE APOYO PARA EL FORTALECIMIENTO A LA GESTIÓN LOCAL DE PROCESOS INSTITUCIONALES Y SOCIALES DE INTERÉS PÚBLICO ARTICULADOS POR EL FONDO DE DESARROLLO LOCAL DE SANTA FE EN COMPAÑÍA DE SECTORES ADMINISTRATIVOS DEL DISTRITO, INSTANCIAS Y ORGANIZACIONES SOCIALES EN LA LOCALIDAD","Inversión","Un nuevo contrato social y ambiental para la Bogotá del Siglo XXI",57,{"$f":"IF(ISERROR(VLOOKUP(K270,Proposito_programa!$C$2:$E$59,2,FALSE)),\" \",VLOOKUP(K270,Proposito_programa!$C$2:$E$59,2,FALSE))","v":"Gestión pública local"},{"$f":"IF(ISERROR(VLOOKUP(K270,Proposito_programa!$C$2:$E$59,3,FALSE)),\" \",VLOOKUP(K270,Proposito_programa!$C$2:$E$59,3,FALSE))","v":"Propósito 5: Construir Bogotá - Región con gobierno abierto, transparente y ciudadanía consciente"},2105,1," 1 0 2 6 2 7 2 8 5 6","LEIDY JULIETH DIAZ BUITRAGO","Persona Natural",null,null,null,null,7050000,null,null,0,7050000,6031666,"2022-09-12","2022-09-14","2022-12-13",3,0,0,null,null,null,null,"Terminado",0.8555554609929078]
["FDLSF-CPS-253-2022",2022,"FDLSF-CD-159-2022","FDLSF-CPS-253-2022","Contratos de prestación de servicios profesionales y de apoyo a la gestión","Contratación directa","Prestación de servicios profesionales y de apoyo a la gestión, o para la ejecución de trabajos artísticos que sólo puedan encomendarse a determinadas personas naturales","PRESTAR SERVICIOS DE APOYO PARA EL FORTALECIMIENTO A LA GESTIÓN LOCAL DE PROCESOS INSTITUCIONALES Y SOCIALES DE INTERÉS PÚBLICO ARTICULADOS POR EL FONDO DE DESARROLLO LOCAL DE SANTA FE EN COMPAÑÍA DE SECTORES ADMINISTRATIVOS DEL DISTRITO, INSTANCIAS Y ORGANIZACIONES SOCIALES EN LA LOCALIDAD","Inversión","Un nuevo contrato social y ambiental para la Bogotá del Siglo XXI",57,{"$f":"IF(ISERROR(VLOOKUP(K271,Proposito_programa!$C$2:$E$59,2,FALSE)),\" \",VLOOKUP(K271,Proposito_programa!$C$2:$E$59,2,FALSE))","v":"Gestión pública local"},{"$f":"IF(ISERROR(VLOOKUP(K271,Proposito_programa!$C$2:$E$59,3,FALSE)),\" \",VLOOKUP(K271,Proposito_programa!$C$2:$E$59,3,FALSE))","v":"Propósito 5: Construir Bogotá - Región con gobierno abierto, transparente y ciudadanía consciente"},2105,1,79287493,"PEDRO PABLO MALAGON GONZALEZ","Persona Natural",null,null,null,null,7050000,null,1,1331667,8381667,6031667,"2022-09-12","2022-09-14","2023-01-04",3,0,17,null,null,null,null,"Terminado",0.71962617937458029]
["FDLSF-CCV-254-2022",2022,"FDLSF-MC-012-2022","FDLSF-CCV-254-2022","Compraventa de bienes muebles","Contratación mínima cuantia","No aplica","COMPRAVENTA CON INSTALACION DE BICI PARQUEADERO EN LA SEDE PRINCIPAL DE LA ALCALDIA LOCAL DE SANTA FE","Inversión","Un nuevo contrato social y ambiental para la Bogotá del Siglo XXI",57,{"$f":"IF(ISERROR(VLOOKUP(K272,Proposito_programa!$C$2:$E$59,2,FALSE)),\" \",VLOOKUP(K272,Proposito_programa!$C$2:$E$59,2,FALSE))","v":"Gestión pública local"},{"$f":"IF(ISERROR(VLOOKUP(K272,Proposito_programa!$C$2:$E$59,3,FALSE)),\" \",VLOOKUP(K272,Proposito_programa!$C$2:$E$59,3,FALSE))","v":"Propósito 5: Construir Bogotá - Región con gobierno abierto, transparente y ciudadanía consciente"},2105,2,"901266854-3","CENTRAL DE PARQUES Y SOLUCIONES URBANAS SAS. CPSU SAS.","Persona Jurídica",null,null,null,null,15007807,null,1,2100000,17107807,0,"2022-09-22","2022-10-03","2022-12-15",1,1,30,null,null,null,null,"Terminado",0]
["FDLSF-CPS-255-2022",2022,"FDLSF-CD-156-2022","FDLSF-CPS-255-2022","Contratos de prestación de servicios profesionales y de apoyo a la gestión","Contratación directa","Prestación de servicios profesionales y de apoyo a la gestión, o para la ejecución de trabajos artísticos que sólo puedan encomendarse a determinadas personas naturales","PRESTAR SUS SERVICIOS PROFESIONALES PARA LA ESTRUCTURACIÓN, VIABILIZACIÓN, EVALUACIÓN Y SEGUIMIENTO DE LOS PROYECTOS DEL PRESUPUESTO DEL FONDO DE DESARROLLO LOCAL DE SANTA FE QUE LE SEAN ASIGNADOS.","Inversión","Un nuevo contrato social y ambiental para la Bogotá del Siglo XXI",57,{"$f":"IF(ISERROR(VLOOKUP(K273,Proposito_programa!$C$2:$E$59,2,FALSE)),\" \",VLOOKUP(K273,Proposito_programa!$C$2:$E$59,2,FALSE))","v":"Gestión pública local"},{"$f":"IF(ISERROR(VLOOKUP(K273,Proposito_programa!$C$2:$E$59,3,FALSE)),\" \",VLOOKUP(K273,Proposito_programa!$C$2:$E$59,3,FALSE))","v":"Propósito 5: Construir Bogotá - Región con gobierno abierto, transparente y ciudadanía consciente"},2105,1,1014227004,"CRISTIAN CAMILO SUA LOPEZ","Persona Natural",null,null,null,null,15900000,null,1,2826667,18726667,13426667,"2022-09-15","2022-09-15","2022-12-31",3,0,16,null,null,null,null,"Terminado",0.71698113711318734]
["FDLSF-CPS-256-2022",2022,"FDLSF-CD-130-2022","FDLSF-CPS-256-2022","Contratos de prestación de servicios profesionales y de apoyo a la gestión","Contratación directa","Prestación de servicios profesionales y de apoyo a la gestión, o para la ejecución de trabajos artísticos que sólo puedan encomendarse a determinadas personas naturales","APOYAR JURÍDICAMENTE LA EJECUCIÓN DE LAS ACCIONES REQUERIDAS PARA LA DEPURACIÓN DE LAS ACTUACIONES ADMINISTRATIVAS QUE CURSAN EN LA ALCALDÍA LOCAL DE SANTA FE","Inversión","Un nuevo contrato social y ambiental para la Bogotá del Siglo XXI",57,{"$f":"IF(ISERROR(VLOOKUP(K274,Proposito_programa!$C$2:$E$59,2,FALSE)),\" \",VLOOKUP(K274,Proposito_programa!$C$2:$E$59,2,FALSE))","v":"Gestión pública local"},{"$f":"IF(ISERROR(VLOOKUP(K274,Proposito_programa!$C$2:$E$59,3,FALSE)),\" \",VLOOKUP(K274,Proposito_programa!$C$2:$E$59,3,FALSE))","v":"Propósito 5: Construir Bogotá - Región con gobierno abierto, transparente y ciudadanía consciente"},2105,1,1010218952,"KEVIN OSWALDO LEIVA QUIMBAYO","Persona Natural",null,null,null,null,14400000,null,null,0,14400000,11520000,"2022-09-15","2022-09-19","2022-12-22",3,0,0,null,null,null,null,"Terminado",0.8]
["FDLSF-CIA-257-2022",2022,"FDLSF-CD-158-2022","FDLSF-CIA-257-2022","Convenios/Contratos interadministrativos","Contratación directa","Contratos interadministrativos","AUNAR ESFUERZOS TÉCNICOS, ADMINISTRATIVOS Y FINANCIEROS, PARA PROMOVER EL EJERCICIO Y LA RESTITUCIÓN DE LA AUTONOMÍA E INDEPENDENCIA DE LAS PERSONAS CON DISCAPACIDAD DE LA LOCALIDAD DE SANTA FE, A TRAVÉS DEL OTORGAMIENTO DE DISPOSITIVOS DE ASISTENCIA PERSONAL (AYUDAS TÉCNICAS), EN EL MARCO DEL PROYECTO 2188\"SANTA FE CON UN SISTEMA DE CUIDADO","Inversión","Un nuevo contrato social y ambiental para la Bogotá del Siglo XXI",6,{"$f":"IF(ISERROR(VLOOKUP(K275,Proposito_programa!$C$2:$E$59,2,FALSE)),\" \",VLOOKUP(K275,Proposito_programa!$C$2:$E$59,2,FALSE))","v":"Sistema Distrital de Cuidado"},{"$f":"IF(ISERROR(VLOOKUP(K275,Proposito_programa!$C$2:$E$59,3,FALSE)),\" \",VLOOKUP(K275,Proposito_programa!$C$2:$E$59,3,FALSE))","v":"Propósito 1: Hacer un nuevo contrato social para incrementar la inclusión social, productiva y política"},2188,1,"900959051-7 ","SUBRED INTEGRADA DE SALUD CENTRO ORIENTE E.S.E","Persona Jurídica",null,null,null,null,446719000,null,null,0,446719000,0,"2022-09-19","2022-10-26","2023-08-25",10,0,0,null,null,null,null,"En ejecución",0]
["FDLSF-CPS-258-2022",2022,"FDLSF-MC-013-2022","FDLSF-CPS-258-2022","Contratos de prestación de servicios profesionales y de apoyo a la gestión","Contratación directa","Prestación de servicios profesionales y de apoyo a la gestión, o para la ejecución de trabajos artísticos que sólo puedan encomendarse a determinadas personas naturales","PRESTAR SERVICIOS PARA REALIZAR TOMA FÍSICA, MEDICIÓN POSTERIOR DE LOS BIENES MUEBLES E INMUEBLES PROPIEDAD DEL FONDO DE DESARROLLO LOCAL DE SANTA FE, Y LOS QUE LLEGARE A SER RESPONSABLE CONFORME AL MARCO NORMATIVO VIGENTE PARA LAS ENTIDADES DE GOBIERNO Y DEMÁS NORMAS VIGENTES","Inversión","Un nuevo contrato social y ambiental para la Bogotá del Siglo XXI",57,{"$f":"IF(ISERROR(VLOOKUP(K276,Proposito_programa!$C$2:$E$59,2,FALSE)),\" \",VLOOKUP(K276,Proposito_programa!$C$2:$E$59,2,FALSE))","v":"Gestión pública local"},{"$f":"IF(ISERROR(VLOOKUP(K276,Proposito_programa!$C$2:$E$59,3,FALSE)),\" \",VLOOKUP(K276,Proposito_programa!$C$2:$E$59,3,FALSE))","v":"Propósito 5: Construir Bogotá - Región con gobierno abierto, transparente y ciudadanía consciente"},2105,1,900078578,"GOODS & SERVICES CONSULTING S.A.S","Persona Natural",null,null,null,null,7841400,null,null,0,7841400,0,"2022-09-22","2022-10-03","2023-01-02",3,0,0,null,null,null,null,"En ejecución",0]
["FDLSF-CPS-259-2022",2022,"FDLSF-CD-138-2022","FDLSF-CPS-259-2022","Contratos de prestación de servicios profesionales y de apoyo a la gestión","Contratación directa","Prestación de servicios profesionales y de apoyo a la gestión, o para la ejecución de trabajos artísticos que sólo puedan encomendarse a determinadas personas naturales","COORDINAR LA ARTICULACIÓN, ASISTENCIA Y ACOMPAÑAMIENTO DE LOS PROCESOS DE PLANEACIÓN LOCAL, PARA LA PROMOCIÓN DE LA PARTICIPACIÓN DE LAS MUJERES Y DE LA EQUIDAD DE GÉNERO, PARA MATERIALIZAR EN LA LOCALIDAD LAS ESTRATEGIAS DE TERRITORIALIZACIÓN Y TRANSVERSALIZACIÓN DE LA POLÍTICA PUBLICA DE MUJERES Y EQUIDAD DE GÉNERO, PPMYEG","Inversión","Un nuevo contrato social y ambiental para la Bogotá del Siglo XXI",57,{"$f":"IF(ISERROR(VLOOKUP(K277,Proposito_programa!$C$2:$E$59,2,FALSE)),\" \",VLOOKUP(K277,Proposito_programa!$C$2:$E$59,2,FALSE))","v":"Gestión pública local"},{"$f":"IF(ISERROR(VLOOKUP(K277,Proposito_programa!$C$2:$E$59,3,FALSE)),\" \",VLOOKUP(K277,Proposito_programa!$C$2:$E$59,3,FALSE))","v":"Propósito 5: Construir Bogotá - Región con gobierno abierto, transparente y ciudadanía consciente"},2105,1,1026270004,"ADRIANA PATRICIA POSADA BELTRAN","Persona Natural",null,null,null,null,15516000,null,null,0,15516000,12068000,"2022-09-19","2022-09-21","2022-12-20",3,0,0,null,null,null,null,"Terminado",0.77777777777777779]
["FDLSF-CPS-260-2022",2022,"FDLSF-CD-131-2022","FDLSF-CPS-260-2022","Contratos de prestación de servicios profesionales y de apoyo a la gestión","Contratación directa","Prestación de servicios profesionales y de apoyo a la gestión, o para la ejecución de trabajos artísticos que sólo puedan encomendarse a determinadas personas naturales","PRESTAR SERVICIO DE APOYO A LA GESTION EN LOS TRÁMITES QUE SE SURTAN EN EL DESPACHO DE LA ALCALDÍA LOCAL DE SANTA FE","Inversión","Un nuevo contrato social y ambiental para la Bogotá del Siglo XXI",57,{"$f":"IF(ISERROR(VLOOKUP(K278,Proposito_programa!$C$2:$E$59,2,FALSE)),\" \",VLOOKUP(K278,Proposito_programa!$C$2:$E$59,2,FALSE))","v":"Gestión pública local"},{"$f":"IF(ISERROR(VLOOKUP(K278,Proposito_programa!$C$2:$E$59,3,FALSE)),\" \",VLOOKUP(K278,Proposito_programa!$C$2:$E$59,3,FALSE))","v":"Propósito 5: Construir Bogotá - Región con gobierno abierto, transparente y ciudadanía consciente"},2105,1,1073159671,"ANGIE CAROLINA GARZON ROMERO","Persona Natural",null,null,null,null,7050000,null,1,2350000,9400000,5561667,"2022-09-18","2022-09-20","2023-01-19",3,1,30,null,null,null,null,"Terminado",{"$f":"IF(ISERROR(AB278/AA278),\"-\",(AB278/AA278))","v":0.59166670212765959}]
["FDLSF-CPS-261-2022",2022,"FDLSF-CD-161-2022","FDLSF-CPS-261-2022","Contratos de prestación de servicios profesionales y de apoyo a la gestión","Contratación directa","Prestación de servicios profesionales y de apoyo a la gestión, o para la ejecución de trabajos artísticos que sólo puedan encomendarse a determinadas personas naturales","PRESTAR LOS SERVICIOS TÉCNICOS EN LOS ASPECTOS RELACIONADOS CON PRODUCTIVIDAD, EMPRENDIMIENTO Y DESARROLLO EMPRESARIAL DE LA LOCALIDAD DE SANTA FE","Inversión","Un nuevo contrato social y ambiental para la Bogotá del Siglo XXI",45,{"$f":"IF(ISERROR(VLOOKUP(K279,Proposito_programa!$C$2:$E$59,2,FALSE)),\" \",VLOOKUP(K279,Proposito_programa!$C$2:$E$59,2,FALSE))","v":"Espacio público más seguro y construido colectivamente"},{"$f":"IF(ISERROR(VLOOKUP(K279,Proposito_programa!$C$2:$E$59,3,FALSE)),\" \",VLOOKUP(K279,Proposito_programa!$C$2:$E$59,3,FALSE))","v":"Propósito 3: Inspirar confianza y legitimidad para vivir sin miedo y ser epicentro de cultura ciudadana, paz y reconciliación"},2130,1,52371623,"JOHANNA LOPEZ SUAREZ","Persona Natural",null,null,null,null,13515000,null,null,0,13515000,8859833,"2022-09-20","2022-09-26","2023-01-06",3,0,0,null,null,null,null,"Terminado",0.6555555308916019]
["FDLSF-CPS-262-2022",2022,"FDLSF-CD-160-2022","FDLSF-CPS-262-2022","Contratos de prestación de servicios profesionales y de apoyo a la gestión","Contratación directa","Prestación de servicios profesionales y de apoyo a la gestión, o para la ejecución de trabajos artísticos que sólo puedan encomendarse a determinadas personas naturales","APOYAR TÉCNICAMENTE LAS DISTINTAS ETAPAS DE LOS PROCESOS DE COMPETENCIA DE LA ALCALDÍA LOCAL PARA LA DEPURACIÓN DE ACTUACIONES ADMINISTRATIVAS","Inversión","Un nuevo contrato social y ambiental para la Bogotá del Siglo XXI",57,{"$f":"IF(ISERROR(VLOOKUP(K280,Proposito_programa!$C$2:$E$59,2,FALSE)),\" \",VLOOKUP(K280,Proposito_programa!$C$2:$E$59,2,FALSE))","v":"Gestión pública local"},{"$f":"IF(ISERROR(VLOOKUP(K280,Proposito_programa!$C$2:$E$59,3,FALSE)),\" \",VLOOKUP(K280,Proposito_programa!$C$2:$E$59,3,FALSE))","v":"Propósito 5: Construir Bogotá - Región con gobierno abierto, transparente y ciudadanía consciente"},2105,1,1013636916,"ANDRES CAMILO VELASQUEZ LEON","Persona Natural",null,null,null,null,18300000,null,null,0,18300000,14436666,"2022-09-19","2022-09-20","2023-01-19",3,1,30,null,null,null,null,"Terminado",0.78888885245901641]
["FDLSF-CPS-263-2022",2022,"FDLSF-CD-162-2022","FDLSF-CPS-263-2022","Contratos de prestación de servicios profesionales y de apoyo a la gestión","Contratación directa","Prestación de servicios profesionales y de apoyo a la gestión, o para la ejecución de trabajos artísticos que sólo puedan encomendarse a determinadas personas naturales","APOYAR ADMINISTRATIVA Y ASISTENCIALMENTE A LAS INSPECCIONES DE POLICÍA DE LA LOCALIDAD","Inversión","Un nuevo contrato social y ambiental para la Bogotá del Siglo XXI",57,{"$f":"IF(ISERROR(VLOOKUP(K281,Proposito_programa!$C$2:$E$59,2,FALSE)),\" \",VLOOKUP(K281,Proposito_programa!$C$2:$E$59,2,FALSE))","v":"Gestión pública local"},{"$f":"IF(ISERROR(VLOOKUP(K281,Proposito_programa!$C$2:$E$59,3,FALSE)),\" \",VLOOKUP(K281,Proposito_programa!$C$2:$E$59,3,FALSE))","v":"Propósito 5: Construir Bogotá - Región con gobierno abierto, transparente y ciudadanía consciente"},2105,1,52882751,"ANA MILENA RUIZ ALVAREZ","Persona Natural",null,null,null,null,7050000,null,null,0,7050000,2898333,"2022-09-23","2022-09-28","2022-12-31",3,0,4,52882751,"ANA MILENA RUIZ ALVAREZ","2022-10-05",null,"Terminado",0.41111106382978724]
["FDLSF-CPS-264-2022",2022,"FDLSF-CD-162-2022","FDLSF-CPS-264-2022","Contratos de prestación de servicios profesionales y de apoyo a la gestión","Contratación directa","Prestación de servicios profesionales y de apoyo a la gestión, o para la ejecución de trabajos artísticos que sólo puedan encomendarse a determinadas personas naturales","APOYAR ADMINISTRATIVA Y ASISTENCIALMENTE A LAS INSPECCIONES DE POLICÍA DE LA LOCALIDAD","Inversión","Un nuevo contrato social y ambiental para la Bogotá del Siglo XXI",57,{"$f":"IF(ISERROR(VLOOKUP(K282,Proposito_programa!$C$2:$E$59,2,FALSE)),\" \",VLOOKUP(K282,Proposito_programa!$C$2:$E$59,2,FALSE))","v":"Gestión pública local"},{"$f":"IF(ISERROR(VLOOKUP(K282,Proposito_programa!$C$2:$E$59,3,FALSE)),\" \",VLOOKUP(K282,Proposito_programa!$C$2:$E$59,3,FALSE))","v":"Propósito 5: Construir Bogotá - Región con gobierno abierto, transparente y ciudadanía consciente"},2105,1,52537370,"ALEJANDRA PATRICIA MONTAÑO IRAGORRI","Persona Natural",null,null,null,null,7050000,null,null,0,{"$f":"+W282+X282+Z282","v":7050000},4935000,"2022-09-23","2022-09-28","2023-01-11",3,0,15,null,null,null,null,"Terminado",0.7]
["FDLSF-CPS-265-2022",2022,"FDLSF-CD-139-2022","FDLSF-CPS-265-2022","Contratos de prestación de servicios profesionales y de apoyo a la gestión","Contratación directa","Prestación de servicios profesionales y de apoyo a la gestión, o para la ejecución de trabajos artísticos que sólo puedan encomendarse a determinadas personas naturales","PRESTAR SERVICIOS COMO TÉCNICO DE DESPACHOS COMISORIOS EN EL ÁREA DE GESTION POLICIVA DE LA ALCALDIA LOCAL DE SANTA FE","Inversión","Un nuevo contrato social y ambiental para la Bogotá del Siglo XXI",57,{"$f":"IF(ISERROR(VLOOKUP(K283,Proposito_programa!$C$2:$E$59,2,FALSE)),\" \",VLOOKUP(K283,Proposito_programa!$C$2:$E$59,2,FALSE))","v":"Gestión pública local"},{"$f":"IF(ISERROR(VLOOKUP(K283,Proposito_programa!$C$2:$E$59,3,FALSE)),\" \",VLOOKUP(K283,Proposito_programa!$C$2:$E$59,3,FALSE))","v":"Propósito 5: Construir Bogotá - Región con gobierno abierto, transparente y ciudadanía consciente"},2105,1,13615877,"RAFAEL ELIAS MURCIA CUBIDES","Persona Natural",null,null,null,null,12960000,null,null,0,12960000,9360000,"2022-09-23","2022-09-26","2022-12-31",3,0,0,null,null,null,null,"Terminado",0.72222222222222221]
["FDLSF-CPS-266-2022",2022,"FDLSF-CD-163-2022","FDLSF-CPS-266-2022","Contratos de prestación de servicios profesionales y de apoyo a la gestión","Contratación directa","Prestación de servicios profesionales y de apoyo a la gestión, o para la ejecución de trabajos artísticos que sólo puedan encomendarse a determinadas personas naturales","APOYAR LA GESTIÓN DOCUMENTAL DE LAALCALDÍA LOCAL EN LA IMPLEMENTACIÓN DE LOS PROCESOS DE CLASIFICACIÓN, ORDENACIÓN, SELECCIÓN NATURAL, FOLIACIÓN, IDENTIFICACIÓN, LEVANTAMIENTO DE INVENTARIOS, ALMACENAMIENTO Y APLICACIÓN DE PROTOCOLOS DE ELIMINACIÓN Y TRANSFERENCIAS DOCUMENTALES","Inversión","Un nuevo contrato social y ambiental para la Bogotá del Siglo XXI",57,{"$f":"IF(ISERROR(VLOOKUP(K284,Proposito_programa!$C$2:$E$59,2,FALSE)),\" \",VLOOKUP(K284,Proposito_programa!$C$2:$E$59,2,FALSE))","v":"Gestión pública local"},{"$f":"IF(ISERROR(VLOOKUP(K284,Proposito_programa!$C$2:$E$59,3,FALSE)),\" \",VLOOKUP(K284,Proposito_programa!$C$2:$E$59,3,FALSE))","v":"Propósito 5: Construir Bogotá - Región con gobierno abierto, transparente y ciudadanía consciente"},2105,1," 52226483","HERMELINDA HERRERA CHACON","Persona Natural",null,null,null,null,7050000,null,null,0,7050000,4856667,"2022-09-26","2022-09-27","2022-12-26",3,0,0,null,null,null,null,"Terminado",0.68888893617021274]
["FDLSF-CPS-267-2022",2022,"FDLSF-CD-142-2022","FDLSF-CPS-267-2022","Contratos de prestación de servicios profesionales y de apoyo a la gestión","Contratación directa","Prestación de servicios profesionales y de apoyo a la gestión, o para la ejecución de trabajos artísticos que sólo puedan encomendarse a determinadas personas naturales","PRESTAR SERVICIOS DE APOYO TÉCNICO AL ÁREA DE GESTIÓN POLICIVA, EN EL DESARROLLO DE LAS ACTIVIDADES PROPIAS DEL ÁREA","Inversión","Un nuevo contrato social y ambiental para la Bogotá del Siglo XXI",57,{"$f":"IF(ISERROR(VLOOKUP(K285,Proposito_programa!$C$2:$E$59,2,FALSE)),\" \",VLOOKUP(K285,Proposito_programa!$C$2:$E$59,2,FALSE))","v":"Gestión pública local"},{"$f":"IF(ISERROR(VLOOKUP(K285,Proposito_programa!$C$2:$E$59,3,FALSE)),\" \",VLOOKUP(K285,Proposito_programa!$C$2:$E$59,3,FALSE))","v":"Propósito 5: Construir Bogotá - Región con gobierno abierto, transparente y ciudadanía consciente"},2105,1,1018418087,"JHON FERNANDO FUENTES ROJAS","Persona Natural",null,null,null,null,12960000,null,null,0,12960000,8352000,"2022-09-29","2022-10-03","2022-12-31",3,0,0,null,null,null,null,"Terminado",0.64444444444444449]
["FDLSF-CPS-268-2022",2022,"FDLSF-CD-164-2022","FDLSF-CPS-268-2022","Contratos de prestación de servicios profesionales y de apoyo a la gestión","Contratación directa","Prestación de servicios profesionales y de apoyo a la gestión, o para la ejecución de trabajos artísticos que sólo puedan encomendarse a determinadas personas naturales","PRESTAR APOYO AL ÁREA GESTIÓN POLICÍVA Y ÁREA DE GESTIÓN DE DESARROLLO LOCAL EN LA CONDUCCIÓN DEL PARQUE AUTOMOTOR DEL FDLSF QUE LE SEA ASIGNADO.","Inversión","Un nuevo contrato social y ambiental para la Bogotá del Siglo XXI",57,{"$f":"IF(ISERROR(VLOOKUP(K286,Proposito_programa!$C$2:$E$59,2,FALSE)),\" \",VLOOKUP(K286,Proposito_programa!$C$2:$E$59,2,FALSE))","v":"Gestión pública local"},{"$f":"IF(ISERROR(VLOOKUP(K286,Proposito_programa!$C$2:$E$59,3,FALSE)),\" \",VLOOKUP(K286,Proposito_programa!$C$2:$E$59,3,FALSE))","v":"Propósito 5: Construir Bogotá - Región con gobierno abierto, transparente y ciudadanía consciente"},2105,1,1032369681,"FRANCISCO FABIER MARTINEZ POVEDA","Persona Natural",null,null,null,null,8100000,null,null,0,8100000,5040000,"2022-10-03","2022-10-05","2022-12-31",3,0,0,null,null,null,null,"Terminado",0.62222222222222223]
["FDLSF-CPS-269-2022",2022,"FDLSF-CD-165-2022","FDLSF-CPS-269-2022","Contratos de prestación de servicios profesionales y de apoyo a la gestión","Contratación directa","Prestación de servicios profesionales y de apoyo a la gestión, o para la ejecución de trabajos artísticos que sólo puedan encomendarse a determinadas personas naturales","PRESTAR SERVICIOS DE APOYO PARA LA GESTIÓN LOCAL Y TERRITORIAL EN LOS TEMAS DE SEGURIDAD Y CONVIVENCIA CIUDADANA","Inversión","Un nuevo contrato social y ambiental para la Bogotá del Siglo XXI",43,{"$f":"IF(ISERROR(VLOOKUP(K287,Proposito_programa!$C$2:$E$59,2,FALSE)),\" \",VLOOKUP(K287,Proposito_programa!$C$2:$E$59,2,FALSE))","v":"Cultura ciudadana para la confianza, la convivencia y la participación desde la vida cotidiana"},{"$f":"IF(ISERROR(VLOOKUP(K287,Proposito_programa!$C$2:$E$59,3,FALSE)),\" \",VLOOKUP(K287,Proposito_programa!$C$2:$E$59,3,FALSE))","v":"Propósito 3: Inspirar confianza y legitimidad para vivir sin miedo y ser epicentro de cultura ciudadana, paz y reconciliación"},2128,1,79992709,"ELKIN RAMIREZ AROCA","Persona Natural",null,null,null,null,7050000,null,null,0,7050000,2898333,"2022-10-14","2022-10-19","2023-01-05",3,0,5,79992709,"ELKIN RAMIREZ AROCA","2022-10-20",null,"Terminado",0.41111106382978724]
["FDLSF-CPS-270-2022",2022,"FDLSF-CD-166-2022","FDLSF-CPS-270-2022","Contratos de prestación de servicios profesionales y de apoyo a la gestión","Contratación directa","Prestación de servicios profesionales y de apoyo a la gestión, o para la ejecución de trabajos artísticos que sólo puedan encomendarse a determinadas personas naturales","APOYAR JURÍDICAMENTE LA EJECUCIÓN DE LAS ACCIONES REQUERIDAS PARA LA DEPURACIÓN DE LAS ACTUACIONES ADMINISTRATIVAS QUE CURSAN EN LA ALCALDÍA LOCAL DE SANTA FE","Inversión","Un nuevo contrato social y ambiental para la Bogotá del Siglo XXI",57,{"$f":"IF(ISERROR(VLOOKUP(K288,Proposito_programa!$C$2:$E$59,2,FALSE)),\" \",VLOOKUP(K288,Proposito_programa!$C$2:$E$59,2,FALSE))","v":"Gestión pública local"},{"$f":"IF(ISERROR(VLOOKUP(K288,Proposito_programa!$C$2:$E$59,3,FALSE)),\" \",VLOOKUP(K288,Proposito_programa!$C$2:$E$59,3,FALSE))","v":"Propósito 5: Construir Bogotá - Región con gobierno abierto, transparente y ciudadanía consciente"},2105,1,1014263010,"KAREN JIMENA BURBANO MORENO","Persona Natural",null,null,null,null,14400000,null,null,0,14400000,6720000,"2022-10-14","2022-10-19","2022-12-31",3,0,0,null,null,null,null,"Terminado",0.46666666666666667]
["FDLSF-CPS-271-2022",2022,"FDLSF-CD-167-2022","FDLSF-CPS-271-2022","Contratos de prestación de servicios profesionales y de apoyo a la gestión","Contratación directa","Prestación de servicios profesionales y de apoyo a la gestión, o para la ejecución de trabajos artísticos que sólo puedan encomendarse a determinadas personas naturales","PRESTAR SERVICIOS COMO INSTRUCTOR EN PROCESOS DE FORMACIÓN DEPORTIVA Y ACONDICIONAMIENTO FÍSICO DEL ADULTO MAYOR EN LA LOCALIDAD DE SANTA FE","Inversión","Un nuevo contrato social y ambiental para la Bogotá del Siglo XXI",20,{"$f":"IF(ISERROR(VLOOKUP(K289,Proposito_programa!$C$2:$E$59,2,FALSE)),\" \",VLOOKUP(K289,Proposito_programa!$C$2:$E$59,2,FALSE))","v":"Bogotá, referente en cultura, deporte, recreación y actividad física, con parques para el desarrollo y la salud"},{"$f":"IF(ISERROR(VLOOKUP(K289,Proposito_programa!$C$2:$E$59,3,FALSE)),\" \",VLOOKUP(K289,Proposito_programa!$C$2:$E$59,3,FALSE))","v":"Propósito 1: Hacer un nuevo contrato social para incrementar la inclusión social, productiva y política"},2100,1,1104867948,"GUSTAVO ENRIQUE CORTES MONTEROSA","Persona Natural",null,null,null,null,8880000,null,null,0,8880000,4144000,"2022-10-14","2022-10-19","2022-12-31",2,0,0,null,null,null,null,"Terminado",0.46666666666666667]
["FDLSF-CPS-272-2022",2022,"FDLSF-CD-168-2022","FDLSF-CPS-272-2022","Contratos de prestación de servicios profesionales y de apoyo a la gestión","Contratación directa","Prestación de servicios profesionales y de apoyo a la gestión, o para la ejecución de trabajos artísticos que sólo puedan encomendarse a determinadas personas naturales","PRESTAR LOS SERVICIOS TÉCNICOS EN LO REFERENTE A LAS ACTIVIDADES ADMINISTRATIVAS, EDUCATIVAS, DE CAMPO Y CAPACITACIÓN EN LOS PROCESOS DE AGRICULTURA URBANA ACORDE A LOS LINEAMIENTOS ESTABLECIDOS PARA TAL FIN, EN EL MARCO DE LAS INICIATIVAS DE PRESUPUESTOS PARTICIPATIVOS EN LA LOCALIDAD DE SANTA FE","Inversión","Un nuevo contrato social y ambiental para la Bogotá del Siglo XXI",24,{"$f":"IF(ISERROR(VLOOKUP(K290,Proposito_programa!$C$2:$E$59,2,FALSE)),\" \",VLOOKUP(K290,Proposito_programa!$C$2:$E$59,2,FALSE))","v":"Bogotá región emprendedora e innovadora"},{"$f":"IF(ISERROR(VLOOKUP(K290,Proposito_programa!$C$2:$E$59,3,FALSE)),\" \",VLOOKUP(K290,Proposito_programa!$C$2:$E$59,3,FALSE))","v":"Propósito 1: Hacer un nuevo contrato social para incrementar la inclusión social, productiva y política"},2123,1,51738233,"PAULINA TERESA VILLAMIL SALCHAR","Persona Natural",null,null,null,null,11700000,null,null,0,11700000,3900000,"2022-10-27","2022-11-01","2023-01-31",3,1,30,null,null,null,null,"Terminado",0.33333333333333331]
["FDLSF-CPS-273-2022",2022,"FDLSF-CD-169-2022","FDLSF-CPS-273-2022","Contratos de prestación de servicios profesionales y de apoyo a la gestión","Contratación directa","Prestación de servicios profesionales y de apoyo a la gestión, o para la ejecución de trabajos artísticos que sólo puedan encomendarse a determinadas personas naturales","APOYAR EN LAS TAREAS OPERATIVAS DE CARÁCTER ARCHIVÍSTICO DESARROLLADAS EN LA ALCALDÍA LOCAL PARA GARANTIZAR LA APLICACIÓN CORRECTA DE LOS PROCEDIMIENTOS TÉCNICOS.","Inversión","Un nuevo contrato social y ambiental para la Bogotá del Siglo XXI",57,{"$f":"IF(ISERROR(VLOOKUP(K291,Proposito_programa!$C$2:$E$59,2,FALSE)),\" \",VLOOKUP(K291,Proposito_programa!$C$2:$E$59,2,FALSE))","v":"Gestión pública local"},{"$f":"IF(ISERROR(VLOOKUP(K291,Proposito_programa!$C$2:$E$59,3,FALSE)),\" \",VLOOKUP(K291,Proposito_programa!$C$2:$E$59,3,FALSE))","v":"Propósito 5: Construir Bogotá - Región con gobierno abierto, transparente y ciudadanía consciente"},2105,1,1010175770,"TEOFILO LEONARDO RAMIREZ HERNANDEZ","Persona Natural",null,null,null,null,10980000,null,null,0,10980000,5124000,"2022-10-14","2022-10-19","2023-01-18",3,0,18,null,null,null,null,"Terminado",0.46666666666666667]
["FDLSF-CPS-274-2022",2022,"FDLSF-MC-015-2022","FDLSF-CPS-274-2022","Contratos de prestación de servicios profesionales y de apoyo a la gestión","Contratación directa","Prestación de servicios profesionales y de apoyo a la gestión, o para la ejecución de trabajos artísticos que sólo puedan encomendarse a determinadas personas naturales","CONTRATAR LA PRESTACIÓN DEL SERVICIO DE INSPECCIÓN GENERAL Y CERTIFICACIÓN DEL ASCENSOR DE PROPIEDAD DEL FONDO DE DESARROLLO LOCAL DE SANTA FE.","Inversión","Un nuevo contrato social y ambiental para la Bogotá del Siglo XXI","No aplica",{"$f":"IF(ISERROR(VLOOKUP(K292,Proposito_programa!$C$2:$E$59,2,FALSE)),\" \",VLOOKUP(K292,Proposito_programa!$C$2:$E$59,2,FALSE))","v":" "},{"$f":"IF(ISERROR(VLOOKUP(K292,Proposito_programa!$C$2:$E$59,3,FALSE)),\" \",VLOOKUP(K292,Proposito_programa!$C$2:$E$59,3,FALSE))","v":" "},5701,1,900476299,"MONTAJES Y PROCESOS MP SAS","Persona Natural",null,null,null,null,380800,null,null,0,380800,380800,"2022-10-27","2022-11-09","2022-12-08",1,0,0,null,null,null,null,"Terminado",1]
["FDLSF-CPS-275-2022",2022,"FDLSF-CD-170-2022","FDLSF-CPS-275-2022","Contratos de prestación de servicios profesionales y de apoyo a la gestión","Contratación directa","Prestación de servicios profesionales y de apoyo a la gestión, o para la ejecución de trabajos artísticos que sólo puedan encomendarse a determinadas personas naturales","PRESTAR LOS SERVICIOS PROFESIONALES AL ÁREA DE GESTIÓN DEL DESARROLLO LOCAL DE LA ALCALDÍA LOCAL DE SANTA FE, PARA APOYAR LA ESTRUCTURACIÓN, EVALUACIÓN Y SEGUIMIENTO DE LOS PROCESOS ASOCIADOS AL PROYECTO 2156 PARTICIPACIÓN Y CULTURA CIUDADANA EN SANTA FE, EN LA META INTERVENIR SEDES DE SALONES COMUNALES - Y PARTICIPACIÓN ASOCIADA A INFRAESTRUCTURA","Inversión","Un nuevo contrato social y ambiental para la Bogotá del Siglo XXI",55,{"$f":"IF(ISERROR(VLOOKUP(K293,Proposito_programa!$C$2:$E$59,2,FALSE)),\" \",VLOOKUP(K293,Proposito_programa!$C$2:$E$59,2,FALSE))","v":"Fortalecimiento de cultura ciudadana y su institucionalidad"},{"$f":"IF(ISERROR(VLOOKUP(K293,Proposito_programa!$C$2:$E$59,3,FALSE)),\" \",VLOOKUP(K293,Proposito_programa!$C$2:$E$59,3,FALSE))","v":"Propósito 5: Construir Bogotá - Región con gobierno abierto, transparente y ciudadanía consciente"},2156,1,80200524,"JAMES WILLIAM CASTILLO","Persona Natural",null,null,null,null,14400000,null,null,0,14400000,5440000,"2022-10-26","2022-10-27","2023-01-26",3,0,26,null,null,null,null,"Terminado",0.37777777777777777]
["FDLSF-CPS-276-2022",2022,"FDLSF-LP-003-2022","FDLSF-CPS-276-2022","Contratos de prestación de servicios profesionales y de apoyo a la gestión","Contratación directa","Prestación de servicios profesionales y de apoyo a la gestión, o para la ejecución de trabajos artísticos que sólo puedan encomendarse a determinadas personas naturales","CONTRATAR LOS SERVICIOS PARA LLEVAR A CABO PROCESOS DE FORMACIÓN QUE PERMITAN FORTALECER LAS MIPYMES Y/O EMPRENDIMIENTOS, GENERANDO SOLUCIONES PRODUCTIVAS, TECNOLÓGICAS, CIENTÍFICAS, AMBIENTALES Y APOYANDO LAS UNIDADES PRODUCTIVAS MEDIANTE LA ENTREGA DE CAPITALIZACIONES PARA LA GENERACIÓN DE NUEVAS FUENTES DE INGRESO EN LA LOCALIDAD DE SANTA FE","Inversión","Un nuevo contrato social y ambiental para la Bogotá del Siglo XXI",6,{"$f":"IF(ISERROR(VLOOKUP(K294,Proposito_programa!$C$2:$E$59,2,FALSE)),\" \",VLOOKUP(K294,Proposito_programa!$C$2:$E$59,2,FALSE))","v":"Sistema Distrital de Cuidado"},{"$f":"IF(ISERROR(VLOOKUP(K294,Proposito_programa!$C$2:$E$59,3,FALSE)),\" \",VLOOKUP(K294,Proposito_programa!$C$2:$E$59,3,FALSE))","v":"Propósito 1: Hacer un nuevo contrato social para incrementar la inclusión social, productiva y política"},2188,1,900657897,"BD GUIDANCE SAS BIC","Persona Natural",null,null,null,null,1023912200,null,null,0,1023912200,0,"2022-10-26","2022-11-15","2023-07-14",8,0,0,null,null,null,null,"En ejecución",0]
["FDLSF-CPS-277-2022",2022,"FDLSF-CD-171-2022","FDLSF-CPS-277-2022","Contratos de prestación de servicios profesionales y de apoyo a la gestión","Contratación directa","Prestación de servicios profesionales y de apoyo a la gestión, o para la ejecución de trabajos artísticos que sólo puedan encomendarse a determinadas personas naturales","PRESTAR LOS SERVICIOS PROFESIONALES COMO ADMINISTRADOR DE RED BRINDANDO ASISTENCIA Y SOPORTE TÉCNICO DEL SOFTWARE Y HARDWARE DE LOS EQUIPOS Y PROGRAMAS QUE MANEJA LA ENTIDAD, ASÍ COMO A LOS USUARIOS QUE DESARROLLEN SUS ACTIVIDADES EN LA ALCALDÍA LOCAL DE SANTAFE","Inversión","Un nuevo contrato social y ambiental para la Bogotá del Siglo XXI",57,{"$f":"IF(ISERROR(VLOOKUP(K295,Proposito_programa!$C$2:$E$59,2,FALSE)),\" \",VLOOKUP(K295,Proposito_programa!$C$2:$E$59,2,FALSE))","v":"Gestión pública local"},{"$f":"IF(ISERROR(VLOOKUP(K295,Proposito_programa!$C$2:$E$59,3,FALSE)),\" \",VLOOKUP(K295,Proposito_programa!$C$2:$E$59,3,FALSE))","v":"Propósito 5: Construir Bogotá - Región con gobierno abierto, transparente y ciudadanía consciente"},2105,1,79641414,"ARMANDO DIAZ GIL","Persona Natural",null,null,null,null,10600000,null,null,0,10600000,5830000,"2022-10-27","2022-10-28","2022-12-27",2,0,0,null,null,null,null,"Terminado",0.55000000000000004]
["FDLSF-CPS-278-2022",2022,"FDLSF-CD-172-2022","FDLSF-CPS-278-2022","Contratos de prestación de servicios profesionales y de apoyo a la gestión","Contratación directa","Prestación de servicios profesionales y de apoyo a la gestión, o para la ejecución de trabajos artísticos que sólo puedan encomendarse a determinadas personas naturales","APOYAR LA GESTIÓN DOCUMENTAL DE LA ALCALDÍA LOCAL EN LA IMPLEMENTACIÓN DE LOS PROCESOS DE CLASIFICACIÓN, ORDENACIÓN, SELECCIÓN NATURAL, FOLIACIÓN, IDENTIFICACIÓN, LEVANTAMIENTO DE INVENTARIOS, ALMACENAMIENTO Y APLICACIÓN DE PROTOCOLOS DE ELIMINACIÓN Y TRANSFERENCIAS DOCUMENTALE","Inversión","Un nuevo contrato social y ambiental para la Bogotá del Siglo XXI",57,{"$f":"IF(ISERROR(VLOOKUP(K296,Proposito_programa!$C$2:$E$59,2,FALSE)),\" \",VLOOKUP(K296,Proposito_programa!$C$2:$E$59,2,FALSE))","v":"Gestión pública local"},{"$f":"IF(ISERROR(VLOOKUP(K296,Proposito_programa!$C$2:$E$59,3,FALSE)),\" \",VLOOKUP(K296,Proposito_programa!$C$2:$E$59,3,FALSE))","v":"Propósito 5: Construir Bogotá - Región con gobierno abierto, transparente y ciudadanía consciente"},2105,1," 79745860","WILSON JAIR GONZALEZ BELTRAN","Persona Natural",null,null,null,null,4700000,null,null,0,4700000,1096666,"2022-10-31","2022-11-17","2023-01-16",2,0,16,null,null,null,null,"Terminado",0.23333319148936171]
["FDLSF-CIN-279-2022",2022,"FDLSF-CM-003-2022","FDLSF-CIN-279-2022","Interventoría","Concurso de méritos","No aplica","INTERVENTORÍA TÉCNICA, ADMINISTRATIVA, FINANCIERA, JURÍDICA, AMBIENTAL Y SOCIAL AL CONTRATO DE OBRA PUBLICA RESULTANTE DEL PROCESO DE LICITACION PUBLICA CUYO OBJETO ES: APROPIACION Y/O AJUSTES A ESTUDIOS, DISEÑOS Y CONSTRUCCIÓN DEL INMUEBLE UBICADO EN LA DIRECCION CALLE 1d No. 759 BARRIO LAS CRUCES, DE LA LOCALIDAD DE SANTA FE","Inversión","Un nuevo contrato social y ambiental para la Bogotá del Siglo XXI",55,{"$f":"IF(ISERROR(VLOOKUP(K297,Proposito_programa!$C$2:$E$59,2,FALSE)),\" \",VLOOKUP(K297,Proposito_programa!$C$2:$E$59,2,FALSE))","v":"Fortalecimiento de cultura ciudadana y su institucionalidad"},{"$f":"IF(ISERROR(VLOOKUP(K297,Proposito_programa!$C$2:$E$59,3,FALSE)),\" \",VLOOKUP(K297,Proposito_programa!$C$2:$E$59,3,FALSE))","v":"Propósito 5: Construir Bogotá - Región con gobierno abierto, transparente y ciudadanía consciente"},2156,4,901649173,"CONSORCIO EYD SANTA FE","Consorcio","830010893","GEOCING S.A.S.",0.6,null,295327065,null,null,0,295327065,0,"2022-11-08","00:00:00","SIN FECHA DE TERMINACION",8,0,0,null,null,null,null,"Terminado",0]
["FDLSF-CIN-279-2022",2022,"FDLSF-CM-003-2022","FDLSF-CIN-279-2022","Interventoría","Concurso de méritos","No aplica","INTERVENTORÍA TÉCNICA, ADMINISTRATIVA, FINANCIERA, JURÍDICA, AMBIENTAL Y SOCIAL AL CONTRATO DE OBRA PUBLICA RESULTANTE DEL PROCESO DE LICITACION PUBLICA CUYO OBJETO ES: APROPIACION Y/O AJUSTES A ESTUDIOS, DISEÑOS Y CONSTRUCCIÓN DEL INMUEBLE UBICADO EN LA DIRECCION CALLE 1d No. 759 BARRIO LAS CRUCES, DE LA LOCALIDAD DE SANTA FE","Inversión","Un nuevo contrato social y ambiental para la Bogotá del Siglo XXI",55,{"$f":"IF(ISERROR(VLOOKUP(K298,Proposito_programa!$C$2:$E$59,2,FALSE)),\" \",VLOOKUP(K298,Proposito_programa!$C$2:$E$59,2,FALSE))","v":"Fortalecimiento de cultura ciudadana y su institucionalidad"},{"$f":"IF(ISERROR(VLOOKUP(K298,Proposito_programa!$C$2:$E$59,3,FALSE)),\" \",VLOOKUP(K298,Proposito_programa!$C$2:$E$59,3,FALSE))","v":"Propósito 5: Construir Bogotá - Región con gobierno abierto, transparente y ciudadanía consciente"},2156,null,901649173,"CONSORCIO EYD SANTA FE","Consorcio","900066500","TAYFER DE COLOMBIA LTDA",0.4,null,0,null,null,0,0,0,"2022-11-08","00:00:00","SIN FECHA DE TERMINACION",8,0,0,null,null,null,null,"Terminado","-"]
["FDLSF-CPS-280-2022",2022,"FDLSF-CD-174-2022","FDLSF-CPS-280-2022","Contratos de prestación de servicios profesionales y de apoyo a la gestión","Contratación directa","Prestación de servicios profesionales y de apoyo a la gestión, o para la ejecución de trabajos artísticos que sólo puedan encomendarse a determinadas personas naturales","PRESTAR SERVICIOS DE APOYO PARA LA GESTIÓN LOCAL Y TERRITORIAL EN LOS TEMAS DE SEGURIDAD Y CONVIVENCIA CIUDADANA","Inversión","Un nuevo contrato social y ambiental para la Bogotá del Siglo XXI",43,{"$f":"IF(ISERROR(VLOOKUP(K299,Proposito_programa!$C$2:$E$59,2,FALSE)),\" \",VLOOKUP(K299,Proposito_programa!$C$2:$E$59,2,FALSE))","v":"Cultura ciudadana para la confianza, la convivencia y la participación desde la vida cotidiana"},{"$f":"IF(ISERROR(VLOOKUP(K299,Proposito_programa!$C$2:$E$59,3,FALSE)),\" \",VLOOKUP(K299,Proposito_programa!$C$2:$E$59,3,FALSE))","v":"Propósito 3: Inspirar confianza y legitimidad para vivir sin miedo y ser epicentro de cultura ciudadana, paz y reconciliación"},2128,1,16843030,"ARIULFO CARABALI SANDOVAL","Persona Natural",null,null,null,null,4700000,null,null,0,4700000,1723333,"2022-11-08","2022-11-10","2023-01-09",2,0,9,null,null,null,null,"Terminado",0.36666659574468086]
["FDLSF-CPS-281-2022",2022,"FDLSF-CD-174-2022","FDLSF-CPS-281-2022","Contratos de prestación de servicios profesionales y de apoyo a la gestión","Contratación directa","Prestación de servicios profesionales y de apoyo a la gestión, o para la ejecución de trabajos artísticos que sólo puedan encomendarse a determinadas personas naturales","PRESTAR SERVICIOS DE APOYO PARA LA GESTIÓN LOCAL Y TERRITORIAL EN LOS TEMAS DE SEGURIDAD Y CONVIVENCIA CIUDADANA","Inversión","Un nuevo contrato social y ambiental para la Bogotá del Siglo XXI",43,{"$f":"IF(ISERROR(VLOOKUP(K300,Proposito_programa!$C$2:$E$59,2,FALSE)),\" \",VLOOKUP(K300,Proposito_programa!$C$2:$E$59,2,FALSE))","v":"Cultura ciudadana para la confianza, la convivencia y la participación desde la vida cotidiana"},{"$f":"IF(ISERROR(VLOOKUP(K300,Proposito_programa!$C$2:$E$59,3,FALSE)),\" \",VLOOKUP(K300,Proposito_programa!$C$2:$E$59,3,FALSE))","v":"Propósito 3: Inspirar confianza y legitimidad para vivir sin miedo y ser epicentro de cultura ciudadana, paz y reconciliación"},2128,1," 80049577","BAYARDO ANDRES SOLANO FRANCO","Persona Natural",null,null,null,null,4700000,null,null,0,4700000,1645000,"2022-11-09","2022-11-10","2023-01-09",2,0,9,null,null,null,null,"Terminado",0.35]
["FDLSF-CPS-282-2022",2022,"FDLSF-CD-174-2022","FDLSF-CPS-282-2022","Contratos de prestación de servicios profesionales y de apoyo a la gestión","Contratación directa","Prestación de servicios profesionales y de apoyo a la gestión, o para la ejecución de trabajos artísticos que sólo puedan encomendarse a determinadas personas naturales","PRESTAR SERVICIOS DE APOYO PARA LA GESTIÓN LOCAL Y TERRITORIAL EN LOS TEMAS DE SEGURIDAD Y CONVIVENCIA CIUDADANA","Inversión","Un nuevo contrato social y ambiental para la Bogotá del Siglo XXI",43,{"$f":"IF(ISERROR(VLOOKUP(K301,Proposito_programa!$C$2:$E$59,2,FALSE)),\" \",VLOOKUP(K301,Proposito_programa!$C$2:$E$59,2,FALSE))","v":"Cultura ciudadana para la confianza, la convivencia y la participación desde la vida cotidiana"},{"$f":"IF(ISERROR(VLOOKUP(K301,Proposito_programa!$C$2:$E$59,3,FALSE)),\" \",VLOOKUP(K301,Proposito_programa!$C$2:$E$59,3,FALSE))","v":"Propósito 3: Inspirar confianza y legitimidad para vivir sin miedo y ser epicentro de cultura ciudadana, paz y reconciliación"},2128,1,1030569769,"CRISTHIAN EMILIO ROJAS GARZON","Persona Natural",null,null,null,null,4700000,null,1,705000,5405000,1645000,"2022-11-09","2022-11-10","2023-01-09",2,0,9,null,null,null,null,"Terminado",0.30434782608695654]
["FDLSF-CPS-283-2022",2022,"FDLSF-CD-174-2022","FDLSF-CPS-283-2022","Contratos de prestación de servicios profesionales y de apoyo a la gestión","Contratación directa","Prestación de servicios profesionales y de apoyo a la gestión, o para la ejecución de trabajos artísticos que sólo puedan encomendarse a determinadas personas naturales","PRESTAR SERVICIOS DE APOYO PARA LA GESTIÓN LOCAL Y TERRITORIAL EN LOS TEMAS DE SEGURIDAD Y CONVIVENCIA CIUDADANA","Inversión","Un nuevo contrato social y ambiental para la Bogotá del Siglo XXI",43,{"$f":"IF(ISERROR(VLOOKUP(K302,Proposito_programa!$C$2:$E$59,2,FALSE)),\" \",VLOOKUP(K302,Proposito_programa!$C$2:$E$59,2,FALSE))","v":"Cultura ciudadana para la confianza, la convivencia y la participación desde la vida cotidiana"},{"$f":"IF(ISERROR(VLOOKUP(K302,Proposito_programa!$C$2:$E$59,3,FALSE)),\" \",VLOOKUP(K302,Proposito_programa!$C$2:$E$59,3,FALSE))","v":"Propósito 3: Inspirar confianza y legitimidad para vivir sin miedo y ser epicentro de cultura ciudadana, paz y reconciliación"},2128,1," 94368341","EDILSON ECHEVERRI BUSTOS","Persona Natural",null,null,null,null,4700000,null,1,705000,5405000,1645000,"2022-11-09","2022-11-10","2023-01-09",2,0,9,null,null,null,null,"Terminado",0.30434782608695654]
["FDLSF-CPS-284-2022",2022,"FDLSF-CD-174-2022","FDLSF-CPS-284-2022","Contratos de prestación de servicios profesionales y de apoyo a la gestión","Contratación directa","Prestación de servicios profesionales y de apoyo a la gestión, o para la ejecución de trabajos artísticos que sólo puedan encomendarse a determinadas personas naturales","PRESTAR SERVICIOS DE APOYO PARA LA GESTIÓN LOCAL Y TERRITORIAL EN LOS TEMAS DE SEGURIDAD Y CONVIVENCIA CIUDADANA","Inversión","Un nuevo contrato social y ambiental para la Bogotá del Siglo XXI",43,{"$f":"IF(ISERROR(VLOOKUP(K303,Proposito_programa!$C$2:$E$59,2,FALSE)),\" \",VLOOKUP(K303,Proposito_programa!$C$2:$E$59,2,FALSE))","v":"Cultura ciudadana para la confianza, la convivencia y la participación desde la vida cotidiana"},{"$f":"IF(ISERROR(VLOOKUP(K303,Proposito_programa!$C$2:$E$59,3,FALSE)),\" \",VLOOKUP(K303,Proposito_programa!$C$2:$E$59,3,FALSE))","v":"Propósito 3: Inspirar confianza y legitimidad para vivir sin miedo y ser epicentro de cultura ciudadana, paz y reconciliación"},2128,1,80239010,"EDWIN ANDRES BELTRAN TIBOCHA","Persona Natural",null,null,null,null,4700000,null,1,705000,5405000,1645000,"2022-11-09","2022-11-10","2023-01-09",2,0,9,null,null,null,null,"Terminado",0.30434782608695654]
["FDLSF-CPS-285-2022",2022,"FDLSF-CD-173-2022","FDLSF-CPS-285-2022","Contratos de prestación de servicios profesionales y de apoyo a la gestión","Contratación directa","Prestación de servicios profesionales y de apoyo a la gestión, o para la ejecución de trabajos artísticos que sólo puedan encomendarse a determinadas personas naturales","PRESTAR SERVICIOS COMO APOYO A LA GESTION EN LOS TRÁMITES QUE SE SURTAN EN LA ALCALDÍA LOCAL DE SANTA FE RELACIONADOS CON CONTRATACIÓN","Inversión","Un nuevo contrato social y ambiental para la Bogotá del Siglo XXI",57,{"$f":"IF(ISERROR(VLOOKUP(K304,Proposito_programa!$C$2:$E$59,2,FALSE)),\" \",VLOOKUP(K304,Proposito_programa!$C$2:$E$59,2,FALSE))","v":"Gestión pública local"},{"$f":"IF(ISERROR(VLOOKUP(K304,Proposito_programa!$C$2:$E$59,3,FALSE)),\" \",VLOOKUP(K304,Proposito_programa!$C$2:$E$59,3,FALSE))","v":"Propósito 5: Construir Bogotá - Región con gobierno abierto, transparente y ciudadanía consciente"},2105,1,1026304464,"TOMAS BARRERO RAMIREZ","Persona Natural",null,null,null,null,2822000,null,null,0,2822000,705500,"2022-11-10","2022-11-16","2022-12-31",2,0,0,null,null,null,null,"Terminado",0.25]
["FDLSF-CPS-286-2022",2022,"FDLSF-SAMC-004-2022","FDLSF-CPS-286-2022","Contratos de prestación de servicios profesionales y de apoyo a la gestión","Contratación directa","Prestación de servicios profesionales y de apoyo a la gestión, o para la ejecución de trabajos artísticos que sólo puedan encomendarse a determinadas personas naturales","PRESTAR LOS SERVICIOS PARA EL MANTENIMIENTO Y SOSTENIBILIDAD DEL ARBOLADO JOVEN Y ATENCIÓN DE ÁRBOLES EN RIESGO EN LA ZONA URBANA Y RURAL DE LA LOCALIDAD DE SANTA FE","Inversión","Un nuevo contrato social y ambiental para la Bogotá del Siglo XXI",33,{"$f":"IF(ISERROR(VLOOKUP(K305,Proposito_programa!$C$2:$E$59,2,FALSE)),\" \",VLOOKUP(K305,Proposito_programa!$C$2:$E$59,2,FALSE))","v":"Más árboles y más y mejor espacio público"},{"$f":"IF(ISERROR(VLOOKUP(K305,Proposito_programa!$C$2:$E$59,3,FALSE)),\" \",VLOOKUP(K305,Proposito_programa!$C$2:$E$59,3,FALSE))","v":"Propósito 2 : Cambiar Nuestros Hábitos de Vida para Reverdecer a Bogotá y Adaptarnos y Mitigar la Crisis Climática"},2138,1,9002455781,"CONSTRUCTORA E INMOBILIARIA SANTA MARTA LTDA / CISMLTDA","Persona Natural",null,null,null,null,240000000,null,null,0,240000000,0,"2022-11-08","00:00:00","SIN FECHA DE TERMINACION",9,0,0,null,null,null,null,"En ejecución",0]
["FDLSF-CPS-287-2022",2022,"FDLSF-CD-177-2022","FDLSF-CPS-287-2022","Contratos de prestación de servicios profesionales y de apoyo a la gestión","Contratación directa","Prestación de servicios profesionales y de apoyo a la gestión, o para la ejecución de trabajos artísticos que sólo puedan encomendarse a determinadas personas naturales","PRESTAR SERVICIO TECNICOS PARA LA OPERACIÒN DEL PUNTO VIVE DIGITAL DE LA LOCALIDAD DE SANTA FE.","Inversión","Un nuevo contrato social y ambiental para la Bogotá del Siglo XXI",57,{"$f":"IF(ISERROR(VLOOKUP(K306,Proposito_programa!$C$2:$E$59,2,FALSE)),\" \",VLOOKUP(K306,Proposito_programa!$C$2:$E$59,2,FALSE))","v":"Gestión pública local"},{"$f":"IF(ISERROR(VLOOKUP(K306,Proposito_programa!$C$2:$E$59,3,FALSE)),\" \",VLOOKUP(K306,Proposito_programa!$C$2:$E$59,3,FALSE))","v":"Propósito 5: Construir Bogotá - Región con gobierno abierto, transparente y ciudadanía consciente"},2105,1,1032358324,"SEBASTIAN HERRERA SERRATO","Persona Natural",null,null,null,null,5920000,null,null,0,5920000,0,"2022-11-16","2022-12-01","2022-12-31",2,0,0,null,null,null,null,"En ejecución",0]
["FDLSF-COP-288-2022",2022,"FDLSF-LP-004-2022","FDLSF-COP-288-2022","Obra pública","Licitación pública","No aplica","CONTRATAR A MONTO AGOTABLE, EL DIAGNOSTICO Y LAS OBRAS NECESARIAS PARA LA ADECUACIÓN, MANTENIMIENTO Y/O MEJORAMIENTO DE LOS PARQUES VECINALES Y DE BOLSILLO DE LA LOCALIDAD DE SANTA FE","Inversión","Un nuevo contrato social y ambiental para la Bogotá del Siglo XXI",33,{"$f":"IF(ISERROR(VLOOKUP(K307,Proposito_programa!$C$2:$E$59,2,FALSE)),\" \",VLOOKUP(K307,Proposito_programa!$C$2:$E$59,2,FALSE))","v":"Más árboles y más y mejor espacio público"},{"$f":"IF(ISERROR(VLOOKUP(K307,Proposito_programa!$C$2:$E$59,3,FALSE)),\" \",VLOOKUP(K307,Proposito_programa!$C$2:$E$59,3,FALSE))","v":"Propósito 2 : Cambiar Nuestros Hábitos de Vida para Reverdecer a Bogotá y Adaptarnos y Mitigar la Crisis Climática"},2138,20,901649173,"CONSORCIO SANTA FE 2022","Consorcio","79453948","JOHN WILLIAM CASALLAS JURADO",0.2,null,475538731,null,null,0,475538731,0,"00:00:00","00:00:00","SIN FECHA DE TERMINACION",0,0,0,null,null,null,null,"En ejecución",0]
["FDLSF-COP-288-2022",2022,"FDLSF-LP-004-2022","FDLSF-COP-288-2022","Obra pública","Licitación pública","No aplica","CONTRATAR A MONTO AGOTABLE, EL DIAGNOSTICO Y LAS OBRAS NECESARIAS PARA LA ADECUACIÓN, MANTENIMIENTO Y/O MEJORAMIENTO DE LOS PARQUES VECINALES Y DE BOLSILLO DE LA LOCALIDAD DE SANTA FE","Inversión","Un nuevo contrato social y ambiental para la Bogotá del Siglo XXI",33,{"$f":"IF(ISERROR(VLOOKUP(K308,Proposito_programa!$C$2:$E$59,2,FALSE)),\" \",VLOOKUP(K308,Proposito_programa!$C$2:$E$59,2,FALSE))","v":"Más árboles y más y mejor espacio público"},{"$f":"IF(ISERROR(VLOOKUP(K308,Proposito_programa!$C$2:$E$59,3,FALSE)),\" \",VLOOKUP(K308,Proposito_programa!$C$2:$E$59,3,FALSE))","v":"Propósito 2 : Cambiar Nuestros Hábitos de Vida para Reverdecer a Bogotá y Adaptarnos y Mitigar la Crisis Climática"},2138,20,901649173,"CONSORCIO SANTA FE 2022","Consorcio","900961137","PROCIVIN S.A.S",0.8,null,0,null,null,0,0,0,"00:00:00","00:00:00","SIN FECHA DE TERMINACION",0,0,0,null,null,null,null,"Terminado","-"]
["FDLSF-CPS-289-2022",2022,"FDLSF-LP-005-2022","FDLSF-CPS-289-2022","Contratos de prestación de servicios","Licitación pública","No aplica","REALIZAR A MONTO AGOTABLE, LAS OBRAS Y ACTIVIDADES PARA LA CONSERVACIÓN DE LA MALLA VIAL LOCAL Y SU ESPACIO PÚBLICO ASOCIADO, DE LA LOCALIDAD DE SANTA FE EN BOGOTA D.C","Inversión","Un nuevo contrato social y ambiental para la Bogotá del Siglo XXI",49,{"$f":"IF(ISERROR(VLOOKUP(K309,Proposito_programa!$C$2:$E$59,2,FALSE)),\" \",VLOOKUP(K309,Proposito_programa!$C$2:$E$59,2,FALSE))","v":"Movilidad segura, sostenible y accesible"},{"$f":"IF(ISERROR(VLOOKUP(K309,Proposito_programa!$C$2:$E$59,3,FALSE)),\" \",VLOOKUP(K309,Proposito_programa!$C$2:$E$59,3,FALSE))","v":"Propósito 4: Hacer de Bogotá Región un modelo de movilidad multimodal, incluyente y sostenible"},2145,5,900114572,"INTERAMBIENTE INGENIERIA SAS","Persona Jurídica",null,null,null,null,3216362901,null,null,0,3216362901,0,"2022-11-17","00:00:00","SIN FECHA DE TERMINACION",7,0,0,null,null,null,null,"En ejecución",0]
["FDLSF-CPS-290-2022",2022,"FDLSF-SAMC-005-2022","FDLSF-CPS-290-2022","Contratos de prestación de servicios","Selección abreviada","No aplica","PRESTAR SERVICIOS INTEGRALES PARA REALIZAR ACTIVIDADES VINCULANTES EN EL DESA RROLLO DE CAPACIDADES QUE FOMENTEN LA CONSTRUCCIÓN DE MEMORIA, PAZ Y RECONCI LIACIÓN A LA POBLACIÓN VÍCTIMA DE LA LOCALIDAD DE SANTA FE, EN EL MARCO DEL PRO YECTO 2187, SANTA FE TERRITORIO DE PAZ Y ATENCIÓN INTEGRAL A LAS VÍCTIMAS DEL CON FLICTO ARMADO","Inversión","Un nuevo contrato social y ambiental para la Bogotá del Siglo XXI",39,{"$f":"IF(ISERROR(VLOOKUP(K310,Proposito_programa!$C$2:$E$59,2,FALSE)),\" \",VLOOKUP(K310,Proposito_programa!$C$2:$E$59,2,FALSE))","v":"Bogotá territorio de paz y atención integral a las víctimas del conflicto armado"},{"$f":"IF(ISERROR(VLOOKUP(K310,Proposito_programa!$C$2:$E$59,3,FALSE)),\" \",VLOOKUP(K310,Proposito_programa!$C$2:$E$59,3,FALSE))","v":"Propósito 3: Inspirar confianza y legitimidad para vivir sin miedo y ser epicentro de cultura ciudadana, paz y reconciliación"},2187,7,900360948,"CORPORACIÓN COLECTIVO DIGERATI","Persona Jurídica",null,null,null,null,116853029,null,null,0,116853029,0,"2022-11-09","00:00:00","SIN FECHA DE TERMINACION",3,0,0,null,null,null,null,"En ejecución",0]
["FDLSF-CPS-291-2022",2022,"FDLSF-CD-176-2022","FDLSF-CPS-291-2022","Contratos de prestación de servicios profesionales y de apoyo a la gestión","Contratación directa","Prestación de servicios profesionales y de apoyo a la gestión, o para la ejecución de trabajos artísticos que sólo puedan encomendarse a determinadas personas naturales","PRESTAR SERVICIOS DE APOYO PARA EL FORTALECIMIENTO A LA GESTIÓN LOCAL DE PROCESOS INSTITUCIONALES Y SOCIALES DE INTERÉS PÚBLICO ARTICULADOS POR EL FONDO DE DESARROLLO LOCAL DE SANTA FE EN COMPAÑÍA DE SECTORES ADMINISTRATIVOS DEL DISTRITO, INSTANCIAS Y ORGANIZACIONES SOCIALES EN LA LOCALIDAD","Inversión","Un nuevo contrato social y ambiental para la Bogotá del Siglo XXI",57,{"$f":"IF(ISERROR(VLOOKUP(K311,Proposito_programa!$C$2:$E$59,2,FALSE)),\" \",VLOOKUP(K311,Proposito_programa!$C$2:$E$59,2,FALSE))","v":"Gestión pública local"},{"$f":"IF(ISERROR(VLOOKUP(K311,Proposito_programa!$C$2:$E$59,3,FALSE)),\" \",VLOOKUP(K311,Proposito_programa!$C$2:$E$59,3,FALSE))","v":"Propósito 5: Construir Bogotá - Región con gobierno abierto, transparente y ciudadanía consciente"},2105,1,1000580349,"MARIA FERNANDA RODRIGUEZ RODRIGUEZ","Persona Natural",null,null,null,null,4700000,null,null,0,4700000,1175000,"2022-11-10","2022-11-16","2022-12-31",2,0,0,null,null,null,null,"Terminado",0.25]
["FDLSF-CPS-292-2022",2022,"FDLSF-CD-174-2022","FDLSF-CPS-292-2022","Contratos de prestación de servicios profesionales y de apoyo a la gestión","Contratación directa","Prestación de servicios profesionales y de apoyo a la gestión, o para la ejecución de trabajos artísticos que sólo puedan encomendarse a determinadas personas naturales","PRESTAR SERVICIOS DE APOYO PARA LA GESTIÓN LOCAL Y TERRITORIAL EN LOS TEMAS DE SEGURIDAD Y CONVIVENCIA CIUDADANA.","Inversión","Un nuevo contrato social y ambiental para la Bogotá del Siglo XXI",43,{"$f":"IF(ISERROR(VLOOKUP(K312,Proposito_programa!$C$2:$E$59,2,FALSE)),\" \",VLOOKUP(K312,Proposito_programa!$C$2:$E$59,2,FALSE))","v":"Cultura ciudadana para la confianza, la convivencia y la participación desde la vida cotidiana"},{"$f":"IF(ISERROR(VLOOKUP(K312,Proposito_programa!$C$2:$E$59,3,FALSE)),\" \",VLOOKUP(K312,Proposito_programa!$C$2:$E$59,3,FALSE))","v":"Propósito 3: Inspirar confianza y legitimidad para vivir sin miedo y ser epicentro de cultura ciudadana, paz y reconciliación"},2128,1,79888324,"MARCO FIDEL NIVIA MARTINEZ","Persona Natural",null,null,null,null,4700000,null,null,0,4700000,0,"2022-11-10","2022-11-30","2023-01-29",2,0,29,null,null,null,null,"En ejecución",0]
["FDLSF-CPS-293-2022",2022,"FDLSF-CD-174-2022","FDLSF-CPS-293-2022","Contratos de prestación de servicios profesionales y de apoyo a la gestión","Contratación directa","Prestación de servicios profesionales y de apoyo a la gestión, o para la ejecución de trabajos artísticos que sólo puedan encomendarse a determinadas personas naturales","PRESTAR SERVICIOS DE APOYO PARA LA GESTIÓN LOCAL Y TERRITORIAL EN LOS TEMAS DE SEGURIDAD Y CONVIVENCIA CIUDADANA.","Inversión","Un nuevo contrato social y ambiental para la Bogotá del Siglo XXI",43,{"$f":"IF(ISERROR(VLOOKUP(K313,Proposito_programa!$C$2:$E$59,2,FALSE)),\" \",VLOOKUP(K313,Proposito_programa!$C$2:$E$59,2,FALSE))","v":"Cultura ciudadana para la confianza, la convivencia y la participación desde la vida cotidiana"},{"$f":"IF(ISERROR(VLOOKUP(K313,Proposito_programa!$C$2:$E$59,3,FALSE)),\" \",VLOOKUP(K313,Proposito_programa!$C$2:$E$59,3,FALSE))","v":"Propósito 3: Inspirar confianza y legitimidad para vivir sin miedo y ser epicentro de cultura ciudadana, paz y reconciliación"},2128,1,93134790,"OSCAR JAVIER CANDIA MURILLO","Persona Natural",null,null,null,null,4700000,null,null,0,4700000,1253333,"00:00:00","2022-11-15","2023-01-14",2,0,14,null,null,null,null,"Terminado",0.26666659574468088]
["FDLSF-CPS-294-2022",2022,"FDLSF-CD-174-2022","FDLSF-CPS-294-2022","Contratos de prestación de servicios profesionales y de apoyo a la gestión","Contratación directa","Prestación de servicios profesionales y de apoyo a la gestión, o para la ejecución de trabajos artísticos que sólo puedan encomendarse a determinadas personas naturales","PRESTAR SERVICIOS DE APOYO PARA LA GESTIÓN LOCAL Y TERRITORIAL EN LOS TEMAS DE SEGURIDAD Y CONVIVENCIA CIUDADANA.","Inversión","Un nuevo contrato social y ambiental para la Bogotá del Siglo XXI",43,{"$f":"IF(ISERROR(VLOOKUP(K314,Proposito_programa!$C$2:$E$59,2,FALSE)),\" \",VLOOKUP(K314,Proposito_programa!$C$2:$E$59,2,FALSE))","v":"Cultura ciudadana para la confianza, la convivencia y la participación desde la vida cotidiana"},{"$f":"IF(ISERROR(VLOOKUP(K314,Proposito_programa!$C$2:$E$59,3,FALSE)),\" \",VLOOKUP(K314,Proposito_programa!$C$2:$E$59,3,FALSE))","v":"Propósito 3: Inspirar confianza y legitimidad para vivir sin miedo y ser epicentro de cultura ciudadana, paz y reconciliación"},2128,1,11200485,"JOSE RICARDO NARANJO VELASQUEZ","Persona Natural",null,null,null,null,4700000,null,null,0,4700000,1253333,"2022-11-10","2022-11-15","2023-01-14",2,0,14,null,null,null,null,"Terminado",0.26666659574468088]
["FDLSF-CPS-295-2022",2022,"FDLSF-CD-174-2022","FDLSF-CPS-295-2022","Contratos de prestación de servicios profesionales y de apoyo a la gestión","Contratación directa","Prestación de servicios profesionales y de apoyo a la gestión, o para la ejecución de trabajos artísticos que sólo puedan encomendarse a determinadas personas naturales","PRESTAR SERVICIOS DE APOYO PARA LA GESTIÓN LOCAL Y TERRITORIAL EN LOS TEMAS DE SEGURIDAD Y CONVIVENCIA CIUDADANA.","Inversión","Un nuevo contrato social y ambiental para la Bogotá del Siglo XXI",43,{"$f":"IF(ISERROR(VLOOKUP(K315,Proposito_programa!$C$2:$E$59,2,FALSE)),\" \",VLOOKUP(K315,Proposito_programa!$C$2:$E$59,2,FALSE))","v":"Cultura ciudadana para la confianza, la convivencia y la participación desde la vida cotidiana"},{"$f":"IF(ISERROR(VLOOKUP(K315,Proposito_programa!$C$2:$E$59,3,FALSE)),\" \",VLOOKUP(K315,Proposito_programa!$C$2:$E$59,3,FALSE))","v":"Propósito 3: Inspirar confianza y legitimidad para vivir sin miedo y ser epicentro de cultura ciudadana, paz y reconciliación"},2128,1," 11412016","HECTOR ARIEL ARDILA CELIS","Persona Natural",null,null,null,null,4700000,null,null,0,4700000,1253333,"2022-11-10","2022-11-15","2023-01-14",2,0,14,null,null,null,null,"Terminado",0.26666659574468088]
["FDLSF-CPS-296-2022",2022,"FDLSF-CD-174-2022","FDLSF-CPS-296-2022","Contratos de prestación de servicios profesionales y de apoyo a la gestión","Contratación directa","Prestación de servicios profesionales y de apoyo a la gestión, o para la ejecución de trabajos artísticos que sólo puedan encomendarse a determinadas personas naturales","PRESTAR SERVICIOS DE APOYO PARA LA GESTIÓN LOCAL Y TERRITORIAL EN LOS TEMAS DE SEGURIDAD Y CONVIVENCIA CIUDADANA.","Inversión","Un nuevo contrato social y ambiental para la Bogotá del Siglo XXI",43,{"$f":"IF(ISERROR(VLOOKUP(K316,Proposito_programa!$C$2:$E$59,2,FALSE)),\" \",VLOOKUP(K316,Proposito_programa!$C$2:$E$59,2,FALSE))","v":"Cultura ciudadana para la confianza, la convivencia y la participación desde la vida cotidiana"},{"$f":"IF(ISERROR(VLOOKUP(K316,Proposito_programa!$C$2:$E$59,3,FALSE)),\" \",VLOOKUP(K316,Proposito_programa!$C$2:$E$59,3,FALSE))","v":"Propósito 3: Inspirar confianza y legitimidad para vivir sin miedo y ser epicentro de cultura ciudadana, paz y reconciliación"},2128,1,1015995087,"EDWIN JACOB CASTRO VARGAS","Persona Natural",null,null,null,null,4700000,null,null,0,4700000,1096667,"2022-11-11","2022-11-17","2023-01-16",2,0,16,null,null,null,null,"Terminado",0.23333340425531915]
["FDLSF-CIN-297-2022",2022,"FDLSF-CMA-004-2022","FDLSF-CIN-297-2022","Interventoría","Concurso de méritos","No aplica","INTERVENTORÍA TÉCNICA, ADMINISTRATIVA, FINANCIERA, JURÍDICA, AMBIENTAL Y SOCIAL AL CONTRATO DE DISEÑOS RESULTANTE DEL PROCESO DE CONCURSO DE MERITOS CUYO OBJETO ES\"REALIZAR LOS DIAGNSOTICOS, ESTUDIOS Y DISEÑOS PARA LA CONSERVACION Y/O CONSTRUCCION DE LA MALLA VIAL Y DE PUENTES VEHICULARES DE ESCALA LOCAL SOBRE CUERPOS DE AGUA Y DISEÑOS COMPLEMENTARIAS EN LA LOCALIDAD DE SANTA FE","Inversión","Un nuevo contrato social y ambiental para la Bogotá del Siglo XXI",49,{"$f":"IF(ISERROR(VLOOKUP(K317,Proposito_programa!$C$2:$E$59,2,FALSE)),\" \",VLOOKUP(K317,Proposito_programa!$C$2:$E$59,2,FALSE))","v":"Movilidad segura, sostenible y accesible"},{"$f":"IF(ISERROR(VLOOKUP(K317,Proposito_programa!$C$2:$E$59,3,FALSE)),\" \",VLOOKUP(K317,Proposito_programa!$C$2:$E$59,3,FALSE))","v":"Propósito 4: Hacer de Bogotá Región un modelo de movilidad multimodal, incluyente y sostenible"},2145,1,"901654803-2","CONSORCIO INTERVENTORES MALLA VIAL JCT 2022","Consorcio","900007355","CIVILNET INGENIERIA SAS",0.05,null,115617725,null,null,0,115617725,0,"2022-11-21","2022-12-13","2023-05-12",5,0,0,null,null,null,null,"En ejecución",0]
["FDLSF-CIN-297-2022",2022,"FDLSF-CMA-004-2022","FDLSF-CIN-297-2022","Interventoría","Concurso de méritos","No aplica","INTERVENTORÍA TÉCNICA, ADMINISTRATIVA, FINANCIERA, JURÍDICA, AMBIENTAL Y SOCIAL AL CONTRATO DE DISEÑOS RESULTANTE DEL PROCESO DE CONCURSO DE MERITOS CUYO OBJETO ES\"REALIZAR LOS DIAGNSOTICOS, ESTUDIOS Y DISEÑOS PARA LA CONSERVACION Y/O CONSTRUCCION DE LA MALLA VIAL Y DE PUENTES VEHICULARES DE ESCALA LOCAL SOBRE CUERPOS DE AGUA Y DISEÑOS COMPLEMENTARIAS EN LA LOCALIDAD DE SANTA FE","Inversión","Un nuevo contrato social y ambiental para la Bogotá del Siglo XXI",49,{"$f":"IF(ISERROR(VLOOKUP(K318,Proposito_programa!$C$2:$E$59,2,FALSE)),\" \",VLOOKUP(K318,Proposito_programa!$C$2:$E$59,2,FALSE))","v":"Movilidad segura, sostenible y accesible"},{"$f":"IF(ISERROR(VLOOKUP(K318,Proposito_programa!$C$2:$E$59,3,FALSE)),\" \",VLOOKUP(K318,Proposito_programa!$C$2:$E$59,3,FALSE))","v":"Propósito 4: Hacer de Bogotá Región un modelo de movilidad multimodal, incluyente y sostenible"},2145,null,"901654803-2","CONSORCIO INTERVENTORES MALLA VIAL JCT 2022","Consorcio","900066500","TAYFER DE COLOMBIA\nLTDA",0.35,null,0,null,null,0,0,0,"2022-11-21","2022-12-13","2023-05-12",5,0,0,null,null,null,null,"En ejecución","-"]
["FDLSF-CIN-297-2022",2022,"FDLSF-CMA-004-2022","FDLSF-CIN-297-2022","Interventoría","Concurso de méritos","No aplica","INTERVENTORÍA TÉCNICA, ADMINISTRATIVA, FINANCIERA, JURÍDICA, AMBIENTAL Y SOCIAL AL CONTRATO DE DISEÑOS RESULTANTE DEL PROCESO DE CONCURSO DE MERITOS CUYO OBJETO ES\"REALIZAR LOS DIAGNSOTICOS, ESTUDIOS Y DISEÑOS PARA LA CONSERVACION Y/O CONSTRUCCION DE LA MALLA VIAL Y DE PUENTES VEHICULARES DE ESCALA LOCAL SOBRE CUERPOS DE AGUA Y DISEÑOS COMPLEMENTARIAS EN LA LOCALIDAD DE SANTA FE","Inversión","Un nuevo contrato social y ambiental para la Bogotá del Siglo XXI",49,{"$f":"IF(ISERROR(VLOOKUP(K319,Proposito_programa!$C$2:$E$59,2,FALSE)),\" \",VLOOKUP(K319,Proposito_programa!$C$2:$E$59,2,FALSE))","v":"Movilidad segura, sostenible y accesible"},{"$f":"IF(ISERROR(VLOOKUP(K319,Proposito_programa!$C$2:$E$59,3,FALSE)),\" \",VLOOKUP(K319,Proposito_programa!$C$2:$E$59,3,FALSE))","v":"Propósito 4: Hacer de Bogotá Región un modelo de movilidad multimodal, incluyente y sostenible"},2145,null,"901654803-2","CONSORCIO INTERVENTORES MALLA VIAL JCT 2022","Consorcio","901269311","JCB CONSULTORIA SAS",0.3,null,0,null,null,0,0,0,"2022-11-21","2022-12-13","2023-05-12",5,0,0,null,null,null,null,"En ejecución","-"]
["FDLSF-CIN-297-2022",2022,"FDLSF-CMA-004-2022","FDLSF-CIN-297-2022","Interventoría","Concurso de méritos","No aplica","INTERVENTORÍA TÉCNICA, ADMINISTRATIVA, FINANCIERA, JURÍDICA, AMBIENTAL Y SOCIAL AL CONTRATO DE DISEÑOS RESULTANTE DEL PROCESO DE CONCURSO DE MERITOS CUYO OBJETO ES\"REALIZAR LOS DIAGNSOTICOS, ESTUDIOS Y DISEÑOS PARA LA CONSERVACION Y/O CONSTRUCCION DE LA MALLA VIAL Y DE PUENTES VEHICULARES DE ESCALA LOCAL SOBRE CUERPOS DE AGUA Y DISEÑOS COMPLEMENTARIAS EN LA LOCALIDAD DE SANTA FE","Inversión","Un nuevo contrato social y ambiental para la Bogotá del Siglo XXI",49,{"$f":"IF(ISERROR(VLOOKUP(K320,Proposito_programa!$C$2:$E$59,2,FALSE)),\" \",VLOOKUP(K320,Proposito_programa!$C$2:$E$59,2,FALSE))","v":"Movilidad segura, sostenible y accesible"},{"$f":"IF(ISERROR(VLOOKUP(K320,Proposito_programa!$C$2:$E$59,3,FALSE)),\" \",VLOOKUP(K320,Proposito_programa!$C$2:$E$59,3,FALSE))","v":"Propósito 4: Hacer de Bogotá Región un modelo de movilidad multimodal, incluyente y sostenible"},2145,null,"901654803-2","CONSORCIO INTERVENTORES MALLA VIAL JCT 2022","Consorcio","901269311","JCB INGENIERIA SAS",0.3,null,0,null,null,0,0,0,"2022-11-21","2022-12-13","2023-05-12",5,0,0,null,null,null,null,"En ejecución","-"]
["FDLSF-CPS-298-2022",2022,"FDLSF-CD-174-2022","FDLSF-CPS-298-2022","Contratos de prestación de servicios profesionales y de apoyo a la gestión","Contratación directa","Prestación de servicios profesionales y de apoyo a la gestión, o para la ejecución de trabajos artísticos que sólo puedan encomendarse a determinadas personas naturales","PRESTAR SERVICIOS DE APOYO PARA LA GESTIÓN LOCAL Y TERRITORIAL EN LOS TEMAS DE SEGURIDAD Y CONVIVENCIA CIUDADANA.","Inversión","Un nuevo contrato social y ambiental para la Bogotá del Siglo XXI",43,{"$f":"IF(ISERROR(VLOOKUP(K321,Proposito_programa!$C$2:$E$59,2,FALSE)),\" \",VLOOKUP(K321,Proposito_programa!$C$2:$E$59,2,FALSE))","v":"Cultura ciudadana para la confianza, la convivencia y la participación desde la vida cotidiana"},{"$f":"IF(ISERROR(VLOOKUP(K321,Proposito_programa!$C$2:$E$59,3,FALSE)),\" \",VLOOKUP(K321,Proposito_programa!$C$2:$E$59,3,FALSE))","v":"Propósito 3: Inspirar confianza y legitimidad para vivir sin miedo y ser epicentro de cultura ciudadana, paz y reconciliación"},2128,1,1000621435,"ANGELO ESTEVEN LOPEZ SANCHEZ","Persona Natural",null,null,null,null,4700000,null,null,0,4700000,0,"2022-11-23","2022-12-02","2023-02-10",2,0,40,1000621435,"ANGELO ESTEVEN LOPEZ SANCHEZ","2022-12-16",null,"En ejecución",0]
["FDLSF-CPS-299-2022",2022,"FDLSF-CD-174-2022","FDLSF-CPS-299-2022","Contratos de prestación de servicios profesionales y de apoyo a la gestión","Contratación directa","Prestación de servicios profesionales y de apoyo a la gestión, o para la ejecución de trabajos artísticos que sólo puedan encomendarse a determinadas personas naturales","PRESTAR SERVICIOS DE APOYO PARA LA GESTIÓN LOCAL Y TERRITORIAL EN LOS TEMAS DE SEGURIDAD Y CONVIVENCIA CIUDADANA.","Inversión","Un nuevo contrato social y ambiental para la Bogotá del Siglo XXI",43,{"$f":"IF(ISERROR(VLOOKUP(K322,Proposito_programa!$C$2:$E$59,2,FALSE)),\" \",VLOOKUP(K322,Proposito_programa!$C$2:$E$59,2,FALSE))","v":"Cultura ciudadana para la confianza, la convivencia y la participación desde la vida cotidiana"},{"$f":"IF(ISERROR(VLOOKUP(K322,Proposito_programa!$C$2:$E$59,3,FALSE)),\" \",VLOOKUP(K322,Proposito_programa!$C$2:$E$59,3,FALSE))","v":"Propósito 3: Inspirar confianza y legitimidad para vivir sin miedo y ser epicentro de cultura ciudadana, paz y reconciliación"},2128,1,1020843915,"\nBRAYAN DAVID PAEZ ACHURY","Persona Natural",null,null,null,null,4700000,null,null,0,4700000,0,"2022-11-23","2022-12-02","2023-02-01",2,0,31,null,null,null,null,"En ejecución",0]
["FDLSF-CPS-300-2022",2022,"FDLSF-CD-178-2022","FDLSF-CPS-300-2022","Contratos de prestación de servicios profesionales y de apoyo a la gestión","Contratación directa","Prestación de servicios profesionales y de apoyo a la gestión, o para la ejecución de trabajos artísticos que sólo puedan encomendarse a determinadas personas naturales","PRESTAR LOS SERVICIOS PROFESIONALES EN LOS TEMAS SOCIALES ASOCIADOS A INFRAESTRUCTURA, PLANEACIÓN, PARTICIPACIÓN Y SEGURIDAD QUE LE SEAN ASIGNADOS, EN PRO DE LA GARANTÍA DE LOS DERECHOS DE LA POBLACIÓN EN LA LOCALIDAD DE SANTA FE","Inversión","Un nuevo contrato social y ambiental para la Bogotá del Siglo XXI",57,{"$f":"IF(ISERROR(VLOOKUP(K323,Proposito_programa!$C$2:$E$59,2,FALSE)),\" \",VLOOKUP(K323,Proposito_programa!$C$2:$E$59,2,FALSE))","v":"Gestión pública local"},{"$f":"IF(ISERROR(VLOOKUP(K323,Proposito_programa!$C$2:$E$59,3,FALSE)),\" \",VLOOKUP(K323,Proposito_programa!$C$2:$E$59,3,FALSE))","v":"Propósito 5: Construir Bogotá - Región con gobierno abierto, transparente y ciudadanía consciente"},2105,1,1032498194,"JULIETH ANDREA BARRERA RODRIGUEZ","Persona Natural",null,null,null,null,9600000,null,null,0,9600000,0,"2022-11-25","2022-12-05","2022-12-31",2,0,0,null,null,null,null,"En ejecución",0]
["FDLSF-CPS-301-2022",2022,"FDLSF-CD-178-2022","FDLSF-CPS-301-2022","Contratos de prestación de servicios profesionales y de apoyo a la gestión","Contratación directa","Prestación de servicios profesionales y de apoyo a la gestión, o para la ejecución de trabajos artísticos que sólo puedan encomendarse a determinadas personas naturales","PRESTAR LOS SERVICIOS PROFESIONALES EN LOS TEMAS SOCIALES ASOCIADOS A INFRAESTRUCTURA, PLANEACIÓN, PARTICIPACIÓN Y SEGURIDAD QUE LE SEAN ASIGNADOS, EN PRO DE LA GARANTÍA DE LOS DERECHOS DE LA POBLACIÓN EN LA LOCALIDAD DE SANTA FE","Inversión","Un nuevo contrato social y ambiental para la Bogotá del Siglo XXI",57,{"$f":"IF(ISERROR(VLOOKUP(K324,Proposito_programa!$C$2:$E$59,2,FALSE)),\" \",VLOOKUP(K324,Proposito_programa!$C$2:$E$59,2,FALSE))","v":"Gestión pública local"},{"$f":"IF(ISERROR(VLOOKUP(K324,Proposito_programa!$C$2:$E$59,3,FALSE)),\" \",VLOOKUP(K324,Proposito_programa!$C$2:$E$59,3,FALSE))","v":"Propósito 5: Construir Bogotá - Región con gobierno abierto, transparente y ciudadanía consciente"},2105,1,1019045309,"DIEGO FELIPE SANCHEZ TRIANA","Persona Natural",null,null,null,null,9600000,null,null,0,9600000,0,"00:00:00","00:00:00","SIN FECHA DE TERMINACION",0,0,0,null,null,null,null,"En ejecución",0]
["FDLSF-CPS-302-2022",2022,"FDLSF-CD-178-2022","FDLSF-CPS-302-2022","Contratos de prestación de servicios profesionales y de apoyo a la gestión","Contratación directa","Prestación de servicios profesionales y de apoyo a la gestión, o para la ejecución de trabajos artísticos que sólo puedan encomendarse a determinadas personas naturales","PRESTAR LOS SERVICIOS PROFESIONALES EN LOS TEMAS SOCIALES ASOCIADOS A INFRAESTRUCTURA, PLANEACIÓN, PARTICIPACIÓN Y SEGURIDAD QUE LE SEAN ASIGNADOS, EN PRO DE LA GARANTÍA DE LOS DERECHOS DE LA POBLACIÓN EN LA LOCALIDAD DE SANTA FE","Inversión","Un nuevo contrato social y ambiental para la Bogotá del Siglo XXI",57,{"$f":"IF(ISERROR(VLOOKUP(K325,Proposito_programa!$C$2:$E$59,2,FALSE)),\" \",VLOOKUP(K325,Proposito_programa!$C$2:$E$59,2,FALSE))","v":"Gestión pública local"},{"$f":"IF(ISERROR(VLOOKUP(K325,Proposito_programa!$C$2:$E$59,3,FALSE)),\" \",VLOOKUP(K325,Proposito_programa!$C$2:$E$59,3,FALSE))","v":"Propósito 5: Construir Bogotá - Región con gobierno abierto, transparente y ciudadanía consciente"},2105,1,52493388,"DIANA ALEJANDRA AVILA SANTOFIMIO","Persona Natural",null,null,null,null,9600000,null,null,0,9600000,0,"2022-11-25","2022-12-05","2022-12-31",2,0,0,null,null,null,null,"En ejecución",0]
["FDLSF-CPS-303-2022",2022,"FDLSF-CD-179-2022","FDLSF-CPS-303-2022","Contratos de prestación de servicios profesionales y de apoyo a la gestión","Contratación directa","Prestación de servicios profesionales y de apoyo a la gestión, o para la ejecución de trabajos artísticos que sólo puedan encomendarse a determinadas personas naturales","APOYAR JURÍDICAMENTE LA EJECUCIÓN DE LAS ACCIONES REQUERIDAS PARA LA DEPURACIÓN DE LAS ACTUACIONES ADMINISTRATIVAS QUE CURSAN EN LA ALCALDÍA LOCAL DE SANTA FE","Inversión","Un nuevo contrato social y ambiental para la Bogotá del Siglo XXI",57,{"$f":"IF(ISERROR(VLOOKUP(K326,Proposito_programa!$C$2:$E$59,2,FALSE)),\" \",VLOOKUP(K326,Proposito_programa!$C$2:$E$59,2,FALSE))","v":"Gestión pública local"},{"$f":"IF(ISERROR(VLOOKUP(K326,Proposito_programa!$C$2:$E$59,3,FALSE)),\" \",VLOOKUP(K326,Proposito_programa!$C$2:$E$59,3,FALSE))","v":"Propósito 5: Construir Bogotá - Región con gobierno abierto, transparente y ciudadanía consciente"},2105,1,1010182874,"LORENA CAMACHO SOLANO ","Persona Natural",null,null,null,null,9600000,null,null,0,9600000,0,"2022-11-18","2022-11-21","2022-12-31",2,0,0,null,null,null,null,"En ejecución",0]
["FDLSF-CPS-304-2022",2022,"FDLSF-CD-174-2022","FDLSF-CPS-304-2022","Contratos de prestación de servicios profesionales y de apoyo a la gestión","Contratación directa","Prestación de servicios profesionales y de apoyo a la gestión, o para la ejecución de trabajos artísticos que sólo puedan encomendarse a determinadas personas naturales","PRESTAR SERVICIOS DE APOYO PARA LA GESTIÓN LOCAL Y TERRITORIAL EN LOS TEMAS DE SEGURIDAD Y CONVIVENCIA CIUDADANA.","Inversión","Un nuevo contrato social y ambiental para la Bogotá del Siglo XXI",43,{"$f":"IF(ISERROR(VLOOKUP(K327,Proposito_programa!$C$2:$E$59,2,FALSE)),\" \",VLOOKUP(K327,Proposito_programa!$C$2:$E$59,2,FALSE))","v":"Cultura ciudadana para la confianza, la convivencia y la participación desde la vida cotidiana"},{"$f":"IF(ISERROR(VLOOKUP(K327,Proposito_programa!$C$2:$E$59,3,FALSE)),\" \",VLOOKUP(K327,Proposito_programa!$C$2:$E$59,3,FALSE))","v":"Propósito 3: Inspirar confianza y legitimidad para vivir sin miedo y ser epicentro de cultura ciudadana, paz y reconciliación"},2128,1,80372220,"CESAR AUGUSTO CAÑON VARGAS","Persona Natural",null,null,null,null,4700000,null,null,0,4700000,0,"2022-11-21","2022-11-25","2022-12-31",2,0,0,null,null,null,null,"En ejecución",0]
["FDLSF-CPS-305-2022",2022,"FDLSF-CD-181-2022","FDLSF-CPS-305-2022","Contratos de prestación de servicios profesionales y de apoyo a la gestión","Contratación directa","Prestación de servicios profesionales y de apoyo a la gestión, o para la ejecución de trabajos artísticos que sólo puedan encomendarse a determinadas personas naturales","PRESTAR SERVICIOS DE APOYO A LA GESTIÓN EN LA ALCALDIA LOCAL DE SANTA FE BRINDANDO ORIENTACIÓN A LA CIUDADANÍA EN LOS TEMAS ASOCIADOS A LA OFERTA INSTITUCIONAL Y DE SERVICIOS.","Inversión","Un nuevo contrato social y ambiental para la Bogotá del Siglo XXI",57,{"$f":"IF(ISERROR(VLOOKUP(K328,Proposito_programa!$C$2:$E$59,2,FALSE)),\" \",VLOOKUP(K328,Proposito_programa!$C$2:$E$59,2,FALSE))","v":"Gestión pública local"},{"$f":"IF(ISERROR(VLOOKUP(K328,Proposito_programa!$C$2:$E$59,3,FALSE)),\" \",VLOOKUP(K328,Proposito_programa!$C$2:$E$59,3,FALSE))","v":"Propósito 5: Construir Bogotá - Región con gobierno abierto, transparente y ciudadanía consciente"},2105,1,1014306053,"ANGELA SOFIA GUERRERO CASTELBLANCO","Persona Natural",null,null,null,null,4465000,null,null,0,4465000,0,"2022-11-23","2022-11-28","2022-12-31",0,0,0,null,null,null,null,"En ejecución",0]
["FDLSF-CPS-306-2022",2022,"FDLSF-CD-178-2022","FDLSF-CPS-306-2022","Contratos de prestación de servicios profesionales y de apoyo a la gestión","Contratación directa","Prestación de servicios profesionales y de apoyo a la gestión, o para la ejecución de trabajos artísticos que sólo puedan encomendarse a determinadas personas naturales","PRESTAR LOS SERVICIOS PROFESIONALES EN LOS TEMAS SOCIALES ASOCIADOS A INFRAESTRUCTURA, PLANEACIÓN, PARTICIPACIÓN Y SEGURIDAD QUE LE SEAN ASIGNADOS, EN PRO DE LA GARANTÍA DE LOS DERECHOS DE LA POBLACIÓN EN LA LOCALIDAD DE SANTA FE","Inversión","Un nuevo contrato social y ambiental para la Bogotá del Siglo XXI",57,{"$f":"IF(ISERROR(VLOOKUP(K329,Proposito_programa!$C$2:$E$59,2,FALSE)),\" \",VLOOKUP(K329,Proposito_programa!$C$2:$E$59,2,FALSE))","v":"Gestión pública local"},{"$f":"IF(ISERROR(VLOOKUP(K329,Proposito_programa!$C$2:$E$59,3,FALSE)),\" \",VLOOKUP(K329,Proposito_programa!$C$2:$E$59,3,FALSE))","v":"Propósito 5: Construir Bogotá - Región con gobierno abierto, transparente y ciudadanía consciente"},2105,1,80168216,"LUIS MIGUEL COGOLLO SILVA","Persona Natural",null,null,null,null,9600000,null,null,0,9600000,0,"2022-11-23","2022-11-25","2023-01-24",2,0,24,null,null,null,null,"En ejecución",0]
["FDLSF-CCV-307-2022",2022,"FDLSF-SASI-002-2022","FDLSF-CCV-307-2022","Compraventa de bienes muebles","Selección abreviada","No aplica","ADQUISICIÓN DE ELEMENTOS TECNOLOGICOS E INFORMATIVOS DE SALUD PARA LAS ACCIONES COMPLEMENTARIAS DE LA ESTRATEGIA TERRITORIAL EN SALUD PROYECTO 2104","Inversión","Un nuevo contrato social y ambiental para la Bogotá del Siglo XXI",7,{"$f":"IF(ISERROR(VLOOKUP(K330,Proposito_programa!$C$2:$E$59,2,FALSE)),\" \",VLOOKUP(K330,Proposito_programa!$C$2:$E$59,2,FALSE))","v":"Mejora de la gestión de instituciones de salud"},{"$f":"IF(ISERROR(VLOOKUP(K330,Proposito_programa!$C$2:$E$59,3,FALSE)),\" \",VLOOKUP(K330,Proposito_programa!$C$2:$E$59,3,FALSE))","v":"Propósito 1: Hacer un nuevo contrato social para incrementar la inclusión social, productiva y política"},2104,3,900954187,"SISCOM SERVICIOS INTEGRALES SAS","Persona Jurídica",null,null,null,null,97317000,null,null,0,97317000,0,"2022-11-22","2022-11-25","2023-01-24",1,1,30,null,null,null,null,"En ejecución",0]
["FDLSF-CVV-308-2022",2022,"FDLSF-SASI-001-2022","FDLSF-CVV-308-2022","Compraventa de bienes muebles","Selección abreviada","No aplica","ADQUISICIÓN DE ELEMENTOS DEPORTIVOS PARA EL FORTALECIMIENTO DE LOS PROCESOS DEPORTIVOS DE LA LOCALIDAD DE SANTA FE, EN EL MARCO DE LA ESTRATEGIA DE LA SECRETARÍA DE GOBIERNO DE BOGOTÁ DENOMINADA CONSTRUCTORES LOCALES","Inversión","Un nuevo contrato social y ambiental para la Bogotá del Siglo XXI",20,{"$f":"IF(ISERROR(VLOOKUP(K331,Proposito_programa!$C$2:$E$59,2,FALSE)),\" \",VLOOKUP(K331,Proposito_programa!$C$2:$E$59,2,FALSE))","v":"Bogotá, referente en cultura, deporte, recreación y actividad física, con parques para el desarrollo y la salud"},{"$f":"IF(ISERROR(VLOOKUP(K331,Proposito_programa!$C$2:$E$59,3,FALSE)),\" \",VLOOKUP(K331,Proposito_programa!$C$2:$E$59,3,FALSE))","v":"Propósito 1: Hacer un nuevo contrato social para incrementar la inclusión social, productiva y política"},2100,13,79867234,"CARLOS ALBERTO PINZON MOLINA","Persona Natural",null,null,null,null,203896806,null,null,0,203896806,0,"2022-11-23","00:00:00","SIN FECHA DE TERMINACION",3,0,0,null,null,null,null,"En ejecución",0]
["FDLSF-CPS-309-2022",2022,"FDLSF-CD-180-2022","FDLSF-CPS-309-2022","Contratos de prestación de servicios profesionales y de apoyo a la gestión","Contratación directa","Prestación de servicios profesionales y de apoyo a la gestión, o para la ejecución de trabajos artísticos que sólo puedan encomendarse a determinadas personas naturales","PRESTAR SERVICIOS PROFESIONALES PARA EL SEGUIMIENTO DEL CUMPLIMIENTO DE LOS PROCEDIMIENTOS ADMINISTRATIVOS, OPERATIVOS Y TÉCNICOS DE GOBIERNO ABIERTO E INNOVACIÓN DE LA LOCALIDAD DE SANTA FE Y EN LA LABORES INSTITUCIONALES Y SOCIALES QUE ESTE DESARROLLE DENTRO DE LOS PROCESOS ASIGNADOS PARA EL CUMPLIMIENTO DE LA DIRECTIVA 005 DEL 2020 EN MATERIA DE GOBIERNO ABIERTO E INNOVACION","Inversión","Un nuevo contrato social y ambiental para la Bogotá del Siglo XXI",57,{"$f":"IF(ISERROR(VLOOKUP(K332,Proposito_programa!$C$2:$E$59,2,FALSE)),\" \",VLOOKUP(K332,Proposito_programa!$C$2:$E$59,2,FALSE))","v":"Gestión pública local"},{"$f":"IF(ISERROR(VLOOKUP(K332,Proposito_programa!$C$2:$E$59,3,FALSE)),\" \",VLOOKUP(K332,Proposito_programa!$C$2:$E$59,3,FALSE))","v":"Propósito 5: Construir Bogotá - Región con gobierno abierto, transparente y ciudadanía consciente"},2105,1,1032460322,"HEINZ ALEJANDRO TORRES QUINTANA","Persona Natural",null,null,null,null,9120000,null,null,0,9120000,0,"2022-11-25","2022-12-05","2022-12-31",0,0,0,null,null,null,null,"En ejecución",0]
["FDLSF-CCV-310-2022",2022,"FDLSF-MC-014-2022","FDLSF-CCV-310-2022","Compraventa de bienes muebles","Contratación mínima cuantia","No aplica","SUMINISTRO DE ELEMENTOS DE PAPELERÍA Y OFICINA PARA EL FONDO DE DESARROLLO LOCAL DE SANTA FE","Funcionamiento",null,"No aplica",{"$f":"IF(ISERROR(VLOOKUP(K333,Proposito_programa!$C$2:$E$59,2,FALSE)),\" \",VLOOKUP(K333,Proposito_programa!$C$2:$E$59,2,FALSE))","v":" "},{"$f":"IF(ISERROR(VLOOKUP(K333,Proposito_programa!$C$2:$E$59,3,FALSE)),\" \",VLOOKUP(K333,Proposito_programa!$C$2:$E$59,3,FALSE))","v":" "},"No aplica",4," 900119437","INGENIERIA CONSTRUCCION Y VIAS DE COLOMBIA SAS / INCOVICOL S.A.S.","Persona Jurídica",null,null,null,null,20133918,null,null,0,20133918,0,"2022-11-25","00:00:00","SIN FECHA DE TERMINACION",6,0,0,null,null,null,null,"En ejecución",0]
["FDLSF-CPS-311-2022",2022,"FDLSF-CD-182-2022","FDLSF-CPS-311-2022","Contratos de prestación de servicios profesionales y de apoyo a la gestión","Contratación directa","Prestación de servicios profesionales y de apoyo a la gestión, o para la ejecución de trabajos artísticos que sólo puedan encomendarse a determinadas personas naturales","PRESTAR SERVICIOS PROFESIONALES AL ÁREA DE GESTIÓN DEL DESARROLLO LOCAL EN LO ATINENTE A LAS ETAPAS PRECONTRACTUALES, CONTRACTUALES Y POSTCONTRACTUALES, EN EL MARCO DE LOS PLANES, PROGRAMAS Y PROYECTOS ENCAMINADOS A LA ADQUISICIÓN DE BIENES Y SERVICIOS PARA EL FORTALECIMIENTO DE LA GESTIÓN LOCAL","Inversión","Un nuevo contrato social y ambiental para la Bogotá del Siglo XXI",57,{"$f":"IF(ISERROR(VLOOKUP(K334,Proposito_programa!$C$2:$E$59,2,FALSE)),\" \",VLOOKUP(K334,Proposito_programa!$C$2:$E$59,2,FALSE))","v":"Gestión pública local"},{"$f":"IF(ISERROR(VLOOKUP(K334,Proposito_programa!$C$2:$E$59,3,FALSE)),\" \",VLOOKUP(K334,Proposito_programa!$C$2:$E$59,3,FALSE))","v":"Propósito 5: Construir Bogotá - Región con gobierno abierto, transparente y ciudadanía consciente"},2105,1,1015427392,"LADY XIOMARA PINEDA TORRES","Persona Natural",null,null,null,null,8133333,null,null,0,8133333,0,"2022-11-23","2022-11-24","2022-12-31",0,0,0,null,null,null,null,"En ejecución",0]
["FDLSF-CPS-312-2022",2022,"FDLSF-CD-178-2022","FDLSF-CPS-312-2022","Contratos de prestación de servicios profesionales y de apoyo a la gestión","Contratación directa","Prestación de servicios profesionales y de apoyo a la gestión, o para la ejecución de trabajos artísticos que sólo puedan encomendarse a determinadas personas naturales","PRESTAR LOS SERVICIOS PROFESIONALES EN LOS TEMAS SOCIALES ASOCIADOS A INFRAESTRUCTURA, PLANEACIÓN, PARTICIPACIÓN Y SEGURIDAD QUE LE SEAN ASIGNADOS, EN PRO DE LA GARANTÍA DE LOS DERECHOS DE LA POBLACIÓN EN LA LOCALIDAD DE SANTA FE","Inversión","Un nuevo contrato social y ambiental para la Bogotá del Siglo XXI",57,{"$f":"IF(ISERROR(VLOOKUP(K335,Proposito_programa!$C$2:$E$59,2,FALSE)),\" \",VLOOKUP(K335,Proposito_programa!$C$2:$E$59,2,FALSE))","v":"Gestión pública local"},{"$f":"IF(ISERROR(VLOOKUP(K335,Proposito_programa!$C$2:$E$59,3,FALSE)),\" \",VLOOKUP(K335,Proposito_programa!$C$2:$E$59,3,FALSE))","v":"Propósito 5: Construir Bogotá - Región con gobierno abierto, transparente y ciudadanía consciente"},2105,1,52158238,"DEYSI LILIANA PARDO BONILLA","Persona Natural",null,null,null,null,9600000,null,null,0,9600000,0,"2022-11-25","2022-12-01","2022-12-31",2,0,0,null,null,null,null,"En ejecución",0]
["FDLSF-CPS-314-2022",2022,"FDLSF-CD-179-2022","FDLSF-CPS-314-2022","Contratos de prestación de servicios profesionales y de apoyo a la gestión","Contratación directa","Prestación de servicios profesionales y de apoyo a la gestión, o para la ejecución de trabajos artísticos que sólo puedan encomendarse a determinadas personas naturales","APOYAR JURÍDICAMENTE LA EJECUCIÓN DE LAS ACCIONES REQUERIDAS PARA LA DEPURACIÓN DE LAS ACTUACIONES ADMINISTRATIVAS QUE CURSAN EN LA ALCALDÍA LOCAL DE SANTA FE","Inversión","Un nuevo contrato social y ambiental para la Bogotá del Siglo XXI",57,{"$f":"IF(ISERROR(VLOOKUP(K336,Proposito_programa!$C$2:$E$59,2,FALSE)),\" \",VLOOKUP(K336,Proposito_programa!$C$2:$E$59,2,FALSE))","v":"Gestión pública local"},{"$f":"IF(ISERROR(VLOOKUP(K336,Proposito_programa!$C$2:$E$59,3,FALSE)),\" \",VLOOKUP(K336,Proposito_programa!$C$2:$E$59,3,FALSE))","v":"Propósito 5: Construir Bogotá - Región con gobierno abierto, transparente y ciudadanía consciente"},2105,1,1032465031,"PAULA ALEJANDRA CARANTON TRONCOSO","Persona Natural",null,null,null,null,9600000,null,null,0,9600000,0,"2022-11-25","2022-12-01","2022-12-31",2,0,0,null,null,null,null,"En ejecución",0]
["FDLSF-CIA-315-2022",2022,"FDLSF-CD-187-2022","FDLSF-CIA-315-2022","Convenios/Contratos interadministrativos","Contratación directa","Contratos interadministrativos","AUNAR ESFUERZOS PARA EL DESARROLLO DE MANERA INTEGRAL, TÉCNICA, ADMINISTRATIVA Y FINANCIERA DIRIGIDO A EJECUTAR ACCIONES ARTÍCULADAS ENTRE LAS PARTES, ORIENTADAS A FOMENTAR LA GENERACION DE ACUERDOS CIUDADANOS DEL PROGRAMA DE ESPACIO PÚBLICO, PUESTA EN MARCHA DE LA ESTRATEGIA DEL CUIDADO A MUJERES CUIDADORAS, PREVENCIÓN DE VIOLENCIAS CONTRA LAS MUJERES Y FORTALECIMIENTO DE LOS PROYECTOS DE LAS INSTITUCIONES EDUCATIVAS DISTRITALES (IED) ORIENTADOS A PRIMERA INFANCIA EN LA LOCALIDAD DE SANTA FE","Inversión","Un nuevo contrato social y ambiental para la Bogotá del Siglo XXI",6,{"$f":"IF(ISERROR(VLOOKUP(K337,Proposito_programa!$C$2:$E$59,2,FALSE)),\" \",VLOOKUP(K337,Proposito_programa!$C$2:$E$59,2,FALSE))","v":"Sistema Distrital de Cuidado"},{"$f":"IF(ISERROR(VLOOKUP(K337,Proposito_programa!$C$2:$E$59,3,FALSE)),\" \",VLOOKUP(K337,Proposito_programa!$C$2:$E$59,3,FALSE))","v":"Propósito 1: Hacer un nuevo contrato social para incrementar la inclusión social, productiva y política"},2188,1,901100455,"ALIANZA PUBLICA PARA EL DESARROLLO INTEGRAL ALDESARROLLO - PROVEEDOR / ALDESARROLLO","Persona Jurídica",null,null,null,null,321949000,null,null,0,321949000,96584700,"2022-12-12","2022-12-15","2023-07-14",7,0,0,null,null,null,null,"En ejecución",0.3]
["FDLSF-CIA-315-2022",2022,"FDLSF-CD-187-2022","FDLSF-CIA-315-2022","Convenios/Contratos interadministrativos","Contratación directa","Contratos interadministrativos","AUNAR ESFUERZOS PARA EL DESARROLLO DE MANERA INTEGRAL, TÉCNICA, ADMINISTRATIVA Y FINANCIERA DIRIGIDO A EJECUTAR ACCIONES ARTÍCULADAS ENTRE LAS PARTES, ORIENTADAS A FOMENTAR LA GENERACION DE ACUERDOS CIUDADANOS DEL PROGRAMA DE ESPACIO PÚBLICO, PUESTA EN MARCHA DE LA ESTRATEGIA DEL CUIDADO A MUJERES CUIDADORAS, PREVENCIÓN DE VIOLENCIAS CONTRA LAS MUJERES Y FORTALECIMIENTO DE LOS PROYECTOS DE LAS INSTITUCIONES EDUCATIVAS DISTRITALES (IED) ORIENTADOS A PRIMERA INFANCIA EN LA LOCALIDAD DE SANTA FE","Inversión","Un nuevo contrato social y ambiental para la Bogotá del Siglo XXI",12,{"$f":"IF(ISERROR(VLOOKUP(K338,Proposito_programa!$C$2:$E$59,2,FALSE)),\" \",VLOOKUP(K338,Proposito_programa!$C$2:$E$59,2,FALSE))","v":"Educación inicial: Bases sólidas para la vida."},{"$f":"IF(ISERROR(VLOOKUP(K338,Proposito_programa!$C$2:$E$59,3,FALSE)),\" \",VLOOKUP(K338,Proposito_programa!$C$2:$E$59,3,FALSE))","v":"Propósito 1: Hacer un nuevo contrato social para incrementar la inclusión social, productiva y política"},2102,1,901100455,"ALIANZA PUBLICA PARA EL DESARROLLO INTEGRAL ALDESARROLLO - PROVEEDOR / ALDESARROLLO","Persona Jurídica",null,null,null,null,527530880,null,null,0,527530880,158259264,"2022-12-12","2022-12-15","2023-07-14",7,0,0,null,null,null,null,"En ejecución",0.3]
["FDLSF-CIA-315-2022",2022,"FDLSF-CD-187-2022","FDLSF-CIA-315-2022","Convenios/Contratos interadministrativos","Contratación directa","Contratos interadministrativos","AUNAR ESFUERZOS PARA EL DESARROLLO DE MANERA INTEGRAL, TÉCNICA, ADMINISTRATIVA Y FINANCIERA DIRIGIDO A EJECUTAR ACCIONES ARTÍCULADAS ENTRE LAS PARTES, ORIENTADAS A FOMENTAR LA GENERACION DE ACUERDOS CIUDADANOS DEL PROGRAMA DE ESPACIO PÚBLICO, PUESTA EN MARCHA DE LA ESTRATEGIA DEL CUIDADO A MUJERES CUIDADORAS, PREVENCIÓN DE VIOLENCIAS CONTRA LAS MUJERES Y FORTALECIMIENTO DE LOS PROYECTOS DE LAS INSTITUCIONES EDUCATIVAS DISTRITALES (IED) ORIENTADOS A PRIMERA INFANCIA EN LA LOCALIDAD DE SANTA FE","Inversión","Un nuevo contrato social y ambiental para la Bogotá del Siglo XXI",40,{"$f":"IF(ISERROR(VLOOKUP(K339,Proposito_programa!$C$2:$E$59,2,FALSE)),\" \",VLOOKUP(K339,Proposito_programa!$C$2:$E$59,2,FALSE))","v":"Más mujeres viven una vida libre de violencias, se sienten seguras y acceden con confianza al sistema de justicia"},{"$f":"IF(ISERROR(VLOOKUP(K339,Proposito_programa!$C$2:$E$59,3,FALSE)),\" \",VLOOKUP(K339,Proposito_programa!$C$2:$E$59,3,FALSE))","v":"Propósito 3: Inspirar confianza y legitimidad para vivir sin miedo y ser epicentro de cultura ciudadana, paz y reconciliación"},2161,1,901100455,"ALIANZA PUBLICA PARA EL DESARROLLO INTEGRAL ALDESARROLLO - PROVEEDOR / ALDESARROLLO","Persona Jurídica",null,null,null,null,366000000,null,null,0,366000000,109800000,"2022-12-12","2022-12-15","2023-07-14",7,0,0,null,null,null,null,"En ejecución",0.3]
["FDLSF-CIA-315-2022",2022,"FDLSF-CD-187-2022","FDLSF-CIA-315-2022","Convenios/Contratos interadministrativos","Contratación directa","Contratos interadministrativos","AUNAR ESFUERZOS PARA EL DESARROLLO DE MANERA INTEGRAL, TÉCNICA, ADMINISTRATIVA Y FINANCIERA DIRIGIDO A EJECUTAR ACCIONES ARTÍCULADAS ENTRE LAS PARTES, ORIENTADAS A FOMENTAR LA GENERACION DE ACUERDOS CIUDADANOS DEL PROGRAMA DE ESPACIO PÚBLICO, PUESTA EN MARCHA DE LA ESTRATEGIA DEL CUIDADO A MUJERES CUIDADORAS, PREVENCIÓN DE VIOLENCIAS CONTRA LAS MUJERES Y FORTALECIMIENTO DE LOS PROYECTOS DE LAS INSTITUCIONES EDUCATIVAS DISTRITALES (IED) ORIENTADOS A PRIMERA INFANCIA EN LA LOCALIDAD DE SANTA FE","Inversión","Un nuevo contrato social y ambiental para la Bogotá del Siglo XXI",45,{"$f":"IF(ISERROR(VLOOKUP(K340,Proposito_programa!$C$2:$E$59,2,FALSE)),\" \",VLOOKUP(K340,Proposito_programa!$C$2:$E$59,2,FALSE))","v":"Espacio público más seguro y construido colectivamente"},{"$f":"IF(ISERROR(VLOOKUP(K340,Proposito_programa!$C$2:$E$59,3,FALSE)),\" \",VLOOKUP(K340,Proposito_programa!$C$2:$E$59,3,FALSE))","v":"Propósito 3: Inspirar confianza y legitimidad para vivir sin miedo y ser epicentro de cultura ciudadana, paz y reconciliación"},2130,1,901100455,"ALIANZA PUBLICA PARA EL DESARROLLO INTEGRAL ALDESARROLLO - PROVEEDOR / ALDESARROLLO","Persona Jurídica",null,null,null,null,661950000,null,null,0,661950000,198585000,"2022-12-12","2022-12-15","2023-07-14",7,0,0,null,null,null,null,"En ejecución",0.3]
["FDLSF-CPS-316-2022",2022,"FDLSF-CD-178-2022","FDLSF-CPS-316-2022","Contratos de prestación de servicios profesionales y de apoyo a la gestión","Contratación directa","Prestación de servicios profesionales y de apoyo a la gestión, o para la ejecución de trabajos artísticos que sólo puedan encomendarse a determinadas personas naturales","PRESTAR LOS SERVICIOS PROFESIONALES EN LOS TEMAS SOCIALES ASOCIADOS A INFRAESTRUCTURA, PLANEACIÓN, PARTICIPACIÓN Y SEGURIDAD QUE LE SEAN ASIGNADOS, EN PRO DE LA GARANTÍA DE LOS DERECHOS DE LA POBLACIÓN EN LA LOCALIDAD DE SANTA FE","Inversión","Un nuevo contrato social y ambiental para la Bogotá del Siglo XXI",57,{"$f":"IF(ISERROR(VLOOKUP(K341,Proposito_programa!$C$2:$E$59,2,FALSE)),\" \",VLOOKUP(K341,Proposito_programa!$C$2:$E$59,2,FALSE))","v":"Gestión pública local"},{"$f":"IF(ISERROR(VLOOKUP(K341,Proposito_programa!$C$2:$E$59,3,FALSE)),\" \",VLOOKUP(K341,Proposito_programa!$C$2:$E$59,3,FALSE))","v":"Propósito 5: Construir Bogotá - Región con gobierno abierto, transparente y ciudadanía consciente"},2105,1,40020501,"MARTHA LEONOR ACERO FAURA","Persona Natural",null,null,null,null,9600000,null,null,0,9600000,0,"2022-11-25","2022-12-01","2022-12-31",2,0,0,null,null,null,null,"En ejecución",0]
["FDLSF-CPS-317-2022",2022,"FDLSF-CD-174-2022","FDLSF-CPS-317-2022","Contratos de prestación de servicios profesionales y de apoyo a la gestión","Contratación directa","Prestación de servicios profesionales y de apoyo a la gestión, o para la ejecución de trabajos artísticos que sólo puedan encomendarse a determinadas personas naturales","PRESTAR SERVICIOS DE APOYO PARA LA GESTIÓN LOCAL Y TERRITORIAL EN LOS TEMAS DE SEGURIDAD Y CONVIVENCIA CIUDADANA.","Inversión","Un nuevo contrato social y ambiental para la Bogotá del Siglo XXI",43,{"$f":"IF(ISERROR(VLOOKUP(K342,Proposito_programa!$C$2:$E$59,2,FALSE)),\" \",VLOOKUP(K342,Proposito_programa!$C$2:$E$59,2,FALSE))","v":"Cultura ciudadana para la confianza, la convivencia y la participación desde la vida cotidiana"},{"$f":"IF(ISERROR(VLOOKUP(K342,Proposito_programa!$C$2:$E$59,3,FALSE)),\" \",VLOOKUP(K342,Proposito_programa!$C$2:$E$59,3,FALSE))","v":"Propósito 3: Inspirar confianza y legitimidad para vivir sin miedo y ser epicentro de cultura ciudadana, paz y reconciliación"},2128,1,79419523,"LUIS ANTONIO CELIS CASTELLANOS","Persona Natural",null,null,null,null,4700000,null,null,0,4700000,0,"2022-11-26","2022-11-29","2023-01-28",1,0,28,null,null,null,null,"En ejecución",0]
["FDLSF-CPS-318-2022",2022,"FDLSF-CD-183-2022","FDLSF-CPS-318-2022","Contratos de prestación de servicios profesionales y de apoyo a la gestión","Contratación directa","Prestación de servicios profesionales y de apoyo a la gestión, o para la ejecución de trabajos artísticos que sólo puedan encomendarse a determinadas personas naturales"," APOYAR AL EQUIPO DE PRENSA Y COMUNICACIONES DE LA ALCALDÍA LOCAL EN LA CREACIÓN, REALIZACIÓN, PRODUCCIÓN Y EDICIÓN DE VÍDEOS, ASÍ COMO EL REGISTRO, EDICIÓN Y LA PRESENTACIÓN DE FOTOGRAFÍAS DE LOS ACONTECIMIENTOS, HECHOS Y EVENTOS EXTERNOS E INTERNOS DE LA ALCALDÍA LOCAL, PARA SER UTILIZADOS COMO INSUMOS DE COMUNICACIÓN EN LOS MEDIOS, ESPECIALMENTE ESCRITOS, DIGITALES Y AUDIOVISUALES","Inversión","Un nuevo contrato social y ambiental para la Bogotá del Siglo XXI",57,{"$f":"IF(ISERROR(VLOOKUP(K343,Proposito_programa!$C$2:$E$59,2,FALSE)),\" \",VLOOKUP(K343,Proposito_programa!$C$2:$E$59,2,FALSE))","v":"Gestión pública local"},{"$f":"IF(ISERROR(VLOOKUP(K343,Proposito_programa!$C$2:$E$59,3,FALSE)),\" \",VLOOKUP(K343,Proposito_programa!$C$2:$E$59,3,FALSE))","v":"Propósito 5: Construir Bogotá - Región con gobierno abierto, transparente y ciudadanía consciente"},2105,1,53102636,"ANGELA MARIA DAZA OCAMPO","Persona Natural",null,null,null,null,10344000,null,null,0,10344000,0,"2022-12-01","2022-12-16","2023-02-15",0,0,45,null,null,null,null,"En ejecución",0]
["FDLSF-CPS-319-2022",2022,"FDLSF-CD-184-2022","FDLSF-CPS-319-2022","Contratos de prestación de servicios profesionales y de apoyo a la gestión","Contratación directa","Prestación de servicios profesionales y de apoyo a la gestión, o para la ejecución de trabajos artísticos que sólo puedan encomendarse a determinadas personas naturales","PRESTAR LOS SERVICIOS PROFESIONALES EN LOS TEMAS SOCIALES ASOCIADOS A INFRAESTRUCTURA, PLANEACIÓN, PARTICIPACIÓN Y SEGURIDAD QUE LE SEAN ASIGNADOS, EN PRO DE LA GARANTÍA DE LOS DERECHOS DE LA POBLACIÓN EN LA LOCALIDAD DE SANTA FE","Inversión","Un nuevo contrato social y ambiental para la Bogotá del Siglo XXI",57,{"$f":"IF(ISERROR(VLOOKUP(K344,Proposito_programa!$C$2:$E$59,2,FALSE)),\" \",VLOOKUP(K344,Proposito_programa!$C$2:$E$59,2,FALSE))","v":"Gestión pública local"},{"$f":"IF(ISERROR(VLOOKUP(K344,Proposito_programa!$C$2:$E$59,3,FALSE)),\" \",VLOOKUP(K344,Proposito_programa!$C$2:$E$59,3,FALSE))","v":"Propósito 5: Construir Bogotá - Región con gobierno abierto, transparente y ciudadanía consciente"},2105,1,52709307,"CAROL ANDREA VERGARA PEÑA","Persona Natural",null,null,null,null,4800000,null,null,0,4800000,0,"2022-12-05","2022-12-16","2022-12-31",1,0,0,null,null,null,null,"En ejecución",0]
["FDLSF-CPS-320-2022",2022,"FDLSF-CD-185-2022","FDLSF-CPS-320-2022","Contratos de prestación de servicios profesionales y de apoyo a la gestión","Contratación directa","Prestación de servicios profesionales y de apoyo a la gestión, o para la ejecución de trabajos artísticos que sólo puedan encomendarse a determinadas personas naturales","PRESTAR LOS SERVICIOS PROFESIONALES AL ÁREA DE GESTIÓN DEL DESARROLLO LOCAL DE LA ALCALDÍA LOCAL, PARA APOYAR LA ESTRUCTURACIÓN, EVALUACIÓN Y SEGUIMIENTO DE LOS PROYECTOS, PLANES Y PROGRAMAS RELACIONADOS CON EL MANTENIMIENTO, MEJORAMIENTO Y CONSERVACIÓN DE LA INFRAESTRUCTURA VIAL Y ESPACIO PÚBLICO DE LA LOCALIDAD DE SANTA FE.","Inversión","Un nuevo contrato social y ambiental para la Bogotá del Siglo XXI",57,{"$f":"IF(ISERROR(VLOOKUP(K345,Proposito_programa!$C$2:$E$59,2,FALSE)),\" \",VLOOKUP(K345,Proposito_programa!$C$2:$E$59,2,FALSE))","v":"Gestión pública local"},{"$f":"IF(ISERROR(VLOOKUP(K345,Proposito_programa!$C$2:$E$59,3,FALSE)),\" \",VLOOKUP(K345,Proposito_programa!$C$2:$E$59,3,FALSE))","v":"Propósito 5: Construir Bogotá - Región con gobierno abierto, transparente y ciudadanía consciente"},2105,1,1013663332,"GEIDY DAYANA TRIANA TRIANA","Persona Natural",null,null,null,null,4800000,null,null,0,4800000,0,"2022-12-02","2022-12-07","2022-12-31",1,0,0,null,null,null,null,"En ejecución",0]
["FSDLSF-CPS-321-2022",2022,"FDLSF-CD-186-2022","FSDLSF-CPS-321-2022","Contratos de prestación de servicios profesionales y de apoyo a la gestión","Contratación directa","Prestación de servicios profesionales y de apoyo a la gestión, o para la ejecución de trabajos artísticos que sólo puedan encomendarse a determinadas personas naturales","PRESTAR APOYO AL ÁREA GESTIÓN POLICÍVA Y ÁREA DE GESTIÓN DE DESARROLLO LOCAL EN LA CONDUCCIÓN DEL PARQUE AUTOMOTOR DEL FDLSF QUE LE SEA ASIGNADO.","Inversión","Un nuevo contrato social y ambiental para la Bogotá del Siglo XXI",57,{"$f":"IF(ISERROR(VLOOKUP(K346,Proposito_programa!$C$2:$E$59,2,FALSE)),\" \",VLOOKUP(K346,Proposito_programa!$C$2:$E$59,2,FALSE))","v":"Gestión pública local"},{"$f":"IF(ISERROR(VLOOKUP(K346,Proposito_programa!$C$2:$E$59,3,FALSE)),\" \",VLOOKUP(K346,Proposito_programa!$C$2:$E$59,3,FALSE))","v":"Propósito 5: Construir Bogotá - Región con gobierno abierto, transparente y ciudadanía consciente"},2105,1,14258168,"JOSE IGNACIO HERNANDEZ CANO","Persona Natural",null,null,null,null,5400000,null,null,0,5400000,0,"2022-12-02","2022-12-05","2023-01-31",0,1,30,null,null,null,null,"En ejecución",0]
["FDLSF-COP-322-2022",2022,"FDLSF-LP-006-2022","FDLSF-COP-322-2022","Obra pública","Licitación pública","No aplica","CONTRATAR POR EL SISTEMA DE PRECIOS UNITARIOS LAS OBRAS Y ACTIVIDADES NECESARIAS PARA EL MEJORAMIENTO DE VIVIENDAS EN EL AREA RURAL DE LA LOCALIDAD DE SANTA FE. EN LA CIUDAD DE BOGOTA D.C","Inversión","Un nuevo contrato social y ambiental para la Bogotá del Siglo XXI",19,{"$f":"IF(ISERROR(VLOOKUP(K347,Proposito_programa!$C$2:$E$59,2,FALSE)),\" \",VLOOKUP(K347,Proposito_programa!$C$2:$E$59,2,FALSE))","v":"Vivienda y entornos dignos en el territorio urbano y rural"},{"$f":"IF(ISERROR(VLOOKUP(K347,Proposito_programa!$C$2:$E$59,3,FALSE)),\" \",VLOOKUP(K347,Proposito_programa!$C$2:$E$59,3,FALSE))","v":"Propósito 1: Hacer un nuevo contrato social para incrementar la inclusión social, productiva y política"},2112,5,900402931,"CONSORCIO PROHABITAT","Consorcio","900402931","Inversiones Tierra De Colores SAS",0.5,null,498636857,null,null,0,498636857,0,"2022-12-27","00:00:00","SIN FECHA DE TERMINACION",6,0,0,null,null,null,null,"En ejecución",0]
["FDLSF-COP-322-2022",2022,"FDLSF-LP-006-2022","FDLSF-COP-322-2022","Obra pública","Licitación pública","No aplica","CONTRATAR POR EL SISTEMA DE PRECIOS UNITARIOS LAS OBRAS Y ACTIVIDADES NECESARIAS PARA EL MEJORAMIENTO DE VIVIENDAS EN EL AREA RURAL DE LA LOCALIDAD DE SANTA FE. EN LA CIUDAD DE BOGOTA D.C","Inversión","Un nuevo contrato social y ambiental para la Bogotá del Siglo XXI",19,{"$f":"IF(ISERROR(VLOOKUP(K348,Proposito_programa!$C$2:$E$59,2,FALSE)),\" \",VLOOKUP(K348,Proposito_programa!$C$2:$E$59,2,FALSE))","v":"Vivienda y entornos dignos en el territorio urbano y rural"},{"$f":"IF(ISERROR(VLOOKUP(K348,Proposito_programa!$C$2:$E$59,3,FALSE)),\" \",VLOOKUP(K348,Proposito_programa!$C$2:$E$59,3,FALSE))","v":"Propósito 1: Hacer un nuevo contrato social para incrementar la inclusión social, productiva y política"},2112,null,900402931,"CONSORCIO PROHABITAT","Consorcio","890706424","Corporación Para La Promoción Del\nDesarrollo Rural y Agroindustrial",0.5,null,0,null,null,0,0,0,"2022-12-27","00:00:00","SIN FECHA DE TERMINACION",6,0,0,null,null,null,null,"En ejecución","-"]
["FDLSF-CPS-323-2022",2022,"FDLSF-SAMC-006-2022","FDLSF-CPS-323-2022","Contratos de prestación de servicios","Selección abreviada","No aplica","CONTRATAR LA PRESTACIÓN DE SERVICIOS INTEGRALES PARA EL DESARROLLO DE ACCIONES EN PREVENCIÓN DE VIOLENCIA INTRAFAMILIAR, VIOLENCIA SEXUAL Y OTRAS VULNERACIONES DE DERECHOS DE LOS NIÑOS, NIÑAS, ADOLESCENTES Y SUS FAMILIAS; PROMOVIENDO EL BUEN TRATO CON ENTORNOS PROTECTORES Y TERRITORIOS SEGUROS EN LA LOCALIDAD DE SANTA FE","Inversión","Un nuevo contrato social y ambiental para la Bogotá del Siglo XXI",6,{"$f":"IF(ISERROR(VLOOKUP(K349,Proposito_programa!$C$2:$E$59,2,FALSE)),\" \",VLOOKUP(K349,Proposito_programa!$C$2:$E$59,2,FALSE))","v":"Sistema Distrital de Cuidado"},{"$f":"IF(ISERROR(VLOOKUP(K349,Proposito_programa!$C$2:$E$59,3,FALSE)),\" \",VLOOKUP(K349,Proposito_programa!$C$2:$E$59,3,FALSE))","v":"Propósito 1: Hacer un nuevo contrato social para incrementar la inclusión social, productiva y política"},2188,8,830133329,"FUNDESCO","Persona Jurídica",null,null,null,null,123828194,null,null,0,123828194,0,"00:00:00","00:00:00","SIN FECHA DE TERMINACION",5,0,0,null,null,null,null,"En ejecución",0]
["FDLSF-CON-324-2022",2022,"FDLSF-CMA-005-2022","FDLSF-CON-324-2022","Consultoría","Concurso de méritos","No aplica","INTERVENTORÍA TÉCNICA, ADMINISTRATIVA, FINANCIERA, JURÍDICA, AMBIENTAL Y SOCIAL AL CONTRATO DE OBRA PUBLICA RESULTANTE DEL PROCESO DE LICITACION PUBLICA CUYO OBJETO ES: CONTRATAR A MONTO AGOTABLE, EL DIAGNOSTICO Y LAS OBRAS NECESARIAS PARA LA ADECUACIÓN, MANTENIMIENTO Y/O MEJORAMIENTO DE LOS PARQUES VECINALES Y DE BOLSILLO DE LA LOCALIDAD DE SANTA FE","Inversión","Un nuevo contrato social y ambiental para la Bogotá del Siglo XXI",33,{"$f":"IF(ISERROR(VLOOKUP(K350,Proposito_programa!$C$2:$E$59,2,FALSE)),\" \",VLOOKUP(K350,Proposito_programa!$C$2:$E$59,2,FALSE))","v":"Más árboles y más y mejor espacio público"},{"$f":"IF(ISERROR(VLOOKUP(K350,Proposito_programa!$C$2:$E$59,3,FALSE)),\" \",VLOOKUP(K350,Proposito_programa!$C$2:$E$59,3,FALSE))","v":"Propósito 2 : Cambiar Nuestros Hábitos de Vida para Reverdecer a Bogotá y Adaptarnos y Mitigar la Crisis Climática"},2138,1,900573269,"ENVIRONMENTAL AND GEOMECHANICAL SOLUTIONS EGS SAS","Persona Jurídica",null,null,null,null,85671869,null,null,0,85671869,0,"2022-12-26","00:00:00","SIN FECHA DE TERMINACION",5,0,0,null,null,null,null,"En ejecución",{"$f":"IF(ISERROR(AB350/AA350),\"-\",(AB350/AA350))","v":0}]
["FDLSF-CIN-325-2022",2022,"FDLSF-CMA-006-2022","FDLSF-CIN-325-2022","Interventoría","Concurso de méritos","No aplica","REALIZAR LA INTERVENTORÍA TÉCNICA, ADMINISTRATIVA, FINANCIERA, JURIDICA, SOCIAL, AMBIENTAL Y SST AL CONTRATO DE OBRA PUBLICA QUE TENDRÁ POR OBJETO: REALIZAR A MONTO AGOTABLE, LAS OBRAS Y ACTIVIDADES PARA LA CONSERVACIÓN DE LA MALLA VIAL LOCAL Y SU ESPACIO PÚBLICO ASOCIADO, DE LA LOCALIDAD DE SANTA FE EN BOGOTA D.C.","Inversión","Un nuevo contrato social y ambiental para la Bogotá del Siglo XXI",49,{"$f":"IF(ISERROR(VLOOKUP(K351,Proposito_programa!$C$2:$E$59,2,FALSE)),\" \",VLOOKUP(K351,Proposito_programa!$C$2:$E$59,2,FALSE))","v":"Movilidad segura, sostenible y accesible"},{"$f":"IF(ISERROR(VLOOKUP(K351,Proposito_programa!$C$2:$E$59,3,FALSE)),\" \",VLOOKUP(K351,Proposito_programa!$C$2:$E$59,3,FALSE))","v":"Propósito 4: Hacer de Bogotá Región un modelo de movilidad multimodal, incluyente y sostenible"},2145,22,901649173,"CONSORCIO SANTA FE 2022","Consorcio","79453948","JOHN WILLIAM CASALLAS JURADO",0.2,null,431560573,null,null,0,431560573,0,"00:00:00","00:00:00","SIN FECHA DE TERMINACION",7,0,0,null,null,null,null,"En ejecución",0]
["FDLSF-CIN-325-2022",2022,"FDLSF-CMA-006-2022","FDLSF-CIN-325-2022","Interventoría","Concurso de méritos","No aplica","REALIZAR LA INTERVENTORÍA TÉCNICA, ADMINISTRATIVA, FINANCIERA, JURIDICA, SOCIAL, AMBIENTAL Y SST AL CONTRATO DE OBRA PUBLICA QUE TENDRÁ POR OBJETO: REALIZAR A MONTO AGOTABLE, LAS OBRAS Y ACTIVIDADES PARA LA CONSERVACIÓN DE LA MALLA VIAL LOCAL Y SU ESPACIO PÚBLICO ASOCIADO, DE LA LOCALIDAD DE SANTA FE EN BOGOTA D.C.","Inversión","Un nuevo contrato social y ambiental para la Bogotá del Siglo XXI",49,{"$f":"IF(ISERROR(VLOOKUP(K352,Proposito_programa!$C$2:$E$59,2,FALSE)),\" \",VLOOKUP(K352,Proposito_programa!$C$2:$E$59,2,FALSE))","v":"Movilidad segura, sostenible y accesible"},{"$f":"IF(ISERROR(VLOOKUP(K352,Proposito_programa!$C$2:$E$59,3,FALSE)),\" \",VLOOKUP(K352,Proposito_programa!$C$2:$E$59,3,FALSE))","v":"Propósito 4: Hacer de Bogotá Región un modelo de movilidad multimodal, incluyente y sostenible"},2145,null,901649173,"CONSORCIO SANTA FE 2022","Consorcio","900961137","PROCIVIN S.A.S",0.8,null,0,null,null,0,0,0,"00:00:00","00:00:00","SIN FECHA DE TERMINACION",7,0,0,null,null,null,null,"En ejecución","-"]
["FDLSF-CIA-326-2022",2022,"FDLSF-CD-188-2022","FDLSF-CIA-326-2022","Convenios/Contratos interadministrativos","Contratación directa","Contratos interadministrativos","AUNAR ESFUERZOS PARA LA FORMACIÓN TÉCNICA LABORAL A LOS LÍDERES Y LIDERESAS DEPORTIVOS DE LA LOCALIDAD DE SANTA FE","Inversión","Un nuevo contrato social y ambiental para la Bogotá del Siglo XXI",20,{"$f":"IF(ISERROR(VLOOKUP(K353,Proposito_programa!$C$2:$E$59,2,FALSE)),\" \",VLOOKUP(K353,Proposito_programa!$C$2:$E$59,2,FALSE))","v":"Bogotá, referente en cultura, deporte, recreación y actividad física, con parques para el desarrollo y la salud"},{"$f":"IF(ISERROR(VLOOKUP(K353,Proposito_programa!$C$2:$E$59,3,FALSE)),\" \",VLOOKUP(K353,Proposito_programa!$C$2:$E$59,3,FALSE))","v":"Propósito 1: Hacer un nuevo contrato social para incrementar la inclusión social, productiva y política"},2100,1," 830018957","FODESEP","Persona Jurídica",null,null,null,null,280000000,null,null,0,280000000,0,"00:00:00","00:00:00","SIN FECHA DE TERMINACION",5,0,0,null,null,null,null,"En ejecución",0]
["FDLSF-CCV-327-2022",2022,"FDLSF-SASI-003-2022","FDLSF-CCV-327-2022","Compraventa de bienes muebles","Selección abreviada","No aplica","ADQUIRIR ELEMENTOS ELECTRÓNICOS, MUEBLES Y DEMÁS, REQUERIDOS PARA DOTAR ESCENARIOS CULTURALES DE LA LOCALIDAD DE SANTA FE, DE CONFORMIDAD CON LAS ESPECIFICACIONES TÉCNICAS ESTABLECIDA","Inversión","Un nuevo contrato social y ambiental para la Bogotá del Siglo XXI",21,{"$f":"IF(ISERROR(VLOOKUP(K354,Proposito_programa!$C$2:$E$59,2,FALSE)),\" \",VLOOKUP(K354,Proposito_programa!$C$2:$E$59,2,FALSE))","v":"Creación y vida cotidiana: Apropiación ciudadana del arte, la cultura y el patrimonio, para la democracia cultural"},{"$f":"IF(ISERROR(VLOOKUP(K354,Proposito_programa!$C$2:$E$59,3,FALSE)),\" \",VLOOKUP(K354,Proposito_programa!$C$2:$E$59,3,FALSE))","v":"Propósito 1: Hacer un nuevo contrato social para incrementar la inclusión social, productiva y política"},2110,5,830005066,"UT SICVEL SANTAFE 2022","Unión Temporal","900080875","NTERNACIONAL DE\nCAMARAS Y\nLENTES SAS",0.5,null,407024499,null,null,0,407024499,0,"00:00:00","00:00:00","SIN FECHA DE TERMINACION",3,0,0,null,null,null,null,"En ejecución",0]
["FDLSF-CCV-327-2022",2022,"FDLSF-SASI-003-2022","FDLSF-CCV-327-2022","Compraventa de bienes muebles","Selección abreviada","No aplica","ADQUIRIR ELEMENTOS ELECTRÓNICOS, MUEBLES Y DEMÁS, REQUERIDOS PARA DOTAR ESCENARIOS CULTURALES DE LA LOCALIDAD DE SANTA FE, DE CONFORMIDAD CON LAS ESPECIFICACIONES TÉCNICAS ESTABLECIDA","Inversión","Un nuevo contrato social y ambiental para la Bogotá del Siglo XXI",21,{"$f":"IF(ISERROR(VLOOKUP(K355,Proposito_programa!$C$2:$E$59,2,FALSE)),\" \",VLOOKUP(K355,Proposito_programa!$C$2:$E$59,2,FALSE))","v":"Creación y vida cotidiana: Apropiación ciudadana del arte, la cultura y el patrimonio, para la democracia cultural"},{"$f":"IF(ISERROR(VLOOKUP(K355,Proposito_programa!$C$2:$E$59,3,FALSE)),\" \",VLOOKUP(K355,Proposito_programa!$C$2:$E$59,3,FALSE))","v":"Propósito 1: Hacer un nuevo contrato social para incrementar la inclusión social, productiva y política"},2110,null,830005066,"UT SICVEL SANTAFE 2022","Unión Temporal","830005066","SECURITY VIDEO\nEQUIPMENT SAS",0.5,null,0,null,null,0,0,0,"00:00:00","00:00:00","SIN FECHA DE TERMINACION",3,0,0,null,null,null,null,"En ejecución","-"]
["FDLSF-CCV-328-2022",2022,"FDLSF-SASI-004-2022","FDLSF-CCV-328-2022","Compraventa de bienes muebles","Selección abreviada","No aplica","ADQUISICIÓN, ENTREGA E INSTALACIÓN DE COMPUTADORES DE ESCRITORIO, TABLETS E IMPRESORAS A LAS INSTITUCIONES EDUCATIVAS PUBLICAS DE LA LOCALIDAD DE SANTA FE, SEGÚN LAS ESPECIFICACIONES DESCRITAS EN EL ESTUDIO PREVIO Y SUS DOCUMENTOS ANEXOS, EN EL MARCO DEL PROYECTO 2091 \"FORMACIÓN INTEGRAL EN SANTA FE","Inversión","Un nuevo contrato social y ambiental para la Bogotá del Siglo XXI",14,{"$f":"IF(ISERROR(VLOOKUP(K356,Proposito_programa!$C$2:$E$59,2,FALSE)),\" \",VLOOKUP(K356,Proposito_programa!$C$2:$E$59,2,FALSE))","v":"Formación integral: más y mejor tiempo en los colegios"},{"$f":"IF(ISERROR(VLOOKUP(K356,Proposito_programa!$C$2:$E$59,3,FALSE)),\" \",VLOOKUP(K356,Proposito_programa!$C$2:$E$59,3,FALSE))","v":"Propósito 1: Hacer un nuevo contrato social para incrementar la inclusión social, productiva y política"},2091,4,800089897,"COMERCIALIZADORA SERLE.COM SAS","Persona Jurídica",null,null,null,null,265554092,null,null,0,265554092,0,"2022-12-22","00:00:00","SIN FECHA DE TERMINACION",3,0,0,null,null,null,null,"En ejecución",0]
["FDLSF-CON-329-2022",2022,"FDLSF-CMA-007-2022","FDLSF-CON-329-2022","Consultoría","Selección abreviada","No aplica","INTERVENTORÍA TÉCNICA, ADMINISTRATIVA, LEGAL, FINANCIERA, SOCIAL, AMBIENTAL Y SISTEMA DE SEGURIDAD Y SALUD EN EL TRABAJO - SG-SST, DEL CONTRATO DE OBRA QUE SE DERIVE DE LA LICITACIÓN PUBLICA FDLSF-LP006-2022, LA CUAL TIENE POR OBJETO CONTRATAR POR EL SISTEMA DE PRECIOS UNITARIOS, LAS OBRAS Y ACTIVIDADES NECESARIAS PARA EL MEJORAMIENTO DE VIVIENDAS EN EL AREA RURAL DE LA LOCALIDA:D DE SANTA FE. EN LA CIUDAD DE BOGOTA D.C","Inversión","Un nuevo contrato social y ambiental para la Bogotá del Siglo XXI",19,{"$f":"IF(ISERROR(VLOOKUP(K357,Proposito_programa!$C$2:$E$59,2,FALSE)),\" \",VLOOKUP(K357,Proposito_programa!$C$2:$E$59,2,FALSE))","v":"Vivienda y entornos dignos en el territorio urbano y rural"},{"$f":"IF(ISERROR(VLOOKUP(K357,Proposito_programa!$C$2:$E$59,3,FALSE)),\" \",VLOOKUP(K357,Proposito_programa!$C$2:$E$59,3,FALSE))","v":"Propósito 1: Hacer un nuevo contrato social para incrementar la inclusión social, productiva y política"},2112,2,79696673,"JULIO ANDRES CASTRO GONZALEZ","Persona Natural",null,null,null,null,88671160,null,null,0,88671160,0,"2022-12-28","00:00:00","SIN FECHA DE TERMINACION",6,0,0,null,null,null,null,"En ejecución",0]
["FDLSF-CPS-330-2022",2022,"FDLSF-LP-009-2022","FDLSF-CPS-330-2022","Contratos de prestación de servicios","Licitación pública","No aplica","“CONTRATAR LA PRESTACIÓN DE SERVICIOS LOGÍSTICOS PARA EL DESARROLLO DE ACTIVIDADES Y EVENTOS QUE PROMUEVAN LA PRÁCTICA DEL DEPORTE, LA CULTURA, EL CUIDADO DEL AMBIENTE Y DEMAS ACTIVIDADES ASOCIADAS A LOS PROYECTOS 2100, 2131, 2123, 2110 Y 2156 DE LA LOCALIDAD DE SANTA FE","Inversión","Un nuevo contrato social y ambiental para la Bogotá del Siglo XXI",20,{"$f":"IF(ISERROR(VLOOKUP(K358,Proposito_programa!$C$2:$E$59,2,FALSE)),\" \",VLOOKUP(K358,Proposito_programa!$C$2:$E$59,2,FALSE))","v":"Bogotá, referente en cultura, deporte, recreación y actividad física, con parques para el desarrollo y la salud"},{"$f":"IF(ISERROR(VLOOKUP(K358,Proposito_programa!$C$2:$E$59,3,FALSE)),\" \",VLOOKUP(K358,Proposito_programa!$C$2:$E$59,3,FALSE))","v":"Propósito 1: Hacer un nuevo contrato social para incrementar la inclusión social, productiva y política"},2100,9,830133329,"Fundacion para el desarrollo sociocultural, deportivo, comunitario, agropecuario y/o ambiental FUNDESCO","Persona Jurídica",null,null,null,null,45000000,null,null,0,45000000,0,"2022-12-29","00:00:00","SIN FECHA DE TERMINACION",6,0,0,null,null,null,null,"En ejecución",0]
["FDLSF-CPS-330-2022",2022,"FDLSF-LP-009-2022","FDLSF-CPS-330-2022","Contratos de prestación de servicios","Licitación pública","No aplica","“CONTRATAR LA PRESTACIÓN DE SERVICIOS LOGÍSTICOS PARA EL DESARROLLO DE ACTIVIDADES Y EVENTOS QUE PROMUEVAN LA PRÁCTICA DEL DEPORTE, LA CULTURA, EL CUIDADO DEL AMBIENTE Y DEMAS ACTIVIDADES ASOCIADAS A LOS PROYECTOS 2100, 2131, 2123, 2110 Y 2156 DE LA LOCALIDAD DE SANTA FE","Inversión","Un nuevo contrato social y ambiental para la Bogotá del Siglo XXI",21,{"$f":"IF(ISERROR(VLOOKUP(K359,Proposito_programa!$C$2:$E$59,2,FALSE)),\" \",VLOOKUP(K359,Proposito_programa!$C$2:$E$59,2,FALSE))","v":"Creación y vida cotidiana: Apropiación ciudadana del arte, la cultura y el patrimonio, para la democracia cultural"},{"$f":"IF(ISERROR(VLOOKUP(K359,Proposito_programa!$C$2:$E$59,3,FALSE)),\" \",VLOOKUP(K359,Proposito_programa!$C$2:$E$59,3,FALSE))","v":"Propósito 1: Hacer un nuevo contrato social para incrementar la inclusión social, productiva y política"},2110,9,830133329,"Fundacion para el desarrollo sociocultural, deportivo, comunitario, agropecuario y/o ambiental FUNDESCO","Persona Jurídica",null,null,null,null,235000000,null,null,0,235000000,0,"2022-12-29","00:00:00","SIN FECHA DE TERMINACION",6,0,0,null,null,null,null,"En ejecución",{"$f":"IF(ISERROR(AB359/AA359),\"-\",(AB359/AA359))","v":0}]
["FDLSF-CPS-330-2022",2022,"FDLSF-LP-009-2022","FDLSF-CPS-330-2022","Contratos de prestación de servicios","Licitación pública","No aplica","“CONTRATAR LA PRESTACIÓN DE SERVICIOS LOGÍSTICOS PARA EL DESARROLLO DE ACTIVIDADES Y EVENTOS QUE PROMUEVAN LA PRÁCTICA DEL DEPORTE, LA CULTURA, EL CUIDADO DEL AMBIENTE Y DEMAS ACTIVIDADES ASOCIADAS A LOS PROYECTOS 2100, 2131, 2123, 2110 Y 2156 DE LA LOCALIDAD DE SANTA FE","Inversión","Un nuevo contrato social y ambiental para la Bogotá del Siglo XXI",24,{"$f":"IF(ISERROR(VLOOKUP(K360,Proposito_programa!$C$2:$E$59,2,FALSE)),\" \",VLOOKUP(K360,Proposito_programa!$C$2:$E$59,2,FALSE))","v":"Bogotá región emprendedora e innovadora"},{"$f":"IF(ISERROR(VLOOKUP(K360,Proposito_programa!$C$2:$E$59,3,FALSE)),\" \",VLOOKUP(K360,Proposito_programa!$C$2:$E$59,3,FALSE))","v":"Propósito 1: Hacer un nuevo contrato social para incrementar la inclusión social, productiva y política"},2123,9,830133329,"Fundacion para el desarrollo sociocultural, deportivo, comunitario, agropecuario y/o ambiental FUNDESCO","Persona Jurídica",null,null,null,null,16500000,null,null,0,16500000,0,"2022-12-29","00:00:00","SIN FECHA DE TERMINACION",6,0,0,null,null,null,null,"En ejecución",0]
["FDLSF-CPS-330-2022",2022,"FDLSF-LP-009-2022","FDLSF-CPS-330-2022","Contratos de prestación de servicios","Licitación pública","No aplica","“CONTRATAR LA PRESTACIÓN DE SERVICIOS LOGÍSTICOS PARA EL DESARROLLO DE ACTIVIDADES Y EVENTOS QUE PROMUEVAN LA PRÁCTICA DEL DEPORTE, LA CULTURA, EL CUIDADO DEL AMBIENTE Y DEMAS ACTIVIDADES ASOCIADAS A LOS PROYECTOS 2100, 2131, 2123, 2110 Y 2156 DE LA LOCALIDAD DE SANTA FE","Inversión","Un nuevo contrato social y ambiental para la Bogotá del Siglo XXI",38,{"$f":"IF(ISERROR(VLOOKUP(K361,Proposito_programa!$C$2:$E$59,2,FALSE)),\" \",VLOOKUP(K361,Proposito_programa!$C$2:$E$59,2,FALSE))","v":"Ecoeficiencia, reciclaje, manejo de residuos e inclusión de la población recicladora"},{"$f":"IF(ISERROR(VLOOKUP(K361,Proposito_programa!$C$2:$E$59,3,FALSE)),\" \",VLOOKUP(K361,Proposito_programa!$C$2:$E$59,3,FALSE))","v":"Propósito 2 : Cambiar Nuestros Hábitos de Vida para Reverdecer a Bogotá y Adaptarnos y Mitigar la Crisis Climática"},2131,9,830133329,"Fundacion para el desarrollo sociocultural, deportivo, comunitario, agropecuario y/o ambiental FUNDESCO","Persona Jurídica",null,null,null,null,139500000,null,1,1560000,141060000,0,"2022-12-29","00:00:00","SIN FECHA DE TERMINACION",6,0,0,null,null,null,null,"En ejecución",0]
["FDLSF-CPS-330-2022",2022,"FDLSF-LP-009-2022","FDLSF-CPS-330-2022","Contratos de prestación de servicios","Licitación pública","No aplica","“CONTRATAR LA PRESTACIÓN DE SERVICIOS LOGÍSTICOS PARA EL DESARROLLO DE ACTIVIDADES Y EVENTOS QUE PROMUEVAN LA PRÁCTICA DEL DEPORTE, LA CULTURA, EL CUIDADO DEL AMBIENTE Y DEMAS ACTIVIDADES ASOCIADAS A LOS PROYECTOS 2100, 2131, 2123, 2110 Y 2156 DE LA LOCALIDAD DE SANTA FE","Inversión","Un nuevo contrato social y ambiental para la Bogotá del Siglo XXI",55,{"$f":"IF(ISERROR(VLOOKUP(K362,Proposito_programa!$C$2:$E$59,2,FALSE)),\" \",VLOOKUP(K362,Proposito_programa!$C$2:$E$59,2,FALSE))","v":"Fortalecimiento de cultura ciudadana y su institucionalidad"},{"$f":"IF(ISERROR(VLOOKUP(K362,Proposito_programa!$C$2:$E$59,3,FALSE)),\" \",VLOOKUP(K362,Proposito_programa!$C$2:$E$59,3,FALSE))","v":"Propósito 5: Construir Bogotá - Región con gobierno abierto, transparente y ciudadanía consciente"},2156,9,830133329,"Fundacion para el desarrollo sociocultural, deportivo, comunitario, agropecuario y/o ambiental FUNDESCO","Persona Jurídica",null,null,null,null,28000000,null,null,0,28000000,0,"2022-12-29","00:00:00","SIN FECHA DE TERMINACION",6,0,0,null,null,null,null,"En ejecución",0]
["FDLSF-CIA-331-2022",2022,"FDLSF-CD-190-2022","FDLSF-CIA-331-2022","Convenios/Contratos interadministrativos","Contratación directa","Contratos interadministrativos","PRESTAR LOS SERVICIOS PARA OPERATIVIZAR CENTRO DE ACCESO COMUNITARIO DE TICS EN ZONAS RURALES Y/O APARTADAS EN LA LOCALIDAD DE SANTA FE","Inversión","Un nuevo contrato social y ambiental para la Bogotá del Siglo XXI",54,{"$f":"IF(ISERROR(VLOOKUP(K363,Proposito_programa!$C$2:$E$59,2,FALSE)),\" \",VLOOKUP(K363,Proposito_programa!$C$2:$E$59,2,FALSE))","v":"Transformación digital y gestión de TIC para un territorio inteligente"},{"$f":"IF(ISERROR(VLOOKUP(K363,Proposito_programa!$C$2:$E$59,3,FALSE)),\" \",VLOOKUP(K363,Proposito_programa!$C$2:$E$59,3,FALSE))","v":"Propósito 5: Construir Bogotá - Región con gobierno abierto, transparente y ciudadanía consciente"},2114,1,899999115,"EMPRESA DE TELECOMUNICACIONES DE BOGOTA SA ESP","Persona Jurídica",null,null,null,null,605000000,null,null,0,605000000,0,"2022-12-30","00:00:00","SIN FECHA DE TERMINACION",9,0,0,null,null,null,null,"En ejecución",0]
["FDLSF-CCV-332-2022",2022,"FDLSF-SASI-005-2022","FDLSF-CCV-332-2022","Compraventa de bienes muebles","Selección abreviada","No aplica","ADQUIRIR A TITULO DE COMPRAVENTA ELEMENTOS PARA LA LOGISTICA DE LOS EVENTOS A DESARROLLAR EN LA LOCALIDAD DE SANTA FE","Inversión","Un nuevo contrato social y ambiental para la Bogotá del Siglo XXI",57,{"$f":"IF(ISERROR(VLOOKUP(K364,Proposito_programa!$C$2:$E$59,2,FALSE)),\" \",VLOOKUP(K364,Proposito_programa!$C$2:$E$59,2,FALSE))","v":"Gestión pública local"},{"$f":"IF(ISERROR(VLOOKUP(K364,Proposito_programa!$C$2:$E$59,3,FALSE)),\" \",VLOOKUP(K364,Proposito_programa!$C$2:$E$59,3,FALSE))","v":"Propósito 5: Construir Bogotá - Región con gobierno abierto, transparente y ciudadanía consciente"},2105,3,901061836,"CASTECK SAS","Persona Jurídica",null,null,null,null,75501761,null,null,0,75501761,0,"2022-12-27","00:00:00","SIN FECHA DE TERMINACION",3,0,0,null,null,null,null,"En ejecución",0]
["FDLSF-CV-333-2022",2022,"FDLSF-MC-018-2022","FDLSF-CV-333-2022","Compraventa de bienes muebles","Contratación mínima cuantia","No aplica","CONTRATAR LA ADQUISICIÓN DE LOS BIENES NECESARIOS PARA LA IMPLEMENTACIÓN Y DOTACIÓN DE LA SALA AMIGA DE LA FAMILIA LACTANTE EN EL ENTORNO LABORAL DE LA ALCALDIA LOCAL – FONDO DE DESARROLLO LOCAL DE SANTA FE","Inversión","Un nuevo contrato social y ambiental para la Bogotá del Siglo XXI",57,{"$f":"IF(ISERROR(VLOOKUP(K365,Proposito_programa!$C$2:$E$59,2,FALSE)),\" \",VLOOKUP(K365,Proposito_programa!$C$2:$E$59,2,FALSE))","v":"Gestión pública local"},{"$f":"IF(ISERROR(VLOOKUP(K365,Proposito_programa!$C$2:$E$59,3,FALSE)),\" \",VLOOKUP(K365,Proposito_programa!$C$2:$E$59,3,FALSE))","v":"Propósito 5: Construir Bogotá - Región con gobierno abierto, transparente y ciudadanía consciente"},2105,2,830080652,"SOLUCIONES INTEGRALES DE OFICINA S.A.S","Persona Jurídica",null,null,null,null,7159500,null,null,0,7159500,0,"2022-12-27","00:00:00","SIN FECHA DE TERMINACION",2,0,0,null,null,null,null,"En ejecución",0]
["FDLSF-COP-334-2022",2022,"FDLSF-LP-010-2022","FDLSF-COP-334-2022","Obra pública","Licitación pública","No aplica","CONTRATAR POR EL SISTEMA DE PRECIOS UNITARIOS FIJOS A MONTO AGOTABLE, EL DIAGNOSTICO Y LAS OBRAS DE REPARACIÓN, MANTENIMIENTO Y/O MEJORAMIENTO, REQUERIDAS EN LOS SALONES COMUNALES DE LA LOCALIDAD DE SANTA FE –ALCALDÍA LOCAL DE SANTA FE”","Inversión","Un nuevo contrato social y ambiental para la Bogotá del Siglo XXI",55,{"$f":"IF(ISERROR(VLOOKUP(K366,Proposito_programa!$C$2:$E$59,2,FALSE)),\" \",VLOOKUP(K366,Proposito_programa!$C$2:$E$59,2,FALSE))","v":"Fortalecimiento de cultura ciudadana y su institucionalidad"},{"$f":"IF(ISERROR(VLOOKUP(K366,Proposito_programa!$C$2:$E$59,3,FALSE)),\" \",VLOOKUP(K366,Proposito_programa!$C$2:$E$59,3,FALSE))","v":"Propósito 5: Construir Bogotá - Región con gobierno abierto, transparente y ciudadanía consciente"},2156,11,900402931,"CONSORCIO SANTAFE","Consorcio"," 804013234","SISCOTEL LTDA ",0.15,null,591735652,null,null,0,591735652,0,"2022-12-28","00:00:00","SIN FECHA DE TERMINACION",5,0,0,null,null,null,null,"En ejecución",0]
["FDLSF-COP-334-2022",2022,"FDLSF-LP-010-2022","FDLSF-COP-334-2022","Obra pública","Licitación pública","No aplica","CONTRATAR POR EL SISTEMA DE PRECIOS UNITARIOS FIJOS A MONTO AGOTABLE, EL DIAGNOSTICO Y LAS OBRAS DE REPARACIÓN, MANTENIMIENTO Y/O MEJORAMIENTO, REQUERIDAS EN LOS SALONES COMUNALES DE LA LOCALIDAD DE SANTA FE –ALCALDÍA LOCAL DE SANTA FE”","Inversión","Un nuevo contrato social y ambiental para la Bogotá del Siglo XXI",55,{"$f":"IF(ISERROR(VLOOKUP(K367,Proposito_programa!$C$2:$E$59,2,FALSE)),\" \",VLOOKUP(K367,Proposito_programa!$C$2:$E$59,2,FALSE))","v":"Fortalecimiento de cultura ciudadana y su institucionalidad"},{"$f":"IF(ISERROR(VLOOKUP(K367,Proposito_programa!$C$2:$E$59,3,FALSE)),\" \",VLOOKUP(K367,Proposito_programa!$C$2:$E$59,3,FALSE))","v":"Propósito 5: Construir Bogotá - Región con gobierno abierto, transparente y ciudadanía consciente"},2156,null,900402931,"CONSORCIO SANTAFE","Consorcio"," 900518211","CONSTRUCCIONES Y\nVALORES SAS",0.85,null,0,null,null,0,0,0,"2022-12-28","00:00:00","SIN FECHA DE TERMINACION",5,0,0,null,null,null,null,"En ejecución","-"]
["FDLSF-CV-335-2022",2022,"FDLSF-SASI-006-2022","FDLSF-CV-335-2022","Compraventa de bienes muebles","Selección abreviada","No aplica","ADQUISICIÓN DE ELEMENTOS TECNOLÓGICOS PARA LA ESTACIÓN DE POLICÍA DE LA LOCALIDAD DE SANTA FE.","Inversión","Un nuevo contrato social y ambiental para la Bogotá del Siglo XXI",48,{"$f":"IF(ISERROR(VLOOKUP(K368,Proposito_programa!$C$2:$E$59,2,FALSE)),\" \",VLOOKUP(K368,Proposito_programa!$C$2:$E$59,2,FALSE))","v":"Plataforma institucional para la seguridad y justicia"},{"$f":"IF(ISERROR(VLOOKUP(K368,Proposito_programa!$C$2:$E$59,3,FALSE)),\" \",VLOOKUP(K368,Proposito_programa!$C$2:$E$59,3,FALSE))","v":"Propósito 3: Inspirar confianza y legitimidad para vivir sin miedo y ser epicentro de cultura ciudadana, paz y reconciliación"},2163,6,830145023,"GESCOM SAS","Persona Jurídica",null,null,null,null,450000000,null,null,0,450000000,0,"2022-12-28","00:00:00","SIN FECHA DE TERMINACION",6,0,0,null,null,null,null,"En ejecución",0]
["FDLSF-CIA-336-2022",2022,"FDLSF-CD-189-2022","FDLSF-CIA-336-2022","Convenios/Contratos interadministrativos","Contratación directa","Contratos interadministrativos","COMUNIDAD INDIGENA INGA DE BOGOTA, se compromete con el Fondo de Desarrollo Local a “REALIZAR EL PRIMER ENCUENTRO DE MEDICINA ANCESTRAL DE LOS PUEBLOS INDIGENAS DE LA LOCALIDAD DE SANTA FE","Inversión","Un nuevo contrato social y ambiental para la Bogotá del Siglo XXI",6,{"$f":"IF(ISERROR(VLOOKUP(K369,Proposito_programa!$C$2:$E$59,2,FALSE)),\" \",VLOOKUP(K369,Proposito_programa!$C$2:$E$59,2,FALSE))","v":"Sistema Distrital de Cuidado"},{"$f":"IF(ISERROR(VLOOKUP(K369,Proposito_programa!$C$2:$E$59,3,FALSE)),\" \",VLOOKUP(K369,Proposito_programa!$C$2:$E$59,3,FALSE))","v":"Propósito 1: Hacer un nuevo contrato social para incrementar la inclusión social, productiva y política"},2188,1," 830032429","CABILDO INDIGENA INGA DE BOGOTA, D.C","Persona Jurídica",null,null,null,null,130027056,null,null,0,130027056,0,"2022-12-29","00:00:00","SIN FECHA DE TERMINACION",2,0,0,null,null,null,null,"En ejecución",0]
["FDLSF-CPS-338-2022",2022,"FDLSF-LP-007-2022","FDLSF-CPS-338-2022","Contratos de prestación de servicios","Licitación pública","No aplica","PRESTAR LOS SERVICIOS INTEGRALES PARA EL FORTALECIMIENTO DE ORGANIZACIONES SOCIALES, CAPACITACION EN DERECHOS HUMANOS, Y USO DE LAS TECNOLOGÍAS DE LA INFORMACIÓN, ACCIONES DE PRE-VENCIÓN DE EMBARAZO TEMPRANO Y CONSUMO DE SUSTANCIAS PSI-COACTIVAS EN LA LOCALIDAD DE SANTA FE","Inversión","Un nuevo contrato social y ambiental para la Bogotá del Siglo XXI",6,{"$f":"IF(ISERROR(VLOOKUP(K370,Proposito_programa!$C$2:$E$59,2,FALSE)),\" \",VLOOKUP(K370,Proposito_programa!$C$2:$E$59,2,FALSE))","v":"Sistema Distrital de Cuidado"},{"$f":"IF(ISERROR(VLOOKUP(K370,Proposito_programa!$C$2:$E$59,3,FALSE)),\" \",VLOOKUP(K370,Proposito_programa!$C$2:$E$59,3,FALSE))","v":"Propósito 1: Hacer un nuevo contrato social para incrementar la inclusión social, productiva y política"},2188,7,830133329,"FUNDESCO","Persona Jurídica",null,null,null,null,187552857,null,null,0,187552857,0,"2022-12-29","00:00:00","SIN FECHA DE TERMINACION",6,0,0,null,null,null,null,"En ejecución",0]
["FDLSF-CPS-338-2022",2022,"FDLSF-LP-007-2022","FDLSF-CPS-338-2022","Contratos de prestación de servicios","Licitación pública","No aplica","PRESTAR LOS SERVICIOS INTEGRALES PARA EL FORTALECIMIENTO DE ORGANIZACIONES SOCIALES, CAPACITACION EN DERECHOS HUMANOS, Y USO DE LAS TECNOLOGÍAS DE LA INFORMACIÓN, ACCIONES DE PRE-VENCIÓN DE EMBARAZO TEMPRANO Y CONSUMO DE SUSTANCIAS PSI-COACTIVAS EN LA LOCALIDAD DE SANTA FE","Inversión","Un nuevo contrato social y ambiental para la Bogotá del Siglo XXI",8,{"$f":"IF(ISERROR(VLOOKUP(K371,Proposito_programa!$C$2:$E$59,2,FALSE)),\" \",VLOOKUP(K371,Proposito_programa!$C$2:$E$59,2,FALSE))","v":"Prevención y atención de maternidad temprana"},{"$f":"IF(ISERROR(VLOOKUP(K371,Proposito_programa!$C$2:$E$59,3,FALSE)),\" \",VLOOKUP(K371,Proposito_programa!$C$2:$E$59,3,FALSE))","v":"Propósito 1: Hacer un nuevo contrato social para incrementar la inclusión social, productiva y política"},2064,7,830133329,"FUNDESCO","Persona Jurídica",null,null,null,null,282083147,null,null,0,282083147,0,"2022-12-29","00:00:00","SIN FECHA DE TERMINACION",6,0,0,null,null,null,null,"En ejecución",{"$f":"IF(ISERROR(AB371/AA371),\"-\",(AB371/AA371))","v":0}]
["FDLSF-CPS-338-2022",2022,"FDLSF-LP-007-2022","FDLSF-CPS-338-2022","Contratos de prestación de servicios","Licitación pública","No aplica","PRESTAR LOS SERVICIOS INTEGRALES PARA EL FORTALECIMIENTO DE ORGANIZACIONES SOCIALES, CAPACITACION EN DERECHOS HUMANOS, Y USO DE LAS TECNOLOGÍAS DE LA INFORMACIÓN, ACCIONES DE PRE-VENCIÓN DE EMBARAZO TEMPRANO Y CONSUMO DE SUSTANCIAS PSI-COACTIVAS EN LA LOCALIDAD DE SANTA FE","Inversión","Un nuevo contrato social y ambiental para la Bogotá del Siglo XXI",55,{"$f":"IF(ISERROR(VLOOKUP(K372,Proposito_programa!$C$2:$E$59,2,FALSE)),\" \",VLOOKUP(K372,Proposito_programa!$C$2:$E$59,2,FALSE))","v":"Fortalecimiento de cultura ciudadana y su institucionalidad"},{"$f":"IF(ISERROR(VLOOKUP(K372,Proposito_programa!$C$2:$E$59,3,FALSE)),\" \",VLOOKUP(K372,Proposito_programa!$C$2:$E$59,3,FALSE))","v":"Propósito 5: Construir Bogotá - Región con gobierno abierto, transparente y ciudadanía consciente"},2156,7,830133329,"FUNDESCO","Persona Jurídica",null,null,null,null,229453011,null,null,0,229453011,0,"2022-12-29","00:00:00","SIN FECHA DE TERMINACION",6,0,0,null,null,null,null,"En ejecución",0]
["FDLSF-CPS-339-2022",2022,"FDLSF-LP-008-2022","FDLSF-CPS-339-2022","Contratos de prestación de servicios","Licitación pública","No aplica","PRESTACIÓN DE SERVICIOS PARA LA REPLICA Y FORTALECIMIENTO DE PROCESOS PRODUCTIVOS, ASISTENCIA TÉCNICA AGROPECUARIA Y DE COMERCIALIZACIÓN EN EL SECTOR RURAL DE LA LOCALIDAD DE SANTA FE CONFORME AL PLAN DE MANEJO AMBIENTAL RESERVA FORESTAL PROTECTORA BOSQUE ORIENTAL DE BOGOTÁ","Inversión","Un nuevo contrato social y ambiental para la Bogotá del Siglo XXI",23,{"$f":"IF(ISERROR(VLOOKUP(K373,Proposito_programa!$C$2:$E$59,2,FALSE)),\" \",VLOOKUP(K373,Proposito_programa!$C$2:$E$59,2,FALSE))","v":"Bogotá rural"},{"$f":"IF(ISERROR(VLOOKUP(K373,Proposito_programa!$C$2:$E$59,3,FALSE)),\" \",VLOOKUP(K373,Proposito_programa!$C$2:$E$59,3,FALSE))","v":"Propósito 1: Hacer un nuevo contrato social para incrementar la inclusión social, productiva y política"},2108,3,805003818,"PROTERRITORIO","Persona Jurídica",null,null,null,null,521396774,null,null,0,521396774,0,"2022-12-29","00:00:00","SIN FECHA DE TERMINACION",8,0,0,null,null,null,null,"En ejecución",0]
["FDLSF-COP-340-2022",2022,"FDLSF-SAMC-008.-2022","FDLSF-COP-340-2022","Obra pública","Selección abreviada","Selección abreviada por menor cuantía ","CONTRATAR ACTIVIDADES DE ADECUACION DE LAS OFICINAS DE LA CASA UBICADA EN LA CALLE 21 No 1.35- SEGUNDA FASE PERTENECIENTE AL FONDO DE DESARROLLO LOCAL DE SANTA FÉ”","Inversión","Un nuevo contrato social y ambiental para la Bogotá del Siglo XXI",57,{"$f":"IF(ISERROR(VLOOKUP(K374,Proposito_programa!$C$2:$E$59,2,FALSE)),\" \",VLOOKUP(K374,Proposito_programa!$C$2:$E$59,2,FALSE))","v":"Gestión pública local"},{"$f":"IF(ISERROR(VLOOKUP(K374,Proposito_programa!$C$2:$E$59,3,FALSE)),\" \",VLOOKUP(K374,Proposito_programa!$C$2:$E$59,3,FALSE))","v":"Propósito 5: Construir Bogotá - Región con gobierno abierto, transparente y ciudadanía consciente"},2105,4,900782420,"PROYECTAR INGENIERIA Y ARQUITECTURA SAS","Persona Jurídica",null,null,null,null,71442109,null,null,0,71442109,0,"2022-12-29","00:00:00","SIN FECHA DE TERMINACION",3,0,0,null,null,null,null,"En ejecución",0]
["FDLSF-CPS-341-2022",2022,"FDLSF-MC-019-2022","FDLSF-CPS-341-2022","Contratos de prestación de servicios","Contratación mínima cuantia","No aplica","PRESTAR SERVICIO DE SOPORTE PREVENTIVO Y CORRECTIVO DE ELEMENTOS TECNOLOGICOS PROPIEDAD DEL FONDO DE DESARROLLO LOCAL DE SANTA FE DE CONFORMIDAD CON LA FICHA TECNICA","Funcionamiento",null,"No aplica",{"$f":"IF(ISERROR(VLOOKUP(K375,Proposito_programa!$C$2:$E$59,2,FALSE)),\" \",VLOOKUP(K375,Proposito_programa!$C$2:$E$59,2,FALSE))","v":" "},{"$f":"IF(ISERROR(VLOOKUP(K375,Proposito_programa!$C$2:$E$59,3,FALSE)),\" \",VLOOKUP(K375,Proposito_programa!$C$2:$E$59,3,FALSE))","v":" "},"No aplica",8," 830072707","SECUREXA ENERGY & FIRE SAS","Persona Jurídica",null,null,null,null,23735000,null,null,0,23735000,0,"2022-12-30","00:00:00","SIN FECHA DE TERMINACION",4,0,0,null,null,null,null,"En ejecución",0]
["FDLSF-CIN-342-2022",2022,"FDLSF-MC-017-2022","FDLSF-CIN-342-2022","Interventoría","Contratación mínima cuantia","No aplica","INTERVENTORÍA TÉCNICA AL CONTRATO DE OBRA PUBLICA RESULTANTE DEL PROCESO DE LICITACION PUBLICA CUYO OBJETO ES: \"CONTRATAR POR EL SISTEMA DE PRECIOS UNITARIOS FIJOS A MONTO AGOTABLE, EL DIAGNOSTICO Y LAS OBRAS DE REPARACIÓN, MANTENIMIENTO Y/O MEJORAMIENTO, REQUERIDAS EN LOS SALONES COMUNALES DE LA LOCALIDAD DE SANTA FE – ALCALDÍA LOCAL DE SANTA FE","Inversión","Un nuevo contrato social y ambiental para la Bogotá del Siglo XXI",55,{"$f":"IF(ISERROR(VLOOKUP(K376,Proposito_programa!$C$2:$E$59,2,FALSE)),\" \",VLOOKUP(K376,Proposito_programa!$C$2:$E$59,2,FALSE))","v":"Fortalecimiento de cultura ciudadana y su institucionalidad"},{"$f":"IF(ISERROR(VLOOKUP(K376,Proposito_programa!$C$2:$E$59,3,FALSE)),\" \",VLOOKUP(K376,Proposito_programa!$C$2:$E$59,3,FALSE))","v":"Propósito 5: Construir Bogotá - Región con gobierno abierto, transparente y ciudadanía consciente"},2156,3,79789613,"JORGE HERNAN SÁNCHEZ PINEDA","Persona Natural",null,null,null,null,21862680,null,null,0,21862680,0,"2022-12-30","00:00:00","SIN FECHA DE TERMINACION",2,0,0,null,null,null,null,"En ejecución",0]
["FDLSF-CPS-343-2022",2022,"FDLSF-SAMC-009-2022","FDLSF-CPS-343-2022","Convenios/Contratos interadministrativos","Otros","No aplica","“PRESTAR LOS SERVICIOS INTEGRALES PARA LA REALIZACIÓN DE LAS ACTIVIDADES DE SABERES ANCESTRALES EN MEDICINA AFROCOLOMBIANA DE LOCALIDAD DE SANTA FE","Inversión","Un nuevo contrato social y ambiental para la Bogotá del Siglo XXI",6,{"$f":"IF(ISERROR(VLOOKUP(K377,Proposito_programa!$C$2:$E$59,2,FALSE)),\" \",VLOOKUP(K377,Proposito_programa!$C$2:$E$59,2,FALSE))","v":"Sistema Distrital de Cuidado"},{"$f":"IF(ISERROR(VLOOKUP(K377,Proposito_programa!$C$2:$E$59,3,FALSE)),\" \",VLOOKUP(K377,Proposito_programa!$C$2:$E$59,3,FALSE))","v":"Propósito 1: Hacer un nuevo contrato social para incrementar la inclusión social, productiva y política"},2188,4,830133329,"FUNDESCO","Persona Jurídica",null,null,null,null,129124001,null,null,0,129124001,0,"2022-12-29","00:00:00","SIN FECHA DE TERMINACION",2,0,0,null,null,null,null,"En ejecución",0]
["FDLSF-CUS-344-2022",2022,"FDLSF-SAMC-007-2022","FDLSF-CUS-344-2022","Suministro","Selección abreviada","Selección abreviada por menor cuantía ","CONTRATAR EL SUMINISTRO Y MONTAJE DEL SISTEMA DE OFICINA ABIERTA EN LAS INTALACIONES DE LA ALCALDIA LOCAL DE SANTA FE","Inversión","Un nuevo contrato social y ambiental para la Bogotá del Siglo XXI",57,{"$f":"IF(ISERROR(VLOOKUP(K378,Proposito_programa!$C$2:$E$59,2,FALSE)),\" \",VLOOKUP(K378,Proposito_programa!$C$2:$E$59,2,FALSE))","v":"Gestión pública local"},{"$f":"IF(ISERROR(VLOOKUP(K378,Proposito_programa!$C$2:$E$59,3,FALSE)),\" \",VLOOKUP(K378,Proposito_programa!$C$2:$E$59,3,FALSE))","v":"Propósito 5: Construir Bogotá - Región con gobierno abierto, transparente y ciudadanía consciente"},2105,4," 900616793","DRV INGENIERIA SAS","Persona Jurídica",null,null,null,null,92248293,null,null,0,92248293,0,"00:00:00","00:00:00","SIN FECHA DE TERMINACION",1,0,0,null,null,null,null,"En ejecución",0]
["41400009742022",2022,"41400009742022","FDLSF-CUS-344-2022","Contratos de prestación de servicios","Otros",null,"ADHERIR A LOS FONDOS DE DESARROLLO LOCAL DE ANTONIO NARIÑO, BARRIOS UNIDOS, BOSA, CHAPINERO, CIUDAD BOLIVAR, ENGATIVA, FONTIBON, KENNEDY, PUENTE ARANDA, RAFAEL URIBE URIBE, SAN CRISTOBAL, SUBA, SUMAPAZ, TEUSAQUILLO, TUNJUELITO, USAQUEN, USME,SANTA FE, LOS MARTIRES Y LA CANDELARIA AL CONTRATO INTERADMINISTRATIVO No. 4140000-974-2022 SUSCRITO ENTRE LA SECRETARIA GENERAL DE LA ALCALDIA MAYOR DE BOGOTA D.C. Y CANAL CAPITAL","Inversión","Un nuevo contrato social y ambiental para la Bogotá del Siglo XXI",21,{"$f":"IF(ISERROR(VLOOKUP(K379,Proposito_programa!$C$2:$E$59,2,FALSE)),\" \",VLOOKUP(K379,Proposito_programa!$C$2:$E$59,2,FALSE))","v":"Creación y vida cotidiana: Apropiación ciudadana del arte, la cultura y el patrimonio, para la democracia cultural"},{"$f":"IF(ISERROR(VLOOKUP(K379,Proposito_programa!$C$2:$E$59,3,FALSE)),\" \",VLOOKUP(K379,Proposito_programa!$C$2:$E$59,3,FALSE))","v":"Propósito 1: Hacer un nuevo contrato social para incrementar la inclusión social, productiva y política"},2110,null,"830012587","CANAL CAPITAL","Persona Jurídica",null,null,null,null,100000000,null,null,0,100000000,50000000,"2022-11-24","2022-11-24","2022-12-31",1,0,0,null,null,null,null,"En ejecución",0.5]
["O.C. 85247-2022",2022,"O.C. 85247-2022","O.C. 85247-2022","Contratos de prestación de servicios","Otros","No aplica","Prestar el servicio de aseo y cafeteria incluido: Recurso Humano, maquinaria y equipos necesarios para el desarrollo del proceso, además del suministro de insumos para las diferentes sedes de la Alcaldía Local de Santa Fe, incluida las inspecciones de policía, la Casa de la participación, la Junta Administradora Local","Funcionamiento",null,"No aplica",{"$f":"IF(ISERROR(VLOOKUP(K380,Proposito_programa!$C$2:$E$59,2,FALSE)),\" \",VLOOKUP(K380,Proposito_programa!$C$2:$E$59,2,FALSE))","v":" "},{"$f":"IF(ISERROR(VLOOKUP(K380,Proposito_programa!$C$2:$E$59,3,FALSE)),\" \",VLOOKUP(K380,Proposito_programa!$C$2:$E$59,3,FALSE))","v":" "},"No aplica",1,830068543,"MUNDOLIMPIEZA LTDA","Persona Jurídica",null,null,null,null,99116236,null,1,493697,99609933,69860738,"2022-02-14","2022-02-14","2023-01-15",11,0,0,null,null,null,null,"En ejecución",0.70134308794284606]
["94036-2022",2022,"O.C. 94036-2022","94036-2022","Compraventa de bienes muebles","Otros","No aplica","ADQUIRIR LICENCIAS MICROSOFT OFFICE 365 – E1, LICENCIAS MICROSOFT OFFICE 365 – E3 y LICENCIAS MICROSOFT OFFICE 365 – E5","Inversión","Un nuevo contrato social y ambiental para la Bogotá del Siglo XXI",57,{"$f":"IF(ISERROR(VLOOKUP(K381,Proposito_programa!$C$2:$E$59,2,FALSE)),\" \",VLOOKUP(K381,Proposito_programa!$C$2:$E$59,2,FALSE))","v":"Gestión pública local"},{"$f":"IF(ISERROR(VLOOKUP(K381,Proposito_programa!$C$2:$E$59,3,FALSE)),\" \",VLOOKUP(K381,Proposito_programa!$C$2:$E$59,3,FALSE))","v":"Propósito 5: Construir Bogotá - Región con gobierno abierto, transparente y ciudadanía consciente"},2105,1,901374618,"UNION TEMPORAL NIMBIT","Unión Temporal","900372035","ITO SOFTWARE S.A.S",0.6,null,133946279,null,null,0,133946279,133946278,"2022-07-29","2022-07-29","2022-08-28",1,0,0,null,null,null,null,"En ejecución",0.99999999253432037]
["94036-2022",2022,"O.C. 94036-2022","94036-2022","Compraventa de bienes muebles","Otros","No aplica","ADQUIRIR LICENCIAS MICROSOFT OFFICE 365 – E1, LICENCIAS MICROSOFT OFFICE 365 – E3 y LICENCIAS MICROSOFT OFFICE 365 – E5","Inversión","Un nuevo contrato social y ambiental para la Bogotá del Siglo XXI",57,{"$f":"IF(ISERROR(VLOOKUP(K382,Proposito_programa!$C$2:$E$59,2,FALSE)),\" \",VLOOKUP(K382,Proposito_programa!$C$2:$E$59,2,FALSE))","v":"Gestión pública local"},{"$f":"IF(ISERROR(VLOOKUP(K382,Proposito_programa!$C$2:$E$59,3,FALSE)),\" \",VLOOKUP(K382,Proposito_programa!$C$2:$E$59,3,FALSE))","v":"Propósito 5: Construir Bogotá - Región con gobierno abierto, transparente y ciudadanía consciente"},2105,null,901374618,"UNION TEMPORAL NIMBIT","Unión Temporal","900672953","NIMBUTECH S.A.S",0.4,null,0,null,null,0,0,0,"2022-07-29","2022-07-29","2022-08-28",1,0,0,null,null,null,null,"En ejecución","-"]
["95772-2022",2022,"O.C. 95772-2022","95772-2022","Suministro","Otros","No aplica","CONTRATAR EL SUMINISTRO DE MATERIALES DE CONSTRUCCIÓN Y FERRETERIA REQUERIDOS PARA EL DESARROLLO DE LA ESTRATEGIA JUNTOS CUIDAMOS BOGOTÁ, PARA LAS INTERVENCIONES AMBIENTALES DE FOMENTO DE AGRICULTURA URBANA Y COBERTURAS VERDES EN LA LOCALIDAD DE SANTA FE, ASI COMO LOS ELEMENTOS NECESARIOS PARA EL MANTENIMIENTO Y REPARACIONES LOCATIVAS MENORES EN LAS SEDES DE LA ALCALDÍA LOCAL DE SANTA FE, BAJO LAS CONDICIONES DEL ACUERDO MARCO DE PRECIOS CCE-255-1-AMP-2021","Inversión","Un nuevo contrato social y ambiental para la Bogotá del Siglo XXI",24,{"$f":"IF(ISERROR(VLOOKUP(K383,Proposito_programa!$C$2:$E$59,2,FALSE)),\" \",VLOOKUP(K383,Proposito_programa!$C$2:$E$59,2,FALSE))","v":"Bogotá región emprendedora e innovadora"},{"$f":"IF(ISERROR(VLOOKUP(K383,Proposito_programa!$C$2:$E$59,3,FALSE)),\" \",VLOOKUP(K383,Proposito_programa!$C$2:$E$59,3,FALSE))","v":"Propósito 1: Hacer un nuevo contrato social para incrementar la inclusión social, productiva y política"},2123,1,900117244,"ARINTIA GROUP SAS","Persona Jurídica",null,null,null,null,15000000,null,null,0,15000000,0,"2022-09-09","2022-09-09","2023-03-08",6,0,0,null,null,null,null,"En ejecución",0]
["95772-2022",2022,"O.C. 95772-2022","95772-2022","Suministro","Otros","No aplica","CONTRATAR EL SUMINISTRO DE MATERIALES DE CONSTRUCCIÓN Y FERRETERIA REQUERIDOS PARA EL DESARROLLO DE LA ESTRATEGIA JUNTOS CUIDAMOS BOGOTÁ, PARA LAS INTERVENCIONES AMBIENTALES DE FOMENTO DE AGRICULTURA URBANA Y COBERTURAS VERDES EN LA LOCALIDAD DE SANTA FE, ASI COMO LOS ELEMENTOS NECESARIOS PARA EL MANTENIMIENTO Y REPARACIONES LOCATIVAS MENORES EN LAS SEDES DE LA ALCALDÍA LOCAL DE SANTA FE, BAJO LAS CONDICIONES DEL ACUERDO MARCO DE PRECIOS CCE-255-1-AMP-2021","Inversión","Un nuevo contrato social y ambiental para la Bogotá del Siglo XXI",49,{"$f":"IF(ISERROR(VLOOKUP(K384,Proposito_programa!$C$2:$E$59,2,FALSE)),\" \",VLOOKUP(K384,Proposito_programa!$C$2:$E$59,2,FALSE))","v":"Movilidad segura, sostenible y accesible"},{"$f":"IF(ISERROR(VLOOKUP(K384,Proposito_programa!$C$2:$E$59,3,FALSE)),\" \",VLOOKUP(K384,Proposito_programa!$C$2:$E$59,3,FALSE))","v":"Propósito 4: Hacer de Bogotá Región un modelo de movilidad multimodal, incluyente y sostenible"},2145,1,900117244,"ARINTIA GROUP SAS","Persona Jurídica",null,null,null,null,105610464,null,null,0,105610464,0,"2022-09-09","2022-09-09","2023-03-08",6,0,0,null,null,null,null,"En ejecución",{"$f":"IF(ISERROR(AB384/AA384),\"-\",(AB384/AA384))","v":0}]
["95772-2022",2022,"O.C. 95772-2022","95772-2022","Suministro","Otros","No aplica","CONTRATAR EL SUMINISTRO DE MATERIALES DE CONSTRUCCIÓN Y FERRETERIA REQUERIDOS PARA EL DESARROLLO DE LA ESTRATEGIA JUNTOS CUIDAMOS BOGOTÁ, PARA LAS INTERVENCIONES AMBIENTALES DE FOMENTO DE AGRICULTURA URBANA Y COBERTURAS VERDES EN LA LOCALIDAD DE SANTA FE, ASI COMO LOS ELEMENTOS NECESARIOS PARA EL MANTENIMIENTO Y REPARACIONES LOCATIVAS MENORES EN LAS SEDES DE LA ALCALDÍA LOCAL DE SANTA FE, BAJO LAS CONDICIONES DEL ACUERDO MARCO DE PRECIOS CCE-255-1-AMP-2021","Funcionamiento",null,"No aplica",{"$f":"IF(ISERROR(VLOOKUP(K385,Proposito_programa!$C$2:$E$59,2,FALSE)),\" \",VLOOKUP(K385,Proposito_programa!$C$2:$E$59,2,FALSE))","v":" "},{"$f":"IF(ISERROR(VLOOKUP(K385,Proposito_programa!$C$2:$E$59,3,FALSE)),\" \",VLOOKUP(K385,Proposito_programa!$C$2:$E$59,3,FALSE))","v":" "},"No aplica",1,900117244,"ARINTIA GROUP SAS","Persona Jurídica",null,null,null,null,18300000,null,null,0,18300000,0,"2022-09-09","2022-09-09","2023-03-08",6,0,0,null,null,null,null,"En ejecución",0]
[2262020,2022,"O.C. 2262020",2262020,"Suministro","Otros","No aplica","ADICIÓN No. 1 AL CONTRATO No. FDLSF-CS-226-2020 CUYO OBJETO ES: SUMINISTRO DE ELEMENTOS DE FERRETERÍA NECESARIOS PARA REALIZAR EL MANTENIMIENTO Y/O LAS REPARACIONES LOCATIVAS MENORES DONDE FUNCIONAN LAS SEDES DE LA ALCALDÍA LOCAL DE SANTA FE","Funcionamiento",null,"No aplica",{"$f":"IF(ISERROR(VLOOKUP(K386,Proposito_programa!$C$2:$E$59,2,FALSE)),\" \",VLOOKUP(K386,Proposito_programa!$C$2:$E$59,2,FALSE))","v":" "},{"$f":"IF(ISERROR(VLOOKUP(K386,Proposito_programa!$C$2:$E$59,3,FALSE)),\" \",VLOOKUP(K386,Proposito_programa!$C$2:$E$59,3,FALSE))","v":" "},"No aplica",1,"900960810","DIEGO CASTRO INDUSTRIA Y CONSTRUCCION S A S","Persona Jurídica",null,null,null,null,5178692,null,null,0,5178692,5158673,"2022-03-31","2022-03-31","2022-12-31",6,0,0,null,null,null,null,"En ejecución",0.99613435207191314]
["99754-2022",2022,"O.C. 99754-2022","99754-2022","Compraventa de bienes muebles","Otros","No aplica","COMPRAVENTA DE ELEMENTOS TECNOLÓGICOS PARA EL FORTALECIMIENTO DEL MATERIAL AUDIOVISUAL DE LA OFICINA DEL PRENSA DEL FDLSF.","Inversión","Un nuevo contrato social y ambiental para la Bogotá del Siglo XXI",57,{"$f":"IF(ISERROR(VLOOKUP(K387,Proposito_programa!$C$2:$E$59,2,FALSE)),\" \",VLOOKUP(K387,Proposito_programa!$C$2:$E$59,2,FALSE))","v":"Gestión pública local"},{"$f":"IF(ISERROR(VLOOKUP(K387,Proposito_programa!$C$2:$E$59,3,FALSE)),\" \",VLOOKUP(K387,Proposito_programa!$C$2:$E$59,3,FALSE))","v":"Propósito 5: Construir Bogotá - Región con gobierno abierto, transparente y ciudadanía consciente"},2105,1,"830037946-3","PANAMERICANA LIBRERÍA Y PAPELERÍA S.A.","Persona Jurídica",null,null,null,null,27736401,null,null,0,27736401,0,"2022-11-18","2022-11-28","2022-12-08",0,0,0,null,null,null,null,"En ejecución",0]
["100293-2022",2022,"O.C. 100293-2022","100293-2022","Compraventa de bienes muebles","Otros","No aplica","ADQUISICIÓN DE VEHÍCULOS PARA RENOVACIÓN DEL PARQUE AUTOMOTOR DEL FONDO DE DESARROLLO SANTA FE. (CAMION)","Inversión","Un nuevo contrato social y ambiental para la Bogotá del Siglo XXI",57,{"$f":"IF(ISERROR(VLOOKUP(K388,Proposito_programa!$C$2:$E$59,2,FALSE)),\" \",VLOOKUP(K388,Proposito_programa!$C$2:$E$59,2,FALSE))","v":"Gestión pública local"},{"$f":"IF(ISERROR(VLOOKUP(K388,Proposito_programa!$C$2:$E$59,3,FALSE)),\" \",VLOOKUP(K388,Proposito_programa!$C$2:$E$59,3,FALSE))","v":"Propósito 5: Construir Bogotá - Región con gobierno abierto, transparente y ciudadanía consciente"},2105,1,900117244,"ARINTIA GROUP SAS","Persona Jurídica",null,null,null,null,178646799,null,null,0,178646799,0,"00:00:00","00:00:00","SIN FECHA DE TERMINACION",0,0,0,null,null,null,null,"En ejecución",0]
["102511-2022",2022,"O.C. 102511-2022","102511-2022","Compraventa de bienes muebles","Otros","No aplica","ADQUISICIÓN DE UN VEHÍCULO TIPO MICROBUS PARA LA RENOVACIÓN DEL PARQUE AUTOMOTOR DEL FONDO DE DESARROLLO SANTA FE","Inversión","Un nuevo contrato social y ambiental para la Bogotá del Siglo XXI",57,{"$f":"IF(ISERROR(VLOOKUP(K389,Proposito_programa!$C$2:$E$59,2,FALSE)),\" \",VLOOKUP(K389,Proposito_programa!$C$2:$E$59,2,FALSE))","v":"Gestión pública local"},{"$f":"IF(ISERROR(VLOOKUP(K389,Proposito_programa!$C$2:$E$59,3,FALSE)),\" \",VLOOKUP(K389,Proposito_programa!$C$2:$E$59,3,FALSE))","v":"Propósito 5: Construir Bogotá - Región con gobierno abierto, transparente y ciudadanía consciente"},2105,1,"860034604-5","AUTOMAYOR S.A.","Persona Jurídica",null,null,null,null,295742635,null,null,0,295742635,0,"00:00:00","00:00:00","SIN FECHA DE TERMINACION",0,0,0,null,null,null,null,"En ejecución",0]
["102900-2022",2022,"O.C. 102900-2022","102900-2022","Compraventa de bienes muebles","Otros","No aplica","COMPRAVENTA DE SISTEMA DE SONIDO Y PLANTA ELECTRICA PARA EL FONDO DE DESARROLLO LOCAL DE SANTA FE, DE ACUERDO CON LAS ESPECIFICACIONES TECNICAS SOLICITADAS","Inversión","Un nuevo contrato social y ambiental para la Bogotá del Siglo XXI",57,{"$f":"IF(ISERROR(VLOOKUP(K390,Proposito_programa!$C$2:$E$59,2,FALSE)),\" \",VLOOKUP(K390,Proposito_programa!$C$2:$E$59,2,FALSE))","v":"Gestión pública local"},{"$f":"IF(ISERROR(VLOOKUP(K390,Proposito_programa!$C$2:$E$59,3,FALSE)),\" \",VLOOKUP(K390,Proposito_programa!$C$2:$E$59,3,FALSE))","v":"Propósito 5: Construir Bogotá - Región con gobierno abierto, transparente y ciudadanía consciente"},2105,1,"900365660-2","PROVEER INSTITUCIONAL SAS","Persona Jurídica",null,null,null,null,21588000,null,null,0,21588000,0,"2022-12-22","2022-12-22","2022-12-30",0,0,0,null,null,null,null,"En ejecución",0]
["102903-2022",2022,"O.C 102903-2022","102903-2022","Compraventa de bienes muebles","Otros","No aplica","COMPRAVENTA DE SISTEMA DE SONIDO Y PLANTA ELECTRICA PARA EL FONDO DE DESARROLLO LOCAL DE SANTA FE, DE ACUERDO CON LAS ESPECIFICACIONES TECNICAS SOLICITADAS","Inversión","Un nuevo contrato social y ambiental para la Bogotá del Siglo XXI",57,{"$f":"IF(ISERROR(VLOOKUP(K391,Proposito_programa!$C$2:$E$59,2,FALSE)),\" \",VLOOKUP(K391,Proposito_programa!$C$2:$E$59,2,FALSE))","v":"Gestión pública local"},{"$f":"IF(ISERROR(VLOOKUP(K391,Proposito_programa!$C$2:$E$59,3,FALSE)),\" \",VLOOKUP(K391,Proposito_programa!$C$2:$E$59,3,FALSE))","v":"Propósito 5: Construir Bogotá - Región con gobierno abierto, transparente y ciudadanía consciente"},2105,1,8002374121,"FERRICENTROS SAS","Persona Jurídica",null,null,null,null,1356058,null,null,0,1356058,0,"2022-12-22","2022-12-22","2022-12-30",0,0,0,null,null,null,null,"En ejecución",0]
["FDLSF-CIA-671-2022",2022,"FDLSF-CD-121-2022","FDLSF-CIA-671-2022","Convenios/Contratos interadministrativos","Contratación directa","Contratos interadministrativos","AUNAR ESFUERZOS ADMINISTRATIVOS TÉCNICOS Y LOGÍSTICOS PARA EL CUMPLIMIENTO DE LAS METAS RELACIONADAS CON EL DESARROLLO, CONSOLIDACIÓN Y FORTALECIMIENTO DE LA ECONOMÍA DISTRITAL EN LAS LOCALIDADES PARTICIPANTES","Inversión","Un nuevo contrato social y ambiental para la Bogotá del Siglo XXI","No aplica",{"$f":"IF(ISERROR(VLOOKUP(K392,Proposito_programa!$C$2:$E$59,2,FALSE)),\" \",VLOOKUP(K392,Proposito_programa!$C$2:$E$59,2,FALSE))","v":" "},{"$f":"IF(ISERROR(VLOOKUP(K392,Proposito_programa!$C$2:$E$59,3,FALSE)),\" \",VLOOKUP(K392,Proposito_programa!$C$2:$E$59,3,FALSE))","v":" "},null,1,899999061,"SECRETARÍA DISTRITAL DE DESARROLLO ECONÓMICO ","Persona Jurídica",null,null,null,null,0,null,null,0,0,0,"2022-07-27","2022-08-08","2023-08-07",12,0,0,null,null,null,null,"En ejecución","-"]
["FDLSF-CIN-446-2022",2022,"FDLSF-CD-107-2022","FDLSF-CIN-446-2022","Convenios/Contratos interadministrativos","Contratación directa","Contratos interadministrativos","AUNAR ESFUERZOS TÉCNICOS, ADMINISTRATIVOS Y FINANCIEROS CON EL FIN DE DESARROLLAR ACCIONES ARTICULADAS ENTRE LA SCRD, LA FUGA Y LOS FONDOS DE DESARROLLO LOCAL, ORIENTADAS A FOMENTAR PROCESOS DE FORMACIÓN, CUALIFICACIÓN, FORTALECIMIENTO DE LOS AGENTES CULTURALES TERRITORIALES DEL DISTRITO CAPITAL, EN EL MARCO DE LA GENERACIÓN Y CIRCULACIÓN DE BIENES Y SERVICIOS CULTURALES, ARTÍSTICOS Y PATRIMONIALES, DE CONFORMIDAD CON LAS INICIATIVAS PRIORIZADAS Y CONCERTADAS EN LA ESTRATEGIA DISTRITAL \"PRESUPUESTOS PARTICIPATIVOS\" Y/O DE LAS CONCERTACIONES CON LOS GRUPOS DE INTERÉS DE LAS LOCALIDADES Y A LAS ACCIONES ADELANTADAS EN EL “PROCESO MISIONAL DE FOMENTO”, DE ACUERDO CON LOS PROYECTOS A EJECUTAR ASOCIADOS A LAS METAS DE CADA LOCALIDAD EN EL PROGRAMA \"ES CULTURA LOCAL 2022","Inversión","Un nuevo contrato social y ambiental para la Bogotá del Siglo XXI",24,{"$f":"IF(ISERROR(VLOOKUP(K393,Proposito_programa!$C$2:$E$59,2,FALSE)),\" \",VLOOKUP(K393,Proposito_programa!$C$2:$E$59,2,FALSE))","v":"Bogotá región emprendedora e innovadora"},{"$f":"IF(ISERROR(VLOOKUP(K393,Proposito_programa!$C$2:$E$59,3,FALSE)),\" \",VLOOKUP(K393,Proposito_programa!$C$2:$E$59,3,FALSE))","v":"Propósito 1: Hacer un nuevo contrato social para incrementar la inclusión social, productiva y política"},2123,1,860044113,"FUNDACIÓN GILBERTO ALZATE AVENDAÑO -FUGA-","Persona Jurídica",null,null,null,null,589086000,null,null,0,589086000,555093224,"2022-07-08","2022-07-18","2023-08-31",12,0,0,null,null,null,null,"Terminado",0.94229573271135281]
["FDLSF-CIN-446-2022",2022,"FDLSF-CD-107-2022","FDLSF-CIN-446-2022","Convenios/Contratos interadministrativos","Contratación directa","Contratos interadministrativos","AUNAR ESFUERZOS TÉCNICOS, ADMINISTRATIVOS Y FINANCIEROS CON EL FIN DE DESARROLLAR ACCIONES ARTICULADAS ENTRE LA SCRD, LA FUGA Y LOS FONDOS DE DESARROLLO LOCAL, ORIENTADAS A FOMENTAR PROCESOS DE FORMACIÓN, CUALIFICACIÓN, FORTALECIMIENTO DE LOS AGENTES CULTURALES TERRITORIALES DEL DISTRITO CAPITAL, EN EL MARCO DE LA GENERACIÓN Y CIRCULACIÓN DE BIENES Y SERVICIOS CULTURALES, ARTÍSTICOS Y PATRIMONIALES, DE CONFORMIDAD CON LAS INICIATIVAS PRIORIZADAS Y CONCERTADAS EN LA ESTRATEGIA DISTRITAL \"PRESUPUESTOS PARTICIPATIVOS\" Y/O DE LAS CONCERTACIONES CON LOS GRUPOS DE INTERÉS DE LAS LOCALIDADES Y A LAS ACCIONES ADELANTADAS EN EL “PROCESO MISIONAL DE FOMENTO”, DE ACUERDO CON LOS PROYECTOS A EJECUTAR ASOCIADOS A LAS METAS DE CADA LOCALIDAD EN EL PROGRAMA \"ES CULTURA LOCAL 2022","Inversión","Un nuevo contrato social y ambiental para la Bogotá del Siglo XXI",21,{"$f":"IF(ISERROR(VLOOKUP(K394,Proposito_programa!$C$2:$E$59,2,FALSE)),\" \",VLOOKUP(K394,Proposito_programa!$C$2:$E$59,2,FALSE))","v":"Creación y vida cotidiana: Apropiación ciudadana del arte, la cultura y el patrimonio, para la democracia cultural"},{"$f":"IF(ISERROR(VLOOKUP(K394,Proposito_programa!$C$2:$E$59,3,FALSE)),\" \",VLOOKUP(K394,Proposito_programa!$C$2:$E$59,3,FALSE))","v":"Propósito 1: Hacer un nuevo contrato social para incrementar la inclusión social, productiva y política"},2110,1,860044113,"FUNDACIÓN GILBERTO ALZATE AVENDAÑO -FUGA-","Persona Jurídica",null,null,null,null,777000000,null,null,0,777000000,710864172,"2022-07-08","2022-07-18","2023-08-31",12,0,0,null,null,null,null,"Terminado",{"$f":"IF(ISERROR(AB394/AA394),\"-\",(AB394/AA394))","v":0.91488310424710428}]
["FDLSF-CIN-446-2022",2022,"FDLSF-CD-107-2022","FDLSF-CIN-446-2022","Convenios/Contratos interadministrativos","Contratación directa","Contratos interadministrativos","AUNAR ESFUERZOS TÉCNICOS, ADMINISTRATIVOS Y FINANCIEROS CON EL FIN DE DESARROLLAR ACCIONES ARTICULADAS ENTRE LA SCRD, LA FUGA Y LOS FONDOS DE DESARROLLO LOCAL, ORIENTADAS A FOMENTAR PROCESOS DE FORMACIÓN, CUALIFICACIÓN, FORTALECIMIENTO DE LOS AGENTES CULTURALES TERRITORIALES DEL DISTRITO CAPITAL, EN EL MARCO DE LA GENERACIÓN Y CIRCULACIÓN DE BIENES Y SERVICIOS CULTURALES, ARTÍSTICOS Y PATRIMONIALES, DE CONFORMIDAD CON LAS INICIATIVAS PRIORIZADAS Y CONCERTADAS EN LA ESTRATEGIA DISTRITAL \"PRESUPUESTOS PARTICIPATIVOS\" Y/O DE LAS CONCERTACIONES CON LOS GRUPOS DE INTERÉS DE LAS LOCALIDADES Y A LAS ACCIONES ADELANTADAS EN EL “PROCESO MISIONAL DE FOMENTO”, DE ACUERDO CON LOS PROYECTOS A EJECUTAR ASOCIADOS A LAS METAS DE CADA LOCALIDAD EN EL PROGRAMA \"ES CULTURA LOCAL 2022","Inversión","Un nuevo contrato social y ambiental para la Bogotá del Siglo XXI",6,{"$f":"IF(ISERROR(VLOOKUP(K395,Proposito_programa!$C$2:$E$59,2,FALSE)),\" \",VLOOKUP(K395,Proposito_programa!$C$2:$E$59,2,FALSE))","v":"Sistema Distrital de Cuidado"},{"$f":"IF(ISERROR(VLOOKUP(K395,Proposito_programa!$C$2:$E$59,3,FALSE)),\" \",VLOOKUP(K395,Proposito_programa!$C$2:$E$59,3,FALSE))","v":"Propósito 1: Hacer un nuevo contrato social para incrementar la inclusión social, productiva y política"},2188,1,860044113,"FUNDACIÓN GILBERTO ALZATE AVENDAÑO -FUGA-","Persona Jurídica",null,null,null,null,366000000,null,null,0,366000000,363283004,"2022-07-08","2022-07-18","2023-08-31",12,0,0,null,null,null,null,"Terminado",0.99257651366120214]
["103309-2022",2022,"O.C. 103309-2022","103309-2022","Suministro","Otros","No aplica","CONTRATAR EL SUMINISTRO DE ALIMENTOS Y MEDICAMENTOS PARA ANIMALES EN LA LOCALIDAD DE SANTA FE, BAJO LAS CONDICIONES DEL ACUERDO MARCO DE PRECIOS CCE-282-1-AMP-2021","Inversión","Un nuevo contrato social y ambiental para la Bogotá del Siglo XXI",34,{"$f":"IF(ISERROR(VLOOKUP(K396,Proposito_programa!$C$2:$E$59,2,FALSE)),\" \",VLOOKUP(K396,Proposito_programa!$C$2:$E$59,2,FALSE))","v":"Bogotá protectora de los animales"},{"$f":"IF(ISERROR(VLOOKUP(K396,Proposito_programa!$C$2:$E$59,3,FALSE)),\" \",VLOOKUP(K396,Proposito_programa!$C$2:$E$59,3,FALSE))","v":"Propósito 2 : Cambiar Nuestros Hábitos de Vida para Reverdecer a Bogotá y Adaptarnos y Mitigar la Crisis Climática"},2074,2,830043063,"CONCENTRADOS EL RANCHO LTDA DROGUERIA VETERINARIA","Persona Jurídica",null,null,null,null,19977531,null,null,0,19977531,0,"2022-12-27","2023-02-08","2023-11-07",9,0,0,null,null,null,null,"En ejecución",0]
["103310-2022",2022,"O.C. 103310-2022","103310-2022","Suministro","Otros","No aplica","CONTRATAR EL SUMINISTRO DE ALIMENTOS Y MEDICAMENTOS PARA ANIMALES EN LA LOCALIDAD DE SANTA FE, BAJO LAS CONDICIONES DEL ACUERDO MARCO DE PRECIOS CCE-282-1-AMP-2021","Inversión","Un nuevo contrato social y ambiental para la Bogotá del Siglo XXI",23,{"$f":"IF(ISERROR(VLOOKUP(K397,Proposito_programa!$C$2:$E$59,2,FALSE)),\" \",VLOOKUP(K397,Proposito_programa!$C$2:$E$59,2,FALSE))","v":"Bogotá rural"},{"$f":"IF(ISERROR(VLOOKUP(K397,Proposito_programa!$C$2:$E$59,3,FALSE)),\" \",VLOOKUP(K397,Proposito_programa!$C$2:$E$59,3,FALSE))","v":"Propósito 1: Hacer un nuevo contrato social para incrementar la inclusión social, productiva y política"},2108,2,901266959,"MUNDIAL DE SUMINISTROS Y CONTRATOS S.A.S","Persona Jurídica",null,null,null,null,29161737,null,null,0,29161737,0,"2022-12-27","2023-02-08","2023-11-07",9,0,0,null,null,null,null,"En ejecución",0]
["103540-2022",2022,"O.C. 103540-2022","103540-2022","Compraventa de bienes muebles","Otros","No aplica","ADQUISICIÓN DE EQUIPOS DE COMPUTO PARA LAS DIFERENTES OFICINAS DEL FONDO DE DESARROLLO SANTA FE","Inversión","Un nuevo contrato social y ambiental para la Bogotá del Siglo XXI",57,{"$f":"IF(ISERROR(VLOOKUP(K398,Proposito_programa!$C$2:$E$59,2,FALSE)),\" \",VLOOKUP(K398,Proposito_programa!$C$2:$E$59,2,FALSE))","v":"Gestión pública local"},{"$f":"IF(ISERROR(VLOOKUP(K398,Proposito_programa!$C$2:$E$59,3,FALSE)),\" \",VLOOKUP(K398,Proposito_programa!$C$2:$E$59,3,FALSE))","v":"Propósito 5: Construir Bogotá - Región con gobierno abierto, transparente y ciudadanía consciente"},2105,3,"804000673","HARDWARE ASESORIAS SOFTWARE TLDA","Persona Jurídica",null,null,null,null,116235415,null,null,0,116235415,0,"2022-12-27","2023-02-08","2023-11-07",9,0,0,null,null,null,null,"En ejecución",0]
["FDLSF-CPS-266-2021",2021,"FDLSF-SAMC-009-2021","FDLSF-CPS-266-2021","Contratos de prestación de servicios","Selección abreviada","No aplica","LA PRESTACIÓN DE SERVICIOS DE PROTECCIÓN Y BIENESTAR ANIMAL EN LA LOCALIDAD DE SANTA FE.","Inversión","Un nuevo contrato social y ambiental para la Bogotá del Siglo XXI",34,{"$f":"IF(ISERROR(VLOOKUP(K399,Proposito_programa!$C$2:$E$59,2,FALSE)),\" \",VLOOKUP(K399,Proposito_programa!$C$2:$E$59,2,FALSE))","v":"Bogotá protectora de los animales"},{"$f":"IF(ISERROR(VLOOKUP(K399,Proposito_programa!$C$2:$E$59,3,FALSE)),\" \",VLOOKUP(K399,Proposito_programa!$C$2:$E$59,3,FALSE))","v":"Propósito 2 : Cambiar Nuestros Hábitos de Vida para Reverdecer a Bogotá y Adaptarnos y Mitigar la Crisis Climática"},2074,3,901552466,"UT BIENESTAR SANTA FÉ","Persona Jurídica",null,null,null,null,122422469,null,null,0,{"$f":"+W399+X399+Z399","v":122422469},0,"2022-08-17","2022-08-17","2022-11-14",3,0,0,null,null,null,null,"Terminado",0]
["N/A",2022,"N/A","N/A","Otros gastos","Otros","No aplica","PAGO ARL, COMPENSAR E IMG","Inversión","Un nuevo contrato social y ambiental para la Bogotá del Siglo XXI",1,{"$f":"IF(ISERROR(VLOOKUP(K400,Proposito_programa!$C$2:$E$59,2,FALSE)),\" \",VLOOKUP(K400,Proposito_programa!$C$2:$E$59,2,FALSE))","v":"Subsidios y transferencias para la equidad"},{"$f":"IF(ISERROR(VLOOKUP(K400,Proposito_programa!$C$2:$E$59,3,FALSE)),\" \",VLOOKUP(K400,Proposito_programa!$C$2:$E$59,3,FALSE))","v":"Propósito 1: Hacer un nuevo contrato social para incrementar la inclusión social, productiva y política"},2081,"N/A","N/A","N/A","Persona Jurídica",null,null,null,null,5819230002,null,null,0,5819230002,5754325723,"2022-01-19","2022-01-21","2023-01-09","N/A","N/A","N/A",null,null,null,null,"Terminado",0.98884658640787648]
["N/A",2022,"N/A","N/A","Otros gastos","Otros","No aplica","PAGO ARL, COMPENSAR E IMG","Inversión","Un nuevo contrato social y ambiental para la Bogotá del Siglo XXI",7,{"$f":"IF(ISERROR(VLOOKUP(K401,Proposito_programa!$C$2:$E$59,2,FALSE)),\" \",VLOOKUP(K401,Proposito_programa!$C$2:$E$59,2,FALSE))","v":"Mejora de la gestión de instituciones de salud"},{"$f":"IF(ISERROR(VLOOKUP(K401,Proposito_programa!$C$2:$E$59,3,FALSE)),\" \",VLOOKUP(K401,Proposito_programa!$C$2:$E$59,3,FALSE))","v":"Propósito 1: Hacer un nuevo contrato social para incrementar la inclusión social, productiva y política"},2104,"N/A","N/A","N/A","Persona Jurídica",null,null,null,null,1103850,null,null,0,1103850,1103850,null,null,null,"N/A","N/A","N/A",null,null,null,null,"Terminado",{"$f":"IF(ISERROR(AB401/AA401),\"-\",(AB401/AA401))","v":1}]
["N/A",2022,"N/A","N/A","Otros gastos","Otros","No aplica","PAGO ARL, COMPENSAR E IMG","Inversión","Un nuevo contrato social y ambiental para la Bogotá del Siglo XXI",57,{"$f":"IF(ISERROR(VLOOKUP(K402,Proposito_programa!$C$2:$E$59,2,FALSE)),\" \",VLOOKUP(K402,Proposito_programa!$C$2:$E$59,2,FALSE))","v":"Gestión pública local"},{"$f":"IF(ISERROR(VLOOKUP(K402,Proposito_programa!$C$2:$E$59,3,FALSE)),\" \",VLOOKUP(K402,Proposito_programa!$C$2:$E$59,3,FALSE))","v":"Propósito 5: Construir Bogotá - Región con gobierno abierto, transparente y ciudadanía consciente"},2105,"N/A","N/A","N/A","Persona Jurídica",null,null,null,null,31736355,null,null,0,31736355,31736355,null,null,null,"N/A","N/A","N/A",null,null,null,null,"Terminado",{"$f":"IF(ISERROR(AB402/AA402),\"-\",(AB402/AA402))","v":1}]
["N/A",2022,"N/A","N/A","Otros gastos","Otros","No aplica","PAGO ARL, COMPENSAR E IMG","Inversión","Un nuevo contrato social y ambiental para la Bogotá del Siglo XXI",43,{"$f":"IF(ISERROR(VLOOKUP(K403,Proposito_programa!$C$2:$E$59,2,FALSE)),\" \",VLOOKUP(K403,Proposito_programa!$C$2:$E$59,2,FALSE))","v":"Cultura ciudadana para la confianza, la convivencia y la participación desde la vida cotidiana"},{"$f":"IF(ISERROR(VLOOKUP(K403,Proposito_programa!$C$2:$E$59,3,FALSE)),\" \",VLOOKUP(K403,Proposito_programa!$C$2:$E$59,3,FALSE))","v":"Propósito 3: Inspirar confianza y legitimidad para vivir sin miedo y ser epicentro de cultura ciudadana, paz y reconciliación"},2128,"N/A","N/A","N/A","Persona Jurídica",null,null,null,null,12553750,null,null,0,12553750,12553750,null,null,null,"N/A","N/A","N/A",null,null,null,null,"Terminado",{"$f":"IF(ISERROR(AB403/AA403),\"-\",(AB403/AA403))","v":1}]
["FDLSF-CSU-171-2021",2021,"FDLSF-SASI-003-2021","FDLSF-CSU-171-2021","Suministro","Selección abreviada","Subasta inversa ","ADQUISICIÓN DE ELEMENTOS E INSUMOS AGRICOLAS Y DE FERRETERIA PARA GARANTIZAR EL MANTENIMIENTO Y SOSTENIMIENTO DE LAS COBERTURAS VERDES, HUERTAS URBANAS Y FORTALECIMIENTO A LA PROTECCIÓN Y BIENESTAR ANIMAL EN LA LOCALIDAD DE SANTA FE.- LOTE 1: INSUMOS AGRICOLAS","Inversión","Un nuevo contrato social y ambiental para la Bogotá del Siglo XXI",24,{"$f":"IF(ISERROR(VLOOKUP(K404,Proposito_programa!$C$2:$E$59,2,FALSE)),\" \",VLOOKUP(K404,Proposito_programa!$C$2:$E$59,2,FALSE))","v":"Bogotá región emprendedora e innovadora"},{"$f":"IF(ISERROR(VLOOKUP(K404,Proposito_programa!$C$2:$E$59,3,FALSE)),\" \",VLOOKUP(K404,Proposito_programa!$C$2:$E$59,3,FALSE))","v":"Propósito 1: Hacer un nuevo contrato social para incrementar la inclusión social, productiva y política"},2123,"N/A","N/A","N/A","Persona Jurídica",null,null,null,null,82388643,null,null,0,82388643,0,"2022-08-25","2022-08-25","2022-12-31",5,0,0,null,null,null,null,"Terminado",0]
["FDLSF-CIN-277-2021",2021,"FDLSF-CMA-003-2021","FDLSF-CIN-277-2021","Interventoría","Concurso de méritos","No aplica","INTERVENTORÍA TÉCNICA, ADMINISTRATIVA, FINANCIERA, JURÍDICA, AMBIENTAL Y SOCIAL AL CONTRATO DE OBRA PUBLICA RESULTANTE DEL PROCESO DE LICITACIÓN PUBLICA CUYO OBJETO ES: CONTRATAR POR EL SISTEMA DE PRECIOS UNITARIOS FIJOS SIN FORMULA DE REAJUSTE, A MONTO AGOTABLE, EL DIAGNOSTICO Y LAS OBRAS NECESARIAS PARA LA ADECUACIÓN, MANTENIMIENTO Y/O MEJORAMIENTO DE LOS PARQUES VECINALES Y DE BOLSILLO DE LA LOCALIDAD DE SANTA FE.","Inversión","Un nuevo contrato social y ambiental para la Bogotá del Siglo XXI",33,{"$f":"IF(ISERROR(VLOOKUP(K405,Proposito_programa!$C$2:$E$59,2,FALSE)),\" \",VLOOKUP(K405,Proposito_programa!$C$2:$E$59,2,FALSE))","v":"Más árboles y más y mejor espacio público"},{"$f":"IF(ISERROR(VLOOKUP(K405,Proposito_programa!$C$2:$E$59,3,FALSE)),\" \",VLOOKUP(K405,Proposito_programa!$C$2:$E$59,3,FALSE))","v":"Propósito 2 : Cambiar Nuestros Hábitos de Vida para Reverdecer a Bogotá y Adaptarnos y Mitigar la Crisis Climática"},2138,"N/A","N/A","N/A","Persona Jurídica",null,null,null,null,23237311,null,null,0,23237311,8504857,"2022-05-03","2022-07-30","2022-12-31",5,0,0,null,null,null,null,"Terminado",0.36600005052219681]
["32021",2021,null,null,"Contratos de prestación de servicios","Contratación mínima cuantia","No aplica","PRESTAR EL SERVICIO DE MANTENIMIENTO PREVENTIVO Y CORRECTIVO CON BOLSA DE REPUESTOSAL ASCENSOR MARCA SHINDLER DE PROPIEDAD DE LA ALC ALDÃ\u008dA LOCAL DE SANTAFE. SOLICITUD 20215320001473 Reemplaza por constituirse como OXP - 2021 CDP 365 y CRP 411","Funcionamiento",null,"No aplica"," "," ","No aplica",null,"860005289","ASCENSORES SCHINDLER DE COLOMBIA S A S",null,null,null,null,null,1649750,null,null,0,1649750,0,"2022-01-21","2022-01-21","2022-12-31",null,null,null,null,null,null,null,"Terminado",0]
["912020",2020,null,null,"Contratos de prestación de servicios","Contratación mínima cuantia","No aplica","REEMPLAZA CDP 408  CRP 416  POR CONSTITUIRSE EN OBLIGACIONES POR PAGAR  VIGENCIA ANTERIOR: PRESTAR EL SERVICIO DE MANTENIMIENTO PREV ENTIVO Y CORRECTIVO CON BOLSA DE REPUESTOS AL ASENSOR MARCA SCHINDLER DE PROPIEDAD DE LA ALCALDIA LOCAL DE SANTA FE. Reemplaza por c onstituirse como OXP - 2021 CDP 27 y CRP 22","Funcionamiento",null,"No aplica"," "," ","No aplica",null,"860005289","ASCENSORES SCHINDLER DE COLOMBIA S A S",null,null,null,null,null,799442,null,null,0,799442,0,"2022-01-21","2022-01-21","2022-12-31",null,null,null,null,null,null,null,"Terminado",0]
["1242019",2017,null,null,"Contratos de prestación de servicios","Contratación mínima cuantia","No aplica","REEMPLAZA CDP 71  CRP 27  POR CONSTITUIRSE EN OBLIGACIONES POR PAGAR OTRAS VIGENCIAS PRESTAR EL SERVICIO DE MANTENIMIENTO PREVENTIVO  Y CORRECTIVO CONBOLSA DE REPUESTOS AL ASCENSOR MARCA SCHINDLER DE PROPIEDAD DE LA ALCALDÃ\u008dA LOCAL DE SANTA FE Reemplaza por constit uirse como OXP - 2021 CDP 37 y CRP 32","Funcionamiento",null,"No aplica"," "," ","No aplica",null,"860005289","ASCENSORES SCHINDLER DE COLOMBIA S A S",null,null,null,null,null,1720656,null,null,0,1720656,0,"2022-01-21","2022-01-21","2022-12-31",null,null,null,null,null,null,null,"Terminado",0]
["0120213",2021,null,null,"Contratos de prestación de servicios","Contratación mínima cuantia","No aplica","ADICIÓN No. 3 AL CONTRATO No. FDLSF-CS-001-2021 CUYO OBJETO ES: CONTRATAR LOS SEGUROS QUE AMPAREN LOS INTERESES PATRIMONIALES ACTUALES Y FUTUROS, ASÍ COMO LOS BIENES DE PROPIEDAD DEL FONDO DE DESARROLLO LOCAL DE SANTA FE QUE ESTÉN BAJO SU RESPONSABILIDAD Y CUSTODIA Y AQUELLOS QUE SEAN ADQUIRIDOS PARA DESARROLLAR LAS FUNCIONES INHERENTES A SU ACTIVIDAD Y CUALQUIER OTRA PÓLIZA DE SEGUROS QUE REQUIERA LA ENTIDAD EN EL DESARROLLO DE SU ACTIVIDAD. GRUPO 1 SEGUROS GENERALES.","Funcionamiento",null,"No aplica",null,null,"No aplica",null,"860002184","AXA COLPATRIA SEGUROS SA",null,null,null,null,null,1141046,null,null,0,1141046,1141046,"2022-01-20","2022-01-20","2022-12-31",null,null,null,null,null,null,null,"Terminado",1]
["0120213",2021,null,null,"Contratos de prestación de servicios","Contratación mínima cuantia","No aplica","ADICIÓN No. 3 AL CONTRATO No. FDLSF-CS-001-2021 CUYO OBJETO ES: CONTRATAR LOS SEGUROS QUE AMPAREN LOS INTERESES PATRIMONIALES ACTUALES Y FUTUROS, ASÍ COMO LOS BIENES DE PROPIEDAD DEL FONDO DE DESARROLLO LOCAL DE SANTA FE QUE ESTÉN BAJO SU RESPONSABILIDAD Y CUSTODIA Y AQUELLOS QUE SEAN ADQUIRIDOS PARA DESARROLLAR LAS FUNCIONES INHERENTES A SU ACTIVIDAD Y CUALQUIER OTRA PÓLIZA DE SEGUROS QUE REQUIERA LA ENTIDAD EN EL DESARROLLO DE SU ACTIVIDAD. GRUPO 1 SEGUROS GENERALES.","Funcionamiento",null,"No aplica",null,null,"No aplica",null,"860002184","AXA COLPATRIA SEGUROS SA",null,null,null,null,null,448939,null,null,0,448939,448939,"2022-01-20","2022-01-20","2022-12-31",null,null,null,null,null,null,null,"Terminado",1]
["0120213",2021,null,null,"Contratos de prestación de servicios","Contratación mínima cuantia","No aplica","ADICIÓN No. 3 AL CONTRATO No. FDLSF-CS-001-2021 CUYO OBJETO ES: CONTRATAR LOS SEGUROS QUE AMPAREN LOS INTERESES PATRIMONIALES ACTUALES Y FUTUROS, ASÍ COMO LOS BIENES DE PROPIEDAD DEL FONDO DE DESARROLLO LOCAL DE SANTA FE QUE ESTÉN BAJO SU RESPONSABILIDAD Y CUSTODIA Y AQUELLOS QUE SEAN ADQUIRIDOS PARA DESARROLLAR LAS FUNCIONES INHERENTES A SU ACTIVIDAD Y CUALQUIER OTRA PÓLIZA DE SEGUROS QUE REQUIERA LA ENTIDAD EN EL DESARROLLO DE SU ACTIVIDAD. GRUPO 1 SEGUROS GENERALES.","Funcionamiento",null,"No aplica",null,null,"No aplica",null,"860002184","AXA COLPATRIA SEGUROS SA",null,null,null,null,null,784985,null,null,0,784985,784984,"2022-01-20","2022-01-20","2022-12-31",null,null,null,null,null,null,null,"Terminado",0.99999872609030749]
["12021",2021,null,null,"Contratos de prestación de servicios","Contratación mínima cuantia","No aplica","CONTRATAR LOS SEGUROS QUE AMPAREN LOS INTERESES PATRIMONIALES ACTUALES Y FUTUROS, ASÃ\u008d COMO LOS BIENES DE PROPIEDAD DEL FONDO DE DES ARROLLO LOCAL DE SANTA FE QUE ESTÃ‰N BAJO SU RESPONSABILIDAD Y CUSTODIA Y AQUELLOS QUE SEAN ADQUIRIDOS PARA DESARROLLAR LAS FUNCIONE S INHERENTES A SU ACTIVIDAD, ASÃ\u008d COMO LA EXPEDICIÃ“N DE UNA PÃ“LIZA COLECTIVA DE SEGURO DE VIDA PARA LOS EDILES DE LA LOCALIDAD Y C UALQUIER OTRA PÃ“LIZA DE SEGUROS QUE REQUIERA LA ENTIDAD EN EL DESARROLLO DE SU ACTIVIDAD. SOLICITUD 20215320000803 DEL 25-01-2021 R eemplaza por constituirse como OXP - 2021 CDP 9 y CRP 365","Funcionamiento",null,"No aplica",null,null,"No aplica",null,"860002184","AXA COLPATRIA SEGUROS SA",null,null,null,null,null,1,null,null,0,1,0,"2022-01-21","2022-01-21","2022-12-31",null,null,null,null,null,null,null,"Terminado",0]
["842017",2017,null,null,"Contratos de prestación de servicios","Contratación mínima cuantia","No aplica","REEMPLAZA CDP 83  CRP 39  POR CONSTITUIRSE EN OBLIGACIONES POR PAGAR OTRAS VIGENCIAS ADICION Y PRORROGA DEL C.SEG 842017,  EL CONTRA TISTA SE OBLIGA CON EL FDLSF A CONTRATAR LOS SEGUROS QUE AMPAREN LOS INTERESES PATRIMONIALES ACTUALES Y FUTUROS A SI COMO LOS BIENES  DE PROPIEDAD DEL FDLS QUE ESTEN BAJO SU RESPONSABILIDAD Y CUSTODIA Y AQUELLOS QUE SEAN ADQUIRIDOS PARA DESARROLLAR LAS FUNCIONES IN HERENTES A SU ACTIVIDAD A SI COMO LA EXPEDICION DE UNA POLIZA DE SEGUROS DE VIDA Y CUALQUIER OTRA POLIZA DE SEGUROS QUE REQUIERA LA ENTIDAD EN EL DESARROLLO DE SU ACTIVIDAD. Reemplaza por constituirse como OXP - 2021 CDP 44 y CRP 39","Funcionamiento",null,"No aplica",null,null,"No aplica",null,"860002184","AXA COLPATRIA SEGUROS SA",null,null,null,null,null,93203,null,null,0,93203,0,"2022-01-21","2022-01-21","2022-12-31",null,null,null,null,null,null,null,"Terminado",0]
["1572019",2019,null,null,"Contratos de prestación de servicios","Contratación mínima cuantia","No aplica","REEMPLAZA CDP 557  CRP 631  POR CONSTITUIRSE EN OBLIGACIONES POR PAGAR  VIGENCIA ANTERIOR: ADICIÃ“N Y PRÃ“RROGA DEL PROGRAMA DE SEGU ROS DE LA ENTIDAD, CONTRATO 157 DE 2019. CUYO OBJETO: CONTRATAR LOS SEGUROS QUE AMPAREN LOS INTERESES PATRIMONIALES Y LOS BIENES DE PROPIEDAD DEL FONDO DE DESARROLLO LOCAL DE SANTA FE, QUE ESTÃ‰N BAJO SU RESPONSABILIDAD Y CUSTODIA, Y AQUELLOS QUE SEAN ADQUIRIDOS P ARA DESARROLLAR SUS FUNCIONES. ASÃ\u008d MISMO EL SEGURO DE VIDA PARA EL GRUPO DE EDILES DE LA LOCALIDAD Reemplaza por constituirse como OXP - 2021 CDP 370 y CRP 384","Funcionamiento",null,"No aplica",null,null,"No aplica",null,"860002184","AXA COLPATRIA SEGUROS SA",null,null,null,null,null,23,null,null,0,23,0,"2022-01-21","2022-01-21","2022-12-31",null,null,null,null,null,null,null,"Terminado",0]
["1572019",2019,null,null,"Contratos de prestación de servicios","Contratación mínima cuantia","No aplica","REEMPLAZA CDP 52  CRP 9  POR CONSTITUIRSE EN OBLIGACIONES POR PAGAR OTRAS VIGENCIAS PARA CONTRATAR LOS SEGUROS QUE AMPAREN LOS INTER ESES PATRIMONIALES Y LOS BIENES DE PROPIEDAD DEL FONDO DE DESARROLLO LOCAL DE SANTA FE, QUE ESTÃ‰N BAJO SU RESPONSABILIDAD Y CUSTODI A, Y AQUELLOSQUE SEAN ADQUIRIDOS PARA DESARROLLAR SUS FUNCIONES.  ASÃ\u008d MISMO EL SEGURO DE VIDA PARA EL GRUPO DE EDILES DE LA LOCALID AD. Reemplaza por constituirse como OXP - 2021 CDP 374 y CRP 388","Funcionamiento",null,"No aplica",null,null,"No aplica",null,"860002184","AXA COLPATRIA SEGUROS SA",null,null,null,null,null,600,null,null,0,600,0,"2022-01-21","2022-01-21","2022-12-31",null,null,null,null,null,null,null,"Terminado",0]
["1292019",2019,null,null,"Contratos de prestación de servicios","Contratación mínima cuantia","No aplica","REEMPLAZA CDP 53  CRP 10  POR CONSTITUIRSE EN OBLIGACIONES POR PAGAR OTRAS VIGENCIAS CONTRATAR LOS SEGUROS QUE AMPAREN LOS INTERESES  PATRIMONIALES ACTUALES Y FUTUROS, ASÃ\u008d COMO LOS BIENES DE PROPIEDAD DEL FONDO DE DESARROLLO LOCAL DE SANTA FE, QUE ESTÃ‰N BAJO SU R ESPONSABILIDAD Y CUSTODIA Y AQUELLOS QUE SEAN ADQUIRIDOS PARA DESARROLLAR LAS FUNCIONES INHERENTES A SU ACTIVIDAD. ASÃ\u008d MISMO EL SEG URO DE VIDA PARA EL GRUPO DE EDILES DE LA LOCALIDAD. Reemplaza por constituirse como OXP - 2021 CDP 375 y CRP 389","Funcionamiento",null,"No aplica",null,null,"No aplica",null,"860002184","AXA COLPATRIA SEGUROS SA",null,null,null,null,null,2840,null,null,0,2840,0,"2022-01-21","2022-01-21","2022-12-31",null,null,null,null,null,null,null,"Terminado",0]
["0120213",2021,null,null,"Contratos de prestación de servicios","Contratación mínima cuantia","No aplica","ADICIÓN No. 3 AL CONTRATO No. FDLSF-CS-001-2021 CUYO OBJETO ES: CONTRATAR LOS SEGUROS QUE AMPAREN LOS INTERESES PATRIMONIALES ACTUALES Y FUTUROS, ASÍ COMO LOS BIENES DE PROPIEDAD DEL FONDO DE DESARROLLO LOCAL DE SANTA FE QUE ESTÉN BAJO SU RESPONSABILIDAD Y CUSTODIA Y AQUELLOS QUE SEAN ADQUIRIDOS PARA DESARROLLAR LAS FUNCIONES INHERENTES A SU ACTIVIDAD Y CUALQUIER OTRA PÓLIZA DE SEGUROS QUE REQUIERA LA ENTIDAD EN EL DESARROLLO DE SU ACTIVIDAD. GRUPO 1 SEGUROS GENERALES.","Funcionamiento",null,"No aplica",null,null,"No aplica",null,"860002184","AXA COLPATRIA SEGUROS SA",null,null,null,null,null,50,null,null,0,50,50,"2022-01-27","2022-01-27","2022-12-31",null,null,null,null,null,null,null,"Terminado",1]
["0120214",2021,null,null,"Contratos de prestación de servicios","Contratación mínima cuantia","No aplica","ADICIÓN No. 4 AL CONTRATO No. FDLSF-CS-001-2021 CUYO OBJETO ES: CONTRATAR LOS SEGUROS QUE AMPAREN LOS INTERESES PATRIMONIALES ACTUALES Y FUTUROS, ASÍ COMO LOS BIENES DE PROPIEDAD DEL FONDO DE DESARROLLO LOCAL DE SANTA FE QUE ESTÉN BAJO SU RESPONSABILIDAD Y CUSTODIA Y AQUELLOS QUE SEAN ADQUIRIDOS PARA DESARROLLAR LAS FUNCIONES INHERENTES A SU ACTIVIDAD Y CUALQUIER OTRA PÓLIZA DE SEGUROS QUE REQUIERA LA ENTIDAD EN EL DESARROLLO DE SU ACTIVIDAD. GRUPO 1 SEGUROS GENERALES.","Funcionamiento",null,"No aplica",null,null,"No aplica",null,"860002184","AXA COLPATRIA SEGUROS SA",null,null,null,null,null,6401104,null,null,0,6401104,3969914,"2022-01-31","2022-01-31","2022-12-31",null,null,null,null,null,null,null,"Terminado",0.62019207936630927]
["012021",2021,null,null,"Contratos de prestación de servicios","Contratación mínima cuantia","No aplica","ADICIÓN No. 5 AL CONTRATO No. FDLSF-CS-001-2021 CUYO OBJETO ES: CONTRATAR LOS SEGUROS QUE AMPAREN LOS INTERESES PATRIMONIALES ACTUALES Y FUTUROS, ASÍ COMO LOS BIENES DE PROPIEDAD DEL FONDO DE DESARROLLO LOCAL DE SANTA FE QUE ESTÉN BAJO SU RESPONSABILIDAD Y CUSTODIA Y AQUELLOS QUE SEAN ADQUIRIDOS PARA DESARROLLAR LAS FUNCIONES INHERENTES A SU ACTIVIDAD Y CUALQUIER OTRA PÓLIZA DE SEGUROS QUE REQUIERA LA ENTIDAD EN EL DESARROLLO DE SU ACTIVIDAD. GRUPO 1 SEGUROS GENERALES","Funcionamiento",null,"No aplica",null,null,"No aplica",null,"860002184","AXA COLPATRIA SEGUROS SA",null,null,null,null,null,1761428,null,null,0,1761428,1761428,"2022-03-31","2022-03-31","2022-12-31",null,null,null,null,null,null,null,"Terminado",1]
["012021",2021,null,null,"Contratos de prestación de servicios","Contratación mínima cuantia","No aplica","ADICIÓN No. 5 AL CONTRATO No. FDLSF-CS-001-2021 CUYO OBJETO ES: CONTRATAR LOS SEGUROS QUE AMPAREN LOS INTERESES PATRIMONIALES ACTUALES Y FUTUROS, ASÍ COMO LOS BIENES DE PROPIEDAD DEL FONDO DE DESARROLLO LOCAL DE SANTA FE QUE ESTÉN BAJO SU RESPONSABILIDAD Y CUSTODIA Y AQUELLOS QUE SEAN ADQUIRIDOS PARA DESARROLLAR LAS FUNCIONES INHERENTES A SU ACTIVIDAD Y CUALQUIER OTRA PÓLIZA DE SEGUROS QUE REQUIERA LA ENTIDAD EN EL DESARROLLO DE SU ACTIVIDAD. GRUPO 1 SEGUROS GENERALES","Funcionamiento",null,"No aplica",null,null,"No aplica",null,"860002184","AXA COLPATRIA SEGUROS SA",null,null,null,null,null,3427400,null,null,0,3427400,0,"2022-03-31","2022-03-31","2022-12-31",null,null,null,null,null,null,null,"Terminado",0]
["012021",2021,null,null,"Contratos de prestación de servicios","Contratación mínima cuantia","No aplica","ADICIÓN No. 5 AL CONTRATO No. FDLSF-CS-001-2021 CUYO OBJETO ES: CONTRATAR LOS SEGUROS QUE AMPAREN LOS INTERESES PATRIMONIALES ACTUALES Y FUTUROS, ASÍ COMO LOS BIENES DE PROPIEDAD DEL FONDO DE DESARROLLO LOCAL DE SANTA FE QUE ESTÉN BAJO SU RESPONSABILIDAD Y CUSTODIA Y AQUELLOS QUE SEAN ADQUIRIDOS PARA DESARROLLAR LAS FUNCIONES INHERENTES A SU ACTIVIDAD Y CUALQUIER OTRA PÓLIZA DE SEGUROS QUE REQUIERA LA ENTIDAD EN EL DESARROLLO DE SU ACTIVIDAD. GRUPO 1 SEGUROS GENERALES","Funcionamiento",null,"No aplica",null,null,"No aplica",null,"860002184","AXA COLPATRIA SEGUROS SA",null,null,null,null,null,16768893,null,null,0,16768893,16768893,"2022-03-31","2022-03-31","2022-12-31",null,null,null,null,null,null,null,"Terminado",1]
["012021",2021,null,null,"Contratos de prestación de servicios","Contratación mínima cuantia","No aplica","ADICIÓN No. 5 AL CONTRATO No. FDLSF-CS-001-2021 CUYO OBJETO ES: CONTRATAR LOS SEGUROS QUE AMPAREN LOS INTERESES PATRIMONIALES ACTUALES Y FUTUROS, ASÍ COMO LOS BIENES DE PROPIEDAD DEL FONDO DE DESARROLLO LOCAL DE SANTA FE QUE ESTÉN BAJO SU RESPONSABILIDAD Y CUSTODIA Y AQUELLOS QUE SEAN ADQUIRIDOS PARA DESARROLLAR LAS FUNCIONES INHERENTES A SU ACTIVIDAD Y CUALQUIER OTRA PÓLIZA DE SEGUROS QUE REQUIERA LA ENTIDAD EN EL DESARROLLO DE SU ACTIVIDAD. GRUPO 1 SEGUROS GENERALES","Funcionamiento",null,"No aplica",null,null,"No aplica",null,"860002184","AXA COLPATRIA SEGUROS SA",null,null,null,null,null,1499726,null,null,0,1499726,1499726,"2022-03-31","2022-03-31","2022-12-31",null,null,null,null,null,null,null,"Terminado",1]
["N/A",2022,null,null,null,null,null,"PAGO DE SERVICIOS PUBLICOS 2022","Funcionamiento",null,"No aplica",null,null,"No aplica",null,"N/A","N/A",null,null,null,null,null,142818539,null,null,0,142818539,138160299,"2022-03-31","2022-03-31","2022-12-31",null,null,null,null,null,null,null,"Terminado",0.9673835061427144]
["N/A",2022,null,null,null,null,null,"PAGO EPS Y CAJA DE COMPENSACION FAMILIAR EDILES LOCALIDAD SANTA FE","Funcionamiento",null,"No aplica",null,null,"No aplica",null,"N/A","N/A",null,null,null,null,null,86041200,null,null,0,86041200,86041200,"2022-03-31","2022-03-31","2022-12-31",null,null,null,null,null,null,null,"Terminado",1]
["N/A",2022,null,null,null,null,null,"SUMINISTRO DE COMBUSTIBLE","Funcionamiento",null,"No aplica",null,null,"No aplica",null,"N/A","N/A",null,null,null,null,null,62913605,null,null,0,62913605,18519564,"2022-03-31","2022-03-31","2022-12-31",null,null,null,null,null,null,null,"Terminado",0.29436501055693759]
["N/A",2022,null,null,null,null,null,"Obligaciones por Pagar Funcionamiento Vigencia Anterior","Funcionamiento",null,"No aplica",null,null,"No aplica",null,"N/A","N/A",null,null,null,null,null,230082338,null,null,0,230082338,149041938,"2022-03-31","2022-03-31","2022-12-31",null,null,null,null,null,null,null,"Terminado",0.64777652772287109]
["N/A",2022,null,null,null,null,null,"HONORARIOS EDILES","Funcionamiento",null,"No aplica",null,null,"No aplica",null,"N/A","N/A",null,null,null,null,null,688299948,null,null,0,688299948,688299948,"2022-03-31","2022-03-31","2022-12-31",null,null,null,null,null,null,null,"Terminado",1]
["N/A",2022,null,null,null,null,null,"PAGO DE LA ADMINISTRACION DEL EDIFICIO CONDOMINIO PARQUE SANTANDER PROPIEDAD HORIZONTAL DE LA OFICINA 701 Y 702 PARA SER USADAS COMO  INSPECCIONES DE POLICIA DE LA LOCALIDAD - DE ACUERDO A RESOLUCION 358 DE NOVIEMBRE 25 DE 2019 - CONTRATO INTERADMINISTRATIVO DE COMODATO 110-129-498-0-2019-17102019 - OF 701 RUPI 2 - 1889 Y OF 702 RUPI 2-978 EDIFICIO CONDOMINIO PARQUE SANTANDER KRA 6 14-98 BLQ 2 LOCALIDAD SANTA FE - CONTRATO SUSCRITO ENTRE EL DEPTO ADMTVO DEFENSORIA ESPACIO PUBLICO Y EL FDLSF FDO OCT 17 2019 DIRECTORA DADEP Y  EL FDLSF. SOLICITUD 20225320004493","Funcionamiento",null,"No aplica",null,null,"No aplica",null,"N/A","N/A",null,null,null,null,null,9000000,null,null,0,9000000,7371628,"2022-03-31","2022-03-31","2022-12-31",null,null,null,null,null,null,null,"Terminado",0.81906977777777779]
["FLDSF-CPS-074-2021",2021,"FLDSF-SASI-074-2021","74-2021","Contratos de prestación de servicios","Selección abreviada","Subasta inversa ","ADICIÓN Y PRÓRROGA No. 2 AL CONTRATO FLDSF-CPS-074-2021 QUE TIENE COMO OBJETO: PRESTAR EL SERVICIO INTEGRAL DE VIGILANCIA Y SEGURIDAD PRIVADA PARA LAS DISTINTAS SEDES DE LA ALCALDÍA LOCAL DE SANTA FE, INCLUYENDO LAS DEMÁS POR LAS QUE SEA RESPONSABLE, UTILIZANDO MEDIOS TECNOLÓGICOS Y HUMANOS PARA LA ADECUADA PROTECCIÓN DE LOS FUNCIONARIOS, CONTRATISTAS Y VISITANTES EN GENERAL.","Funcionamiento",null,"No aplica",null,null,"No aplica",null,901464144,"UNION TEMPORAL UT BUFVIG 2021",54168041,null,null,0,54168041,54168038,null,null,0,54168038,54168038,"2022-03-31","2022-03-31","2022-12-31",null,null,null,null,null,null,null,"Terminado",0.81906977777777779]
["FLDSF-CPS-274-2022",2022,"FLDSF-MC-274-2021","274-2022","Contratos de prestación de servicios","Contratación mínima cuantia","No aplica","CONTRATAR LA PRESTACIÓN DEL SERVICIO DE INSPECCIÓN GENERAL Y CERTIFICACIÓN DEL ASCENSOR DE PROPIEDAD DEL FONDO DE DESARROLLO LOCAL DE SANTA FE","Funcionamiento",null,"No aplica",null,null,"No aplica",null,"900476299","MONTAJES Y PROCESOS MP SAS",380800,null,null,0,380800,380800,null,null,0,380800,380800,"2022-03-31","2022-03-31","2022-12-31",null,null,null,null,null,null,null,"Terminado",0.81906977777777779]
["Total",null,null,null,null,null,null,null,null,null,null,null,null,null,null,null,null,null,null,null,null,null,null,{"$f":"SUM(X14:X397)","v":-53946667},{"$f":"SUM(Y14:Y397)","v":95},{"$f":"SUM(Z14:Z397)","v":399591574},{"$f":"SUM(AA14:AA405)","v":36848111105.949997},{"$f":"SUM(AB14:AB399)","v":11275105304},null,null,null,null,null,null,null,null,null,null,null,{"$f":"SUM(AN14:AN398)","v":229.89767835467995}]
[" "," "," "," "," "," "," "," "," "," "," "," "," "," "," "," "," "," "," "," "," "," ",null," "," "," ",null,null," "," "," "," "," "," "," "," "," "," "," "," "]

{"sheet":"BOGDATA VS FORMATO ","index":1,"n_rows":128,"n_cols":6,"rows_kept":128,"cut":false,"hidden":false,"merged":[[0,0,0,5],[3,2,3,3],[3,4,3,5],[5,2,5,3],[5,4,5,5],[7,2,7,3],[7,4,7,5],[15,2,15,3],[15,4,15,5],[17,2,17,3],[17,4,17,5],[19,2,19,3],[19,4,19,5],[9,2,9,3],[9,4,9,5],[11,2,11,3],[11,4,11,5],[13,2,13,3],[13,4,13,5],[27,2,27,3],[27,4,27,5],[29,2,29,3],[29,4,29,5],[31,2,31,3],[31,4,31,5],[21,2,21,3],[21,4,21,5],[23,2,23,3],[23,4,23,5],[25,2,25,3],[25,4,25,5],[39,2,39,3],[39,4,39,5],[41,2,41,3],[41,4,41,5],[43,2,43,3],[43,4,43,5],[33,2,33,3],[33,4,33,5],[35,2,35,3],[35,4,35,5],[37,2,37,3],[37,4,37,5],[51,2,51,3],[51,4,51,5],[53,2,53,3],[53,4,53,5],[55,2,55,3],[55,4,55,5],[45,2,45,3],[45,4,45,5],[47,2,47,3],[47,4,47,5],[49,2,49,3],[49,4,49,5],[63,2,63,3],[63,4,63,5],[65,2,65,3],[65,4,65,5],[67,2,67,3],[67,4,67,5],[57,2,57,3],[57,4,57,5],[59,2,59,3],[59,4,59,5],[61,2,61,3],[61,4,61,5],[75,2,75,3],[75,4,75,5],[77,2,77,3],[77,4,77,5],[79,2,79,3],[79,4,79,5],[69,2,69,3],[69,4,69,5],[71,2,71,3],[71,4,71,5],[73,2,73,3],[73,4,73,5],[87,2,87,3],[87,4,87,5],[89,2,89,3],[89,4,89,5],[91,2,91,3],[91,4,91,5],[81,2,81,3],[81,4,81,5],[83,2,83,3],[83,4,83,5],[85,2,85,3],[85,4,85,5],[99,2,99,3],[99,4,99,5],[101,2,101,3],[101,4,101,5],[103,2,103,3],[103,4,103,5],[93,2,93,3],[93,4,93,5],[95,2,95,3],[95,4,95,5],[97,2,97,3],[97,4,97,5],[111,2,111,3],[111,4,111,5],[113,2,113,3],[113,4,113,5],[115,2,115,3],[115,4,115,5],[105,2,105,3],[105,4,105,5],[107,2,107,3],[107,4,107,5],[109,2,109,3],[109,4,109,5],[123,2,123,3],[123,4,123,5],[125,2,125,3],[125,4,125,5],[127,2,127,3],[127,4,127,5],[117,2,117,3],[117,4,117,5],[119,2,119,3],[119,4,119,5],[121,2,121,3],[121,4,121,5]]}
["BOGDATA- CUADRO ANALISIS - Santa Fé"]
[null,null,"COMPROMISOS ACUMULADOS BOGDATA","VALOR FINAL","ACUMULADO GIROS BOGDATA","GIROS"]
[null,"FUNCIONAMIENTO",2123634614,null,1736301757]
[null,"DIFERENCIAS",{"$f":"+C3-D3","v":2123634614},null,{"$f":"+E3-F3","v":1736301757}]
[null,"INVERSION (Comprometido)",36034301606,null,16515005677]
[null,"DIFERENCIAS",{"$f":"+C5-D5","v":36034301606},null,{"$f":"+E5-F5","v":16515005677}]
[null,"Un nuevo contrato social y ambiental para la Bogotá del Siglo XXI",36034301606,null,16515005677]
[null,"DIFERENCIAS",{"$f":"+C7-D7","v":36034301606},null,{"$f":"+E7-F7","v":16515005677}]
[null,"Propósito 1 - Hacer un nuevo contrato social con igualdad de oportunidades para la inclusión social, productiva y política.",17197723212,null,10739439746]
[null,"DIFERENCIAS",{"$f":"+C9-D9","v":17197723212},null,{"$f":"+E9-F9","v":10739439746}]
[null,"Programa 1 - Subsidios y transferencias para la equidad",6294000000,null,6151631720]
[null,"DIFERENCIAS",{"$f":"+C11-D11","v":6294000000},null,{"$f":"+E11-F11","v":6151631720}]
[null,"Proyecto 2081",6294000000,null,6151631720]
[null,"DIFERENCIAS",{"$f":"+C13-D13","v":6294000000},null,{"$f":"+E13-F13","v":6151631720}]
[null,"Programa 6 - Sistema Distrital del Cuidado",3559311709,null,1120202428]
[null,"DIFERENCIAS",{"$f":"+C15-D15","v":3559311709},null,{"$f":"+E15-F15","v":1120202428}]
[null,"Proyecto 2188",3559311709,null,1120202428]
[null,"DIFERENCIAS",{"$f":"+C17-D17","v":3559311709},null,{"$f":"+E17-F17","v":1120202428}]
[null,"Programa 7 - Mejora de la gestión de instituciones de salud",176708850,null,45024250]
[null,"DIFERENCIAS",{"$f":"+C19-D19","v":176708850},null,{"$f":"+E19-F19","v":45024250}]
[null,"Proyecto 2104",176708850,null,45024250]
[null,"DIFERENCIAS",{"$f":"+C21-D21","v":176708850},null,{"$f":"+E21-F21","v":45024250}]
[null,"Programa 8 - Prevención y atención de maternidad temprana",282083147,null,0]
[null,"DIFERENCIAS",{"$f":"+C23-D23","v":282083147},null,{"$f":"+E23-F23","v":0}]
[null,"Proyecto 2064",282083147,null,0]
[null,"DIFERENCIAS",{"$f":"+C25-D25","v":282083147},null,{"$f":"+E25-F25","v":0}]
[null,"Programa 12 - Educación inicial: Bases sólidas para la vida",527530880,null,158259264]
[null,"DIFERENCIAS",{"$f":"+C27-D27","v":527530880},null,{"$f":"+E27-F27","v":158259264}]
[null,"Proyecto 2102",527530880,null,158259264]
[null,"DIFERENCIAS",{"$f":"+C29-D29","v":527530880},null,{"$f":"+E29-F29","v":158259264}]
[null,"Programa 14 Formación integral: más y mejor tiempo en los colegios",265554092,null,0]
[null,"DIFERENCIAS",{"$f":"+C31-D31","v":265554092},null,{"$f":"+E31-F31","v":0}]
[null,"Proyecto 2091",265554092,null,0]
[null,"DIFERENCIAS",{"$f":"+C33-D33","v":265554092},null,{"$f":"+E33-F33","v":0}]
[null,"Programa 17 - Jóvenes con capacidades: Proyecto de vida para la ciudadanía, la innovación y el trabajo del siglo XXI",1259613126,null,1259613126]
[null,"DIFERENCIAS",{"$f":"+C35-D35","v":1259613126},null,{"$f":"+E35-F35","v":1259613126}]
[null,"Proyecto 2052",1259613126,null,1259613126]
[null,"DIFERENCIAS",{"$f":"+C37-D37","v":1259613126},null,{"$f":"+E37-F37","v":1259613126}]
[null,"Programa 19 - Vivienda y entornos dignos en el territorio urbano y rural",587308017,null,0]
[null,"DIFERENCIAS",{"$f":"+C39-D39","v":587308017},null,{"$f":"+E39-F39","v":0}]
[null,"Proyecto 2112",587308017,null,0]
[null,"DIFERENCIAS",{"$f":"+C41-D41","v":587308017},null,{"$f":"+E41-F41","v":0}]
[null,"Programa 20 - Bogotá, referente en cultura, deporte, recreación y actividad física, con parques para el desarrollo y la salud",1276095427,null,560498665]
[null,"DIFERENCIAS",{"$f":"+C43-D43","v":1276095427},null,{"$f":"+E43-F43","v":560498665}]
[null,"Proyecto 2100 ",1276095427,null,560498665]
[null,"DIFERENCIAS",{"$f":"+C45-D45","v":1276095427},null,{"$f":"+E45-F45","v":560498665}]
[null,"Programa 21 - Creación y vida cotidiana: Apropiación ciudadana del arte, la cultura y el patrimonio, para la democracia cultural",1544909910,null,786749572]
[null,"DIFERENCIAS",{"$f":"+C47-D47","v":1544909910},null,{"$f":"+E47-F47","v":786749572}]
[null,"Programa 2110",1544909910,null,786749572]
[null,"DIFERENCIAS",{"$f":"+C49-D49","v":1544909910},null,{"$f":"+E49-F49","v":786749572}]
[null,"Programa 23 - Bogotá rural",550558511,null,0]
[null,"DIFERENCIAS",{"$f":"+C51-D51","v":550558511},null,{"$f":"+E51-F51","v":0}]
[null,"Programa 2108",550558511,null,0]
[null,"DIFERENCIAS",{"$f":"+C53-D53","v":550558511},null,{"$f":"+E53-F53","v":0}]
[null,"Programa 24 - Bogotá región emprendedora e innovadora",874049543,null,657460721]
[null,"DIFERENCIAS",{"$f":"+C55-D55","v":874049543},null,{"$f":"+E55-F55","v":657460721}]
[null,"Proyecto 2123",874049543,null,657460721]
[null,"DIFERENCIAS",{"$f":"+C57-D57","v":874049543},null,{"$f":"+E57-F57","v":657460721}]
[null,"Propósito 2 - Cambiar nuestros hábitos de vida para reverdecer a Bogotá y adaptarnos y mitigar la crisis climática",1176307911,null,66484857]
[null,"DIFERENCIAS",{"$f":"+C59-D59","v":1176307911},null,{"$f":"+E59-F59","v":66484857}]
[null,"Programa 28 - Bogotá protectora de sus recursos naturales",0,null,0]
[null,"DIFERENCIAS",{"$f":"+C61-D61","v":0},null,{"$f":"+E61-F61","v":0}]
[null,"Proyecto 2117",0,null,0]
[null,"DIFERENCIAS",{"$f":"+C63-D63","v":0},null,{"$f":"+E63-F63","v":0}]
[null,"Programa 33 - Más árboles y más y mejor espacio público",824447911,null,8504857]
[null,"DIFERENCIAS",{"$f":"+C65-D65","v":824447911},null,{"$f":"+E65-F65","v":8504857}]
[null,"Proyecto 2138 ",824447911,null,8504857]
[null,"DIFERENCIAS",{"$f":"+C67-D67","v":824447911},null,{"$f":"+E67-F67","v":8504857}]
[null,"Programa 34 - Bogotá protectora de los animales",195200000,null,47840000]
[null,"DIFERENCIAS",{"$f":"+C69-D69","v":195200000},null,{"$f":"+E69-F69","v":47840000}]
[null,"Proyecto 2074 ",195200000,null,47840000]
[null,"DIFERENCIAS",{"$f":"+C71-D71","v":195200000},null,{"$f":"+E71-F71","v":47840000}]
[null,"Programa 37 - Provisión y mejoramiento de servicios públicos",0,null,0]
[null,"DIFERENCIAS",{"$f":"+C73-D73","v":0},null,{"$f":"+E73-F73","v":0}]
[null,"Proyecro 2129 ",0,null,0]
[null,"DIFERENCIAS",{"$f":"+C75-D75","v":0},null,{"$f":"+E75-F75","v":0}]
[null,"Programa 38 - Ecoeficiencia, reciclaje, manejo de residuos e inclusión de la población recicladora",156660000,null,10140000]
[null,"DIFERENCIAS",{"$f":"+C77-D77","v":156660000},null,{"$f":"+E77-F77","v":10140000}]
[null,"Proyecto 2131",156660000,null,10140000]
[null,"DIFERENCIAS",{"$f":"+C79-D79","v":156660000},null,{"$f":"+E79-F79","v":10140000}]
[null,"Propósito 3 -  Inspirar confianza y legitimidad para vivir sin miedo y ser epicentro de cultura ciudadana, paz y reconciliación",2137909845,null,737153987]
[null,"DIFERENCIAS",{"$f":"+C81-D81","v":2137909845},null,{"$f":"+E81-F81","v":737153987}]
[null,"Programa 39 - Bogotá territorio de paz y atención integral a las víctimas del conflicto armado",116853029,null,0]
[null,"DIFERENCIAS",{"$f":"+C83-D83","v":116853029},null,{"$f":"+E83-F83","v":0}]
[null,"Proyecto 2187 ",116853029,null,0]
[null,"DIFERENCIAS",{"$f":"+C85-D85","v":116853029},null,{"$f":"+E85-F85","v":0}]
[null,"Programa 40 - Más mujeres viven una vida libre de violencias, se sienten seguras y acceden con confianza al sistema de justicia",366000000,null,109800000]
[null,"DIFERENCIAS",{"$f":"+C87-D87","v":366000000},null,{"$f":"+E87-F87","v":109800000}]
[null,"Proeycto 2161",366000000,null,109800000]
[null,"DIFERENCIAS",{"$f":"+C89-D89","v":366000000},null,{"$f":"+E89-F89","v":109800000}]
[null,"Programa 43 - Cultura ciudadana para la confianza, la convivencia y la participación desde la vida cotidiana",494068750,null,384402085]
[null,"DIFERENCIAS",{"$f":"+C91-D91","v":494068750},null,{"$f":"+E91-F91","v":384402085}]
[null,"Proyecto 2128",494068750,null,384402085]
[null,"DIFERENCIAS",{"$f":"+C93-D93","v":494068750},null,{"$f":"+E93-F93","v":384402085}]
[null,"Programa 45 - Espacio público más seguro y construido colectivamente",710988066,null,242951902]
[null,"DIFERENCIAS",{"$f":"+C95-D95","v":710988066},null,{"$f":"+E95-F95","v":242951902}]
[null,"Proyecto 2130 ",710988066,null,242951902]
[null,"DIFERENCIAS",{"$f":"+C97-D97","v":710988066},null,{"$f":"+E97-F97","v":242951902}]
[null,"Programa 48 - Plataforma institucional para la seguridad y justicia",450000000,null,0]
[null,"DIFERENCIAS",{"$f":"+C99-D99","v":450000000},null,{"$f":"+E99-F99","v":0}]
[null,"Proyecto 2163",450000000,null,0]
[null,"DIFERENCIAS",{"$f":"+C101-D101","v":450000000},null,{"$f":"+E101-F101","v":0}]
[null,"Propósito 4 -  Hacer de Bogotá Región un modelo de movilidad multimodal, incluyente y sostenible",4280230621,null,0]
[null,"DIFERENCIAS",{"$f":"+C103-D103","v":4280230621},null,{"$f":"+E103-F103","v":0}]
[null,"Programa 49 - Movilidad segura, sostenible y accesible",4280230621,null,0]
[null,"DIFERENCIAS",{"$f":"+C105-D105","v":4280230621},null,{"$f":"+E105-F105","v":0}]
[null,"Proyecto 2145",4280230621,null,0]
[null,"DIFERENCIAS",{"$f":"+C107-D107","v":4280230621},null,{"$f":"+E107-F107","v":0}]
[null,"Propósito 5 -  Construir Bogotá Región con gobierno abierto, transparente y ciudadanía consciente",11242130017,null,4971927087]
[null,"DIFERENCIAS",{"$f":"+C109-D109","v":11242130017},null,{"$f":"+E109-F109","v":4971927087}]
[null,"Programa 54 - Transformación digital y gestión de TIC para un territorio inteligente",605000000,null,0]
[null,"DIFERENCIAS",{"$f":"+C111-D111","v":605000000},null,{"$f":"+E111-F111","v":0}]
[null,"Proyecto 2114",605000000,null,0]
[null,"DIFERENCIAS",{"$f":"+C113-D113","v":605000000},null,{"$f":"+E113-F113","v":0}]
[null,"Programa 55 - Fortalecimiento de Cultura Ciudadana y su institucionalidad",3933615411,null,5440000]
[null,"DIFERENCIAS",{"$f":"+C115-D115","v":3933615411},null,{"$f":"+E115-F115","v":5440000}]
[null,"Proyecto 2156",3933615411,null,5440000]
[null,"DIFERENCIAS",{"$f":"+C117-D117","v":3933615411},null,{"$f":"+E117-F117","v":5440000}]
[null,"Programa 56 - Gestión Pública Efectiva",0,null,0]
[null,"DIFERENCIAS",{"$f":"+C119-D119","v":0},null,{"$f":"+E119-F119","v":0}]
[null,"Proyecto 2136 ",0,null,0]
[null,"DIFERENCIAS",{"$f":"+C121-D121","v":0},null,{"$f":"+E121-F121","v":0}]
[null,"Programa 57 - Gestión Pública Local",6703514606,null,4966487087]
[null,"DIFERENCIAS",{"$f":"+C123-D123","v":6703514606},null,{"$f":"+E123-F123","v":4966487087}]
[null,"Proyecto 1822",20000000,null,0]
[null,"DIFERENCIAS",{"$f":"+C125-D125","v":20000000},null,{"$f":"+E125-F125","v":0}]
[null,"Proyecto 2105 ",6683514606,null,4966487087]
[null,"DIFERENCIAS",{"$f":"+C127-D127","v":6683514606},null,{"$f":"+E127-F127","v":4966487087}]

{"sheet":"BOGDATA ","index":2,"n_rows":187,"n_cols":20,"rows_kept":187,"cut":false,"hidden":false,"merged":[]}
["ENTIDAD","FECHA DE CORTE","CODIGO","NOMBRE","APROPIACION INICIAL","MODIFICACIONES MES","MODIFICACIONES ACUMULADAS","APROPIACION VIGENTE","SUSPENSION APROPIACION","APROPIACION DISPONIBLE","TOTAL COMPROMISOS MES","TOTAL COMPROMISOS ACUMULADO","% EJEC PRESUP","AMORTIZACION GIROS MES","AMORTIZACION GIROS ACUMULADOS","PORCENTAJE EJECUCION AUTORIZADO GIRO","AREA FUNCIONAL","NOMBRE AREA FUNCIONAL","SECTOR","NOMBRE SECTOR"]
[3,"2022-12-31","O2","GASTOS",57244756000,0,-2555075819,54689680181,0,54689680181,9164868448,53521189776,98,3299664572,27882178526,50.98,"0004-016","FDL-LOCALIDADES",16,"LOCALIDADES"]
[3,"2022-12-31","O21","Funcionamiento",2417686000,0,-212016429,2205669571,0,2205669571,94120788,2123634614,96,239645242,1736301757,78.72,"0004-016","FDL-LOCALIDADES",16,"LOCALIDADES"]
[3,"2022-12-31","O211","Gastos de personal",698715000,0,-9000000,689715000,0,689715000,-1200052,688299948,100,114716658,688299948,99.79,"0004-016","FDL-LOCALIDADES",16,"LOCALIDADES"]
[3,"2022-12-31","O21101","Planta de personal permanente",698715000,0,-9000000,689715000,0,689715000,-1200052,688299948,100,114716658,688299948,99.79,"0004-016","FDL-LOCALIDADES",16,"LOCALIDADES"]
[3,"2022-12-31","O2110103","Remuneraciones no constitutivas de factor salarial",698715000,0,-9000000,689715000,0,689715000,-1200052,688299948,100,114716658,688299948,99.79,"0004-016","FDL-LOCALIDADES",16,"LOCALIDADES"]
[3,"2022-12-31","O2110103007","Honorarios Ediles",698715000,0,-9000000,689715000,0,689715000,-1200052,688299948,100,114716658,688299948,99.79,"0004-016","FDL-LOCALIDADES",16,"LOCALIDADES"]
[3,"2022-12-31","O212","Adquisición de bienes y servicios",1207458000,0,9000000,1216458000,0,1216458000,95320840,1179749186,97,98917233,890975570,73.239999999999995,"0004-016","FDL-LOCALIDADES",16,"LOCALIDADES"]
[3,"2022-12-31","O21202","Adquisiciones diferentes de activos",1207458000,0,9000000,1216458000,0,1216458000,95320840,1179749186,97,98917233,890975570,73.239999999999995,"0004-016","FDL-LOCALIDADES",16,"LOCALIDADES"]
[3,"2022-12-31","O2120201","Materiales y suministros",72958000,0,17476978,90434978,0,90434978,20133918,86015596,95,4244678,16419944,18.16,"0004-016","FDL-LOCALIDADES",16,"LOCALIDADES"]
[3,"2022-12-31","O2120201003","Otros bienes transportables (excepto productos metálicos, maquinaria y equipo)",49458000,0,17476978,66934978,0,66934978,20133918,62536904,93,2544339,11261271,16.82,"0004-016","FDL-LOCALIDADES",16,"LOCALIDADES"]
[3,"2022-12-31","O212020100302","Pasta o pulpa, papel y productos de papel"]
[3,"2022-12-31","O2120201003023219999","Artículos n.c.p. de pulpa de papel o cartón",2000000,0,0,2000000,0,2000000,0,0,0,0,0,0,"0004-016","FDL-LOCALIDADES",16,"LOCALIDADES"]
[3,"2022-12-31","O212020100303","Productos de hornos de coque"]
[3,"2022-12-31","O2120201003033331101","Gasolina motor corriente",25000000,0,16676978,41676978,0,41676978,0,41676978,100,1818331,10535263,25.28,"0004-016","FDL-LOCALIDADES",16,"LOCALIDADES"]
[3,"2022-12-31","O212020100305","Otros productos químicos"]
[3,"2022-12-31","O2120201003053544203","Mezclas químicas para extintores",1200000,0,800000,2000000,0,2000000,0,726008,36,726008,726008,36.299999999999997,"0004-016","FDL-LOCALIDADES",16,"LOCALIDADES"]
[3,"2022-12-31","O212020100308","Muebles"]
[3,"2022-12-31","O2120201003083899998","Artículos n.c.p. para escritorio y oficina",21258000,0,0,21258000,0,21258000,20133918,20133918,95,0,0,0,"0004-016","FDL-LOCALIDADES",16,"LOCALIDADES"]
[3,"2022-12-31","O2120201004","Productos metálicos y paquetes de software",23500000,0,0,23500000,0,23500000,0,23478692,100,1700339,5158673,21.95,"0004-016","FDL-LOCALIDADES",16,"LOCALIDADES"]
[3,"2022-12-31","O212020100402","Productos metálicos elaborados (excepto maquinaria y equipo)",23500000,0,0,23500000,0,23500000,0,23478692,100,1700339,5158673,21.95,"0004-016","FDL-LOCALIDADES",16,"LOCALIDADES"]
[3,"2022-12-31","O2120201004024299991","Artículos n.c.p. de ferretería y cerrajería",23500000,0,0,23500000,0,23500000,0,23478692,100,1700339,5158673,21.95,"0004-016","FDL-LOCALIDADES",16,"LOCALIDADES"]
[3,"2022-12-31","O2120202","Adquisición de servicios",1134500000,0,-8476978,1126023022,0,1126023022,75186922,1093733590,97,94672555,874555626,77.67,"0004-016","FDL-LOCALIDADES",16,"LOCALIDADES"]
[3,"2022-12-31","O2120202007","Servicios financieros y servicios conexos, servicios inmobiliarios y servicios de leasing",308500000,0,-7676978,300823022,0,300823022,10041200,278010422,92,25854819,243945859,81.09,"0004-016","FDL-LOCALIDADES",16,"LOCALIDADES"]
[3,"2022-12-31","O212020200701","Servicios financieros y servicios conexos",259500000,0,-16676978,242823022,0,242823022,10041200,241164422,99,25005925,225435831,92.84,"0004-016","FDL-LOCALIDADES",16,"LOCALIDADES"]
[3,"2022-12-31","O21202020070103","Servicios de seguros y pensiones (excepto los servicios de reaseguro y de seguridad social de afiliación obligatoria)",259500000,0,-16676978,242823022,0,242823022,10041200,241164422,99,25005925,225435831,92.84,"0004-016","FDL-LOCALIDADES",16,"LOCALIDADES"]
[3,"2022-12-31","O2120202007010301","Servicios de seguros de vida (excepto los servicios de reaseguro)",7000000,-1550000,3730800,10730800,0,10730800,0,9870000,92,0,0,0,"0004-016","FDL-LOCALIDADES",16,"LOCALIDADES"]
[3,"2022-12-31","O212020200701030102","Ediles",7000000,-1550000,3730800,10730800,0,10730800,0,9870000,92,0,0,0,"0004-016","FDL-LOCALIDADES",16,"LOCALIDADES"]
[3,"2022-12-31","O21202020070103010271311","Servicios de seguros de vida individual",7000000,-1550000,3730800,10730800,0,10730800,0,9870000,92,0,0,0,"0004-016","FDL-LOCALIDADES",16,"LOCALIDADES"]
[3,"2022-12-31","O2120202007010303","Servicios de seguros sociales de protección de otros riesgos sociales (excepto los servicios de seguridad social de afiliación obligatoria)",84500000,1550000,1550000,86050000,0,86050000,10041200,86041200,100,14340200,86041200,99.99,"0004-016","FDL-LOCALIDADES",16,"LOCALIDADES"]
[3,"2022-12-31","O212020200701030371331","Servicios de seguros sociales de salud",84500000,1550000,1550000,86050000,0,86050000,10041200,86041200,100,14340200,86041200,99.99,"0004-016","FDL-LOCALIDADES",16,"LOCALIDADES"]
[3,"2022-12-31","O2120202007010304","Servicios de seguros de salud y de accidentes",3000000,0,1567600,4567600,0,4567600,0,3778600,83,3778600,3778600,82.73,"0004-016","FDL-LOCALIDADES",16,"LOCALIDADES"]
[3,"2022-12-31","O212020200701030471347","Servicio de seguro obligatorio de accidentes de tránsito (SOAT)",3000000,0,1567600,4567600,0,4567600,0,3778600,83,3778600,3778600,82.73,"0004-016","FDL-LOCALIDADES",16,"LOCALIDADES"]
[3,"2022-12-31","O2120202007010305","Otros servicios de seguros distintos a los seguros de vida (excepto los servicios de reaseguro)",165000000,0,-23525378,141474622,0,141474622,0,141474622,100,6887125,135616031,95.86,"0004-016","FDL-LOCALIDADES",16,"LOCALIDADES"]
[3,"2022-12-31","O212020200701030571351","Servicios de seguros de vehículos automotores",9000000,0,433538,9433538,0,9433538,0,9433538,100,6887125,9433537,100,"0004-016","FDL-LOCALIDADES",16,"LOCALIDADES"]
[3,"2022-12-31","O212020200701030571354","Servicios de seguros contra incendio, terremoto o sustracción",67000000,0,-44662570,22337430,0,22337430,0,22337430,100,0,16478840,73.77,"0004-016","FDL-LOCALIDADES",16,"LOCALIDADES"]
[3,"2022-12-31","O212020200701030571355","Servicios de seguros generales de responsabilidad civil",81000000,0,20112832,101112832,0,101112832,0,101112832,100,0,101112832,100,"0004-016","FDL-LOCALIDADES",16,"LOCALIDADES"]
[3,"2022-12-31","O212020200701030571359","Otros servicios de seguros distintos de los seguros de vida n.c.p.",8000000,0,590822,8590822,0,8590822,0,8590822,100,0,8590822,100,"0004-016","FDL-LOCALIDADES",16,"LOCALIDADES"]
[3,"2022-12-31","O212020200702","Servicios inmobiliarios",0,0,9000000,9000000,0,9000000,0,9000000,100,848894,7371628,81.91,"0004-016","FDL-LOCALIDADES",16,"LOCALIDADES"]
[3,"2022-12-31","O21202020070272212","Servicios de administración de bienes inmuebles no residenciales (diferentes a vivienda) a comisión o por contrato",0,0,9000000,9000000,0,9000000,0,9000000,100,848894,7371628,81.91,"0004-016","FDL-LOCALIDADES",16,"LOCALIDADES"]
[3,"2022-12-31","O212020200703","Servicios de arrendamiento o alquiler sin operario",49000000,0,0,49000000,0,49000000,0,27846000,57,0,11138400,22.73,"0004-016","FDL-LOCALIDADES",16,"LOCALIDADES"]
[3,"2022-12-31","O21202020070373123","Servicios de arrendamiento sin opción de compra de maquinaria y equipo de oficina sin operario (excepto computadoras)",49000000,0,0,49000000,0,49000000,0,27846000,57,0,11138400,22.73,"0004-016","FDL-LOCALIDADES",16,"LOCALIDADES"]
[3,"2022-12-31","O2120202008","Servicios prestados a las empresas y servicios de producción",814000000,0,-800000,813200000,0,813200000,65145722,803883821,99,67970483,619317237,76.16,"0004-016","FDL-LOCALIDADES",16,"LOCALIDADES"]
[3,"2022-12-31","O212020200804","Servicios de telecomunicaciones, transmisión y suministro de información",42000000,0,0,42000000,0,42000000,0,42000000,100,3185970,38222900,91.01,"0004-016","FDL-LOCALIDADES",16,"LOCALIDADES"]
[3,"2022-12-31","O21202020080484120","Servicios de telefonía fija (acceso)",12000000,0,0,12000000,0,12000000,0,12000000,100,981580,12000000,100,"0004-016","FDL-LOCALIDADES",16,"LOCALIDADES"]
[3,"2022-12-31","O21202020080484222","Servicios de acceso a Internet de banda ancha",30000000,0,0,30000000,0,30000000,0,30000000,100,2204390,26222900,87.41,"0004-016","FDL-LOCALIDADES",16,"LOCALIDADES"]
[3,"2022-12-31","O212020200805","Servicios de soporte",583000000,0,0,583000000,0,583000000,34231530,583000000,100,49250277,455183382,78.08,"0004-016","FDL-LOCALIDADES",16,"LOCALIDADES"]
[3,"2022-12-31","O21202020080585250","Servicios de protección (guardas de seguridad)",450000000,33390070,33390070,483390070,0,483390070,34231530,483390070,100,40868194,385322644,79.709999999999994,"0004-016","FDL-LOCALIDADES",16,"LOCALIDADES"]
[3,"2022-12-31","O21202020080585330","Servicios de limpieza general",133000000,-33390070,-33390070,99609930,0,99609930,0,99609930,100,8382083,69860738,70.13,"0004-016","FDL-LOCALIDADES",16,"LOCALIDADES"]
[3,"2022-12-31","O212020200806","Servicios de apoyo y de operación para la agricultura, la caza, la silvicultura, la pesca, la minería y los servicios públicos",66000000,0,23000000,89000000,0,89000000,-20808,88979192,100,9362690,88644869,99.6,"0004-016","FDL-LOCALIDADES",16,"LOCALIDADES"]
[3,"2022-12-31","O21202020080686312","Servicios de distribución de electricidad (a comisión o por contrato)",56000000,-460000,22540000,78540000,0,78540000,-460000,78540000,100,8594770,78205677,99.57,"0004-016","FDL-LOCALIDADES",16,"LOCALIDADES"]
[3,"2022-12-31","O21202020080686330","Servicios de distribución de agua por tubería (a comisión o por contrato)",10000000,460000,460000,10460000,0,10460000,439192,10439192,100,767920,10439192,99.8,"0004-016","FDL-LOCALIDADES",16,"LOCALIDADES"]
[3,"2022-12-31","O212020200807","Servicios de mantenimiento, reparación e instalación (excepto servicios de construcción)",123000000,0,-23800000,99200000,0,99200000,30935000,89904629,91,6171546,37266086,37.57,"0004-016","FDL-LOCALIDADES",16,"LOCALIDADES"]
[3,"2022-12-31","O21202020080787130","Servicios de mantenimiento y reparación de computadores y equipos periféricos",45000000,0,-17000000,28000000,0,28000000,23735000,23735000,85,0,0,0,"0004-016","FDL-LOCALIDADES",16,"LOCALIDADES"]
[3,"2022-12-31","O2120202008078714102","Servicio de mantenimiento y reparación de vehículos automóviles",35000000,0,-800000,34200000,0,34200000,7200000,34200000,100,4005924,26011677,76.06,"0004-016","FDL-LOCALIDADES",16,"LOCALIDADES"]
[3,"2022-12-31","O2120202008078715299","Otros servicios de mantenimiento y reparación de maquinaria y aparatos eléctricos n.c.p.",14000000,0,0,14000000,0,14000000,0,14000000,100,0,0,0,"0004-016","FDL-LOCALIDADES",16,"LOCALIDADES"]
[3,"2022-12-31","O2120202008078715399","Servicios de mantenimiento y reparación de equipos y aparatos de telecomunicaciones n.c.p.",15000000,0,-10000000,5000000,0,5000000,0,0,0,0,0,0,"0004-016","FDL-LOCALIDADES",16,"LOCALIDADES"]
[3,"2022-12-31","O2120202008078715701","Servicio de mantenimiento y reparación de ascensores",14000000,0,4000000,18000000,0,18000000,0,17969629,100,2165622,11254409,62.52,"0004-016","FDL-LOCALIDADES",16,"LOCALIDADES"]
[3,"2022-12-31","O2120202009","Servicios para la comunidad, sociales y personales",12000000,0,0,12000000,0,12000000,0,11839347,99,847253,11292530,94.1,"0004-016","FDL-LOCALIDADES",16,"LOCALIDADES"]
[3,"2022-12-31","O212020200904","Servicios de alcantarillado, recolección, tratamiento y disposición de desechos y otros servicios de saneamiento ambiental",12000000,0,0,12000000,0,12000000,0,11839347,99,847253,11292530,94.1,"0004-016","FDL-LOCALIDADES",16,"LOCALIDADES"]
[3,"2022-12-31","O21202020090494239","Servicios generales de recolección de otros desechos",6000000,0,6000000,12000000,0,12000000,0,11839347,99,847253,11292530,94.1,"0004-016","FDL-LOCALIDADES",16,"LOCALIDADES"]
[3,"2022-12-31","O2190","Obligaciones por Pagar Funcionamiento",511513000,0,-212016429,299496571,0,299496571,0,255585480,85,26011351,157026239,52.43,"0004-016","FDL-LOCALIDADES",16,"LOCALIDADES"]
[3,"2022-12-31","O219001","Obligaciones por Pagar Funcionamiento Vigencia Anterior",449000000,0,-196011966,252988034,0,252988034,0,209076943,83,26011351,152623734,60.33,"0004-016","FDL-LOCALIDADES",16,"LOCALIDADES"]
[3,"2022-12-31","O219002","Obligaciones por Pagar Funcionamiento Otras Vigencias",62513000,0,-16004463,46508537,0,46508537,0,46508537,100,0,4402505,9.4700000000000006,"0004-016","FDL-LOCALIDADES",16,"LOCALIDADES"]
[3,"2022-12-31","O23","INVERSION",54827070000,0,-2343059390,52484010610,0,52484010610,9070747660,51397555162,98,3060019330,26145876769,49.82,"0004-016","FDL-LOCALIDADES",16,"LOCALIDADES"]
[3,"2022-12-31","O2301","DIRECTA",35586914000,0,975501330,36562415330,0,36562415330,9217509386,36034301606,99,1983302791,16515005677,45.17,"0004-016","FDL-LOCALIDADES",16,"LOCALIDADES"]
[3,"2022-12-31","O230116","Un Nuevo Contrato Social y Ambiental para la Bogotá del Siglo XXI",35586914000,0,975501330,36562415330,0,36562415330,9217509386,36034301606,99,1983302791,16515005677,45.17,"0004-016","FDL-LOCALIDADES",16,"LOCALIDADES"]
[3,"2022-12-31","O23011601","Hacer un nuevo contrato social con igualdad de oportunidades para la inclusión social, productiva y política",18360590000,0,-1070386874,17290203126,0,17290203126,4162441625,17197723212,99,1077093477,10739439746,62.11,"0004-016","FDL-LOCALIDADES",16,"LOCALIDADES"]
[3,"2022-12-31","O2301160101","Subsidios y transferencias para la equidad",6489000000,0,-195000000,6294000000,0,6294000000,30349000,6294000000,100,364605813,6151631720,97.74,"0004-016","FDL-LOCALIDADES",16,"LOCALIDADES"]
[3,"2022-12-31","O23011601010000002081","Santa Fe activo con el envejecimiento, cuidador e incluyente",6489000000,0,-195000000,6294000000,0,6294000000,30349000,6294000000,100,364605813,6151631720,97.74,"0004-016","FDL-LOCALIDADES",16,"LOCALIDADES"]
[3,"2022-12-31","O2301160106","Sistema Distrital del Cuidado",3600504000,0,0,3600504000,0,3600504000,898581108,3559311709,99,368188851,1120202428,31.11,"0004-016","FDL-LOCALIDADES",16,"LOCALIDADES"]
[3,"2022-12-31","O23011601060000002188","Santa Fe con un sistema de cuidado",3600504000,0,0,3600504000,0,3600504000,898581108,3559311709,99,368188851,1120202428,31.11,"0004-016","FDL-LOCALIDADES",16,"LOCALIDADES"]
[3,"2022-12-31","O2301160107","Mejora de la gestión de instituciones de salud",180000000,0,0,180000000,0,180000000,607150,176708850,98,20179150,45024250,25.01,"0004-016","FDL-LOCALIDADES",16,"LOCALIDADES"]
[3,"2022-12-31","O23011601070000002104","Santa Fe mejora la gestión en Salud",180000000,0,0,180000000,0,180000000,607150,176708850,98,20179150,45024250,25.01,"0004-016","FDL-LOCALIDADES",16,"LOCALIDADES"]
[3,"2022-12-31","O2301160108","Prevención y atención de maternidad temprana",292000000,0,0,292000000,0,292000000,282083147,282083147,97,0,0,0,"0004-016","FDL-LOCALIDADES",16,"LOCALIDADES"]
[3,"2022-12-31","O23011601080000002064","Santa Fe atiende y previene la maternidad temprana",292000000,0,0,292000000,0,292000000,282083147,282083147,97,0,0,0,"0004-016","FDL-LOCALIDADES",16,"LOCALIDADES"]
[3,"2022-12-31","O2301160112","Educación inicial: Bases sólidas para la vida",529000000,0,0,529000000,0,529000000,527530880,527530880,100,158259264,158259264,29.92,"0004-016","FDL-LOCALIDADES",16,"LOCALIDADES"]
[3,"2022-12-31","O23011601120000002102","Educación inicial para Santa Fe",529000000,0,0,529000000,0,529000000,527530880,527530880,100,158259264,158259264,29.92,"0004-016","FDL-LOCALIDADES",16,"LOCALIDADES"]
[3,"2022-12-31","O2301160114","Formación integral: más y mejor tiempo en los colegios",267000000,0,0,267000000,0,267000000,265554092,265554092,99,0,0,0,"0004-016","FDL-LOCALIDADES",16,"LOCALIDADES"]
[3,"2022-12-31","O23011601140000002091","Formación integral en Santa Fe",267000000,0,0,267000000,0,267000000,265554092,265554092,99,0,0,0,"0004-016","FDL-LOCALIDADES",16,"LOCALIDADES"]
[3,"2022-12-31","O2301160117","Jóvenes con capacidades: Proyecto de vida para la ciudadanía, la innovación y el trabajo del siglo XXI",2430000000,0,-1170386874,1259613126,0,1259613126,0,1259613126,100,0,1259613126,100,"0004-016","FDL-LOCALIDADES",16,"LOCALIDADES"]
[3,"2022-12-31","O23011601170000002095","Jóvenes con capacidades en Santa Fe",2430000000,0,-1170386874,1259613126,0,1259613126,0,1259613126,100,0,1259613126,100,"0004-016","FDL-LOCALIDADES",16,"LOCALIDADES"]
[3,"2022-12-31","O2301160119","Vivienda y entornos dignos en el territorio urbano y rural",588000000,0,0,588000000,0,588000000,587308017,587308017,100,0,0,0,"0004-016","FDL-LOCALIDADES",16,"LOCALIDADES"]
[3,"2022-12-31","O23011601190000002112","Vivienda y entornos dignos en el territorio urbano y rural en Santa Fe",588000000,0,0,588000000,0,588000000,587308017,587308017,100,0,0,0,"0004-016","FDL-LOCALIDADES",16,"LOCALIDADES"]
[3,"2022-12-31","O2301160120","Bogotá, referente en cultura, deporte, recreación y actividad física, con parques para el desarrollo y la salud",1088000000,0,195000000,1283000000,0,1283000000,349845321,1276095427,99,65440000,560498665,43.69,"0004-016","FDL-LOCALIDADES",16,"LOCALIDADES"]
[3,"2022-12-31","O23011601200000002100","Santa Fe , referente en cultura, deporte, recreación y actividad física, con parques para el desarrollo y la salud",1088000000,0,195000000,1283000000,0,1283000000,349845321,1276095427,99,65440000,560498665,43.69,"0004-016","FDL-LOCALIDADES",16,"LOCALIDADES"]
[3,"2022-12-31","O2301160121","Creación y vida cotidiana: Apropiación ciudadana del arte, la cultura y el patrimonio, para la democracia cultural",1445000000,0,100000000,1545000000,0,1545000000,642024499,1544909910,100,75885400,786749572,50.92,"0004-016","FDL-LOCALIDADES",16,"LOCALIDADES"]
[3,"2022-12-31","O23011601210000002110","Apropiación ciudadana del arte, la cultura y el patrimonio en Santa Fe",1445000000,0,100000000,1545000000,0,1545000000,642024499,1544909910,100,75885400,786749572,50.92,"0004-016","FDL-LOCALIDADES",16,"LOCALIDADES"]
[3,"2022-12-31","O2301160123","Bogotá rural",578000000,0,0,578000000,0,578000000,550558511,550558511,95,0,0,0,"0004-016","FDL-LOCALIDADES",16,"LOCALIDADES"]
[3,"2022-12-31","O23011601230000002108","Santa Fe rural",578000000,0,0,578000000,0,578000000,550558511,550558511,95,0,0,0,"0004-016","FDL-LOCALIDADES",16,"LOCALIDADES"]
[3,"2022-12-31","O2301160124","Bogotá región emprendedora e innovadora",874086000,0,0,874086000,0,874086000,27999900,874049543,100,24534999,657460721,75.22,"0004-016","FDL-LOCALIDADES",16,"LOCALIDADES"]
[3,"2022-12-31","O23011601240000002123","Santa Fe región emprendedora e innovadora",874086000,0,0,874086000,0,874086000,27999900,874049543,100,24534999,657460721,75.22,"0004-016","FDL-LOCALIDADES",16,"LOCALIDADES"]
[3,"2022-12-31","O23011602","Cambiar nuestros hábitos de vida para reverdecer a Bogotá y adaptarnos y mitigar la crisis climática",1664000000,-240000000,-360000000,1304000000,0,1304000000,722248131,1176307911,90,8700000,66484857,5.0999999999999996,"0004-016","FDL-LOCALIDADES",16,"LOCALIDADES"]
[3,"2022-12-31","O2301160228","Bogotá protectora de sus recursos naturales",110000000,0,0,110000000,0,110000000,0,0,0,0,0,0,"0004-016","FDL-LOCALIDADES",16,"LOCALIDADES"]
[3,"2022-12-31","O23011602280000002117","Restauración ecológica en Santa Fe",110000000,0,0,110000000,0,110000000,0,0,0,0,0,0,"0004-016","FDL-LOCALIDADES",16,"LOCALIDADES"]
[3,"2022-12-31","O2301160233","Más árboles y más y mejor espacio público",835000000,0,0,835000000,0,835000000,561210600,824447911,99,0,8504857,1.02,"0004-016","FDL-LOCALIDADES",16,"LOCALIDADES"]
[3,"2022-12-31","O23011602330000002138","Más árboles y más y mejor espacio público en Santa Fe",835000000,0,0,835000000,0,835000000,561210600,824447911,99,0,8504857,1.02,"0004-016","FDL-LOCALIDADES",16,"LOCALIDADES"]
[3,"2022-12-31","O2301160234","Bogotá protectora de los animales",200000000,0,0,200000000,0,200000000,19977531,195200000,98,4800000,47840000,23.92,"0004-016","FDL-LOCALIDADES",16,"LOCALIDADES"]
[3,"2022-12-31","O23011602340000002074","Santa Fe protectora de los animales",200000000,0,0,200000000,0,200000000,19977531,195200000,98,4800000,47840000,23.92,"0004-016","FDL-LOCALIDADES",16,"LOCALIDADES"]
[3,"2022-12-31","O2301160237","Provisión y mejoramiento de servicios públicos",240000000,-240000000,-240000000,0,0,0,0,0,0,0,0,0,"0004-016","FDL-LOCALIDADES",16,"LOCALIDADES"]
[3,"2022-12-31","O23011602370000002129","Provisión y mejoramiento de servicios públicos en Santa Fe",240000000,-240000000,-240000000,0,0,0,0,0,0,0,0,0,"0004-016","FDL-LOCALIDADES",16,"LOCALIDADES"]
[3,"2022-12-31","O2301160238","Ecoeficiencia, reciclaje, manejo de residuos e inclusión de la población recicladora",159000000,0,0,159000000,0,159000000,141060000,156660000,99,3900000,10140000,6.38,"0004-016","FDL-LOCALIDADES",16,"LOCALIDADES"]
[3,"2022-12-31","O23011602380000002131","Ecoeficiencia y manejo de residuos en Santa Fe",159000000,0,0,159000000,0,159000000,141060000,156660000,99,3900000,10140000,6.38,"0004-016","FDL-LOCALIDADES",16,"LOCALIDADES"]
[3,"2022-12-31","O23011603","Inspirar confianza y legitimidad para vivir sin miedo y ser epicentro de cultura ciudadana, paz y reconciliación",1981550000,0,230000000,2211550000,0,2211550000,1509514850,2137909845,97,390651185,737153987,33.33,"0004-016","FDL-LOCALIDADES",16,"LOCALIDADES"]
[3,"2022-12-31","O2301160339","Bogotá territorio de paz y atención integral a las víctimas del conflicto armado",0,0,120000000,120000000,0,120000000,0,116853029,97,0,0,0,"0004-016","FDL-LOCALIDADES",16,"LOCALIDADES"]
[3,"2022-12-31","O23011603390000002187","Santa Fe territorio de paz y atención integral a las víctimas del conflicto armado",0,0,120000000,120000000,0,120000000,0,116853029,97,0,0,0,"0004-016","FDL-LOCALIDADES",16,"LOCALIDADES"]
[3,"2022-12-31","O2301160340","Más mujeres viven una vida libre de violencias, se sienten seguras y acceden con confianza al sistema de justicia",366000000,0,0,366000000,0,366000000,366000000,366000000,100,109800000,109800000,30,"0004-016","FDL-LOCALIDADES",16,"LOCALIDADES"]
[3,"2022-12-31","O23011603400000002161","Santa Fe con más mujeres seguras y defensoras de sus derechos",366000000,0,0,366000000,0,366000000,366000000,366000000,100,109800000,109800000,30,"0004-016","FDL-LOCALIDADES",16,"LOCALIDADES"]
[3,"2022-12-31","O2301160343","Cultura ciudadana para la confianza, la convivencia y la participación desde la vida cotidiana",454550000,0,110000000,564550000,0,564550000,31564850,494068750,88,50678182,384402085,68.09,"0004-016","FDL-LOCALIDADES",16,"LOCALIDADES"]
[3,"2022-12-31","O23011603430000002128","Santa Fe con convivencia, justicia y seguridad",454550000,0,110000000,564550000,0,564550000,31564850,494068750,88,50678182,384402085,68.09,"0004-016","FDL-LOCALIDADES",16,"LOCALIDADES"]
[3,"2022-12-31","O2301160345","Espacio público más seguro y construido colectivamente",711000000,0,0,711000000,0,711000000,661950000,710988066,100,230173003,242951902,34.17,"0004-016","FDL-LOCALIDADES",16,"LOCALIDADES"]
[3,"2022-12-31","O23011603450000002130","Espacio público mas seguro y construido colectivamente en Santa Fe",711000000,0,0,711000000,0,711000000,661950000,710988066,100,230173003,242951902,34.17,"0004-016","FDL-LOCALIDADES",16,"LOCALIDADES"]
[3,"2022-12-31","O2301160348","Plataforma institucional para la seguridad y justicia",450000000,0,0,450000000,0,450000000,450000000,450000000,100,0,0,0,"0004-016","FDL-LOCALIDADES",16,"LOCALIDADES"]
[3,"2022-12-31","O23011603480000002163","Plataforma institucional para la seguridad y justicia en Santa Fe.",450000000,0,0,450000000,0,450000000,450000000,450000000,100,0,0,0,"0004-016","FDL-LOCALIDADES",16,"LOCALIDADES"]
[3,"2022-12-31","O23011604","Hacer de Bogotá Región un modelo de movilidad multimodal, incluyente y sostenible",3799431000,0,480799628,4280230628,0,4280230628,431560573,4280230621,100,0,0,0,"0004-016","FDL-LOCALIDADES",16,"LOCALIDADES"]
[3,"2022-12-31","O2301160449","Movilidad segura, sostenible y accesible",3799431000,0,480799628,4280230628,0,4280230628,431560573,4280230621,100,0,0,0,"0004-016","FDL-LOCALIDADES",16,"LOCALIDADES"]
[3,"2022-12-31","O23011604490000002145","Movilidad segura, sostenible y accesible en Santa Fe",3799431000,0,480799628,4280230628,0,4280230628,431560573,4280230621,100,0,0,0,"0004-016","FDL-LOCALIDADES",16,"LOCALIDADES"]
[3,"2022-12-31","O23011605","Construir Bogotá Región con gobierno abierto, transparente y ciudadanía consciente",9781343000,240000000,1695088576,11476431576,0,11476431576,2391744207,11242130017,98,506858129,4971927087,43.32,"0004-016","FDL-LOCALIDADES",16,"LOCALIDADES"]
[3,"2022-12-31","O2301160554","Transformación digital y gestión de TIC para un territorio inteligente",605000000,0,0,605000000,0,605000000,605000000,605000000,100,0,0,0,"0004-016","FDL-LOCALIDADES",16,"LOCALIDADES"]
[3,"2022-12-31","O23011605540000002114","Transformación digital y gestión de TIC en Santa Fe",605000000,0,0,605000000,0,605000000,605000000,605000000,100,0,0,0,"0004-016","FDL-LOCALIDADES",16,"LOCALIDADES"]
[3,"2022-12-31","O2301160555","Fortalecimiento de Cultura Ciudadana y su institucionalidad",4127787000,0,0,4127787000,0,4127787000,871052343,3933615411,95,5440000,5440000,0.13,"0004-016","FDL-LOCALIDADES",16,"LOCALIDADES"]
[3,"2022-12-31","O23011605550000002156","Participación y cultura ciudadana en Santa Fe",4127787000,0,0,4127787000,0,4127787000,871052343,3933615411,95,5440000,5440000,0.13,"0004-016","FDL-LOCALIDADES",16,"LOCALIDADES"]
[3,"2022-12-31","O2301160556","Gestión Pública Efectiva",1000000,0,0,1000000,0,1000000,0,0,0,0,0,0,"0004-016","FDL-LOCALIDADES",16,"LOCALIDADES"]
[3,"2022-12-31","O23011605560000002136","Gestión pública efectiva en Santa Fe",1000000,0,0,1000000,0,1000000,0,0,0,0,0,0,"0004-016","FDL-LOCALIDADES",16,"LOCALIDADES"]
[3,"2022-12-31","O2301160557","Gestión Pública Local",5047556000,240000000,1695088576,6742644576,0,6742644576,915691864,6703514606,99,501418129,4966487087,73.66,"0004-016","FDL-LOCALIDADES",16,"LOCALIDADES"]
[3,"2022-12-31","O23011605570000001822","Santa Fe abierta y transparente",20000000,0,0,20000000,0,20000000,0,20000000,100,0,0,0,"0004-016","FDL-LOCALIDADES",16,"LOCALIDADES"]
[3,"2022-12-31","O23011605570000002105","Gestión publica local en Santa Fe",5027556000,240000000,1695088576,6722644576,0,6722644576,915691864,6683514606,99,501418129,4966487087,73.88,"0004-016","FDL-LOCALIDADES",16,"LOCALIDADES"]
[3,"2022-12-31","O2306","OBLIGACIONES POR PAGAR",19240156000,0,-3318560720,15921595280,0,15921595280,-146761726,15363253556,96,1076716539,9630871092,60.49,"0004-016","FDL-LOCALIDADES",16,"LOCALIDADES"]
[3,"2022-12-31","O230616","Un Nuevo Contrato Social y Ambiental para la Bogotá del Siglo XXI",11166105000,0,-1227299341,9938805659,0,9938805659,-30351034,9898539735,100,545797340,6758155159,68,"0004-016","FDL-LOCALIDADES",16,"LOCALIDADES"]
[3,"2022-12-31","O23061601","Hacer un nuevo contrato social con igualdad de oportunidades para la inclusión social, productiva y política",3907653000,0,-136352335,3771300665,0,3771300665,-30351034,3739794490,99,308454899,2716022518,72.02,"0004-016","FDL-LOCALIDADES",16,"LOCALIDADES"]
[3,"2022-12-31","O2306160101","Subsidios y transferencias para la equidad",69648000,0,-9458882,60189118,0,60189118,0,59034117,98,0,54806520,91.06,"0004-016","FDL-LOCALIDADES",16,"LOCALIDADES"]
[3,"2022-12-31","O23061601010000002081","Santa Fe activo con el envejecimiento, cuidador e incluyente",69648000,0,-9458882,60189118,0,60189118,0,59034117,98,0,54806520,91.06,"0004-016","FDL-LOCALIDADES",16,"LOCALIDADES"]
[3,"2022-12-31","O2306160106","Sistema Distrital del Cuidado",1063119000,0,-26158557,1036960443,0,1036960443,0,1036960303,100,92423628,876640512,84.54,"0004-016","FDL-LOCALIDADES",16,"LOCALIDADES"]
[3,"2022-12-31","O23061601060000002188","Santa Fe con un sistema de cuidado",1063119000,0,-26158557,1036960443,0,1036960443,0,1036960303,100,92423628,876640512,84.54,"0004-016","FDL-LOCALIDADES",16,"LOCALIDADES"]
[3,"2022-12-31","O2306160107","Mejora de la gestión de instituciones de salud",137214000,0,-69718700,67495300,0,67495300,0,67495300,100,0,33747650,50,"0004-016","FDL-LOCALIDADES",16,"LOCALIDADES"]
[3,"2022-12-31","O23061601070000002104","Santa Fe mejora la gestión en Salud",137214000,0,-69718700,67495300,0,67495300,0,67495300,100,0,33747650,50,"0004-016","FDL-LOCALIDADES",16,"LOCALIDADES"]
[3,"2022-12-31","O2306160108","Prevención y atención de maternidad temprana",124214000,0,-8900100,115313900,0,115313900,0,115313900,100,0,115313900,100,"0004-016","FDL-LOCALIDADES",16,"LOCALIDADES"]
[3,"2022-12-31","O23061601080000002064","Santa Fe atiende y previene la maternidad temprana",124214000,0,-8900100,115313900,0,115313900,0,115313900,100,0,115313900,100,"0004-016","FDL-LOCALIDADES",16,"LOCALIDADES"]
[3,"2022-12-31","O2306160112","Educación inicial: Bases sólidas para la vida",447862000,0,-545,447861455,0,447861455,0,447861455,100,0,0,0,"0004-016","FDL-LOCALIDADES",16,"LOCALIDADES"]
[3,"2022-12-31","O23061601120000002102","Educación inicial para Santa Fe",447862000,0,-545,447861455,0,447861455,0,447861455,100,0,0,0,"0004-016","FDL-LOCALIDADES",16,"LOCALIDADES"]
[3,"2022-12-31","O2306160114","Formación integral: más y mejor tiempo en los colegios",219162000,0,-885,219161115,0,219161115,0,219161115,100,216031271,216031271,98.57,"0004-016","FDL-LOCALIDADES",16,"LOCALIDADES"]
[3,"2022-12-31","O23061601140000002091","Formación integral en Santa Fe",219162000,0,-885,219161115,0,219161115,0,219161115,100,216031271,216031271,98.57,"0004-016","FDL-LOCALIDADES",16,"LOCALIDADES"]
[3,"2022-12-31","O2306160119","Vivienda y entornos dignos en el territorio urbano y rural",476438000,0,-796,476437204,0,476437204,0,476437204,100,0,388289971,81.5,"0004-016","FDL-LOCALIDADES",16,"LOCALIDADES"]
[3,"2022-12-31","O23061601190000002112","Vivienda y entornos dignos en el territorio urbano y rural en Santa Fe",476438000,0,-796,476437204,0,476437204,0,476437204,100,0,388289971,81.5,"0004-016","FDL-LOCALIDADES",16,"LOCALIDADES"]
[3,"2022-12-31","O2306160120","Bogotá, referente en cultura, deporte, recreación y actividad física, con parques para el desarrollo y la salud",536706000,0,-10707926,525998074,0,525998074,-30351034,495647040,94,0,415943730,79.08,"0004-016","FDL-LOCALIDADES",16,"LOCALIDADES"]
[3,"2022-12-31","O23061601200000002100","Santa Fe , referente en cultura, deporte, recreación y actividad física, con parques para el desarrollo y la salud",536706000,0,-10707926,525998074,0,525998074,-30351034,495647040,94,0,415943730,79.08,"0004-016","FDL-LOCALIDADES",16,"LOCALIDADES"]
[3,"2022-12-31","O2306160121","Creación y vida cotidiana: Apropiación ciudadana del arte, la cultura y el patrimonio, para la democracia cultural",333507000,0,-952,333506048,0,333506048,0,333506048,100,0,333506048,100,"0004-016","FDL-LOCALIDADES",16,"LOCALIDADES"]
[3,"2022-12-31","O23061601210000002110","Apropiación ciudadana del arte, la cultura y el patrimonio en Santa Fe",333507000,0,-952,333506048,0,333506048,0,333506048,100,0,333506048,100,"0004-016","FDL-LOCALIDADES",16,"LOCALIDADES"]
[3,"2022-12-31","O2306160123","Bogotá rural",327789000,0,-8588278,319200722,0,319200722,0,319200722,100,0,144913245,45.4,"0004-016","FDL-LOCALIDADES",16,"LOCALIDADES"]
[3,"2022-12-31","O23061601230000002108","Santa Fe rural",327789000,0,-8588278,319200722,0,319200722,0,319200722,100,0,144913245,45.4,"0004-016","FDL-LOCALIDADES",16,"LOCALIDADES"]
[3,"2022-12-31","O2306160124","Bogotá región emprendedora e innovadora",171994000,0,-2816714,169177286,0,169177286,0,169177286,100,0,136829671,80.88,"0004-016","FDL-LOCALIDADES",16,"LOCALIDADES"]
[3,"2022-12-31","O23061601240000002123","Santa Fe región emprendedora e innovadora",171994000,0,-2816714,169177286,0,169177286,0,169177286,100,0,136829671,80.88,"0004-016","FDL-LOCALIDADES",16,"LOCALIDADES"]
[3,"2022-12-31","O23061602","Cambiar nuestros hábitos de vida para reverdecer a Bogotá y adaptarnos y mitigar la crisis climática",2321552000,0,-27229266,2294322734,0,2294322734,0,2294322734,100,69082095,1300769247,56.7,"0004-016","FDL-LOCALIDADES",16,"LOCALIDADES"]
[3,"2022-12-31","O2306160227","Cambio cultural para la gestión de la crisis climática",457257000,0,-5205733,452051267,0,452051267,0,452051267,100,772074,165961756,36.71,"0004-016","FDL-LOCALIDADES",16,"LOCALIDADES"]
[3,"2022-12-31","O23061602270000002122","Cambio cultural en Santa fe para la gestión de la crisis climática",457257000,0,-5205733,452051267,0,452051267,0,452051267,100,772074,165961756,36.71,"0004-016","FDL-LOCALIDADES",16,"LOCALIDADES"]
[3,"2022-12-31","O2306160230","Eficiencia en la atención de emergencias",299630000,0,-9888194,289741806,0,289741806,0,289741806,100,0,118216462,40.799999999999997,"0004-016","FDL-LOCALIDADES",16,"LOCALIDADES"]
[3,"2022-12-31","O23061602300000002159","Santa Fe eficiente en la atención de emergencias",299630000,0,-9888194,289741806,0,289741806,0,289741806,100,0,118216462,40.799999999999997,"0004-016","FDL-LOCALIDADES",16,"LOCALIDADES"]
[3,"2022-12-31","O2306160233","Más árboles y más y mejor espacio público",488212000,0,-70,488211930,0,488211930,0,488211930,100,0,439187065,89.96,"0004-016","FDL-LOCALIDADES",16,"LOCALIDADES"]
[3,"2022-12-31","O23061602330000002138","Más árboles y más y mejor espacio público en Santa Fe",488212000,0,-70,488211930,0,488211930,0,488211930,100,0,439187065,89.96,"0004-016","FDL-LOCALIDADES",16,"LOCALIDADES"]
[3,"2022-12-31","O2306160234","Bogotá protectora de los animales",292302000,0,-9007986,283294014,0,283294014,0,283294014,100,0,175865934,62.08,"0004-016","FDL-LOCALIDADES",16,"LOCALIDADES"]
[3,"2022-12-31","O23061602340000002074","Santa Fe protectora de los animales",292302000,0,-9007986,283294014,0,283294014,0,283294014,100,0,175865934,62.08,"0004-016","FDL-LOCALIDADES",16,"LOCALIDADES"]
[3,"2022-12-31","O2306160237","Provisión y mejoramiento de servicios públicos",196293000,0,-3970,196289030,0,196289030,0,196289030,100,0,89723864,45.71,"0004-016","FDL-LOCALIDADES",16,"LOCALIDADES"]
[3,"2022-12-31","O23061602370000002129","Provisión y mejoramiento de servicios públicos en Santa Fe",196293000,0,-3970,196289030,0,196289030,0,196289030,100,0,89723864,45.71,"0004-016","FDL-LOCALIDADES",16,"LOCALIDADES"]
[3,"2022-12-31","O2306160238","Ecoeficiencia, reciclaje, manejo de residuos e inclusión de la población recicladora",587858000,0,-3123313,584734687,0,584734687,0,584734687,100,68310021,311814166,53.33,"0004-016","FDL-LOCALIDADES",16,"LOCALIDADES"]
[3,"2022-12-31","O23061602380000002131","Ecoeficiencia y manejo de residuos en Santa Fe",587858000,0,-3123313,584734687,0,584734687,0,584734687,100,68310021,311814166,53.33,"0004-016","FDL-LOCALIDADES",16,"LOCALIDADES"]
[3,"2022-12-31","O23061603","Inspirar confianza y legitimidad para vivir sin miedo y ser epicentro de cultura ciudadana, paz y reconciliación",1494911000,0,-30103712,1464807288,0,1464807288,0,1462649874,100,127352561,1377154927,94.02,"0004-016","FDL-LOCALIDADES",16,"LOCALIDADES"]
[3,"2022-12-31","O2306160340","Más mujeres viven una vida libre de violencias, se sienten seguras y acceden con confianza al sistema de justicia",570907000,0,-2224842,568682158,0,568682158,0,566868846,100,127352561,516428121,90.81,"0004-016","FDL-LOCALIDADES",16,"LOCALIDADES"]
[3,"2022-12-31","O23061603400000002161","Santa Fe con más mujeres seguras y defensoras de sus derechos",570907000,0,-2224842,568682158,0,568682158,0,566868846,100,127352561,516428121,90.81,"0004-016","FDL-LOCALIDADES",16,"LOCALIDADES"]
[3,"2022-12-31","O2306160343","Cultura ciudadana para la confianza, la convivencia y la participación desde la vida cotidiana",63119000,0,-8487655,54631345,0,54631345,0,54631345,100,0,52890951,96.81,"0004-016","FDL-LOCALIDADES",16,"LOCALIDADES"]
[3,"2022-12-31","O23061603430000002128","Santa Fe con convivencia, justicia y seguridad",63119000,0,-8487655,54631345,0,54631345,0,54631345,100,0,52890951,96.81,"0004-016","FDL-LOCALIDADES",16,"LOCALIDADES"]
[3,"2022-12-31","O2306160345","Espacio público más seguro y construido colectivamente",608844000,0,-13955380,594888620,0,594888620,0,594544518,100,0,594544518,99.94,"0004-016","FDL-LOCALIDADES",16,"LOCALIDADES"]
[3,"2022-12-31","O23061603450000002130","Espacio público mas seguro y construido colectivamente en Santa Fe",608844000,0,-13955380,594888620,0,594888620,0,594544518,100,0,594544518,99.94,"0004-016","FDL-LOCALIDADES",16,"LOCALIDADES"]
[3,"2022-12-31","O2306160348","Plataforma institucional para la seguridad y justicia",252041000,0,-5435835,246605165,0,246605165,0,246605165,100,0,213291337,86.49,"0004-016","FDL-LOCALIDADES",16,"LOCALIDADES"]
[3,"2022-12-31","O23061603480000002163","Plataforma institucional para la seguridad y justicia en Santa Fe.",252041000,0,-5435835,246605165,0,246605165,0,246605165,100,0,213291337,86.49,"0004-016","FDL-LOCALIDADES",16,"LOCALIDADES"]
[3,"2022-12-31","O23061604","Hacer de Bogotá Región un modelo de movilidad multimodal, incluyente y sostenible",1261798000,0,-817248707,444549293,0,444549293,0,444549293,100,0,0,0,"0004-016","FDL-LOCALIDADES",16,"LOCALIDADES"]
[3,"2022-12-31","O2306160449","Movilidad segura, sostenible y accesible",1261798000,0,-817248707,444549293,0,444549293,0,444549293,100,0,0,0,"0004-016","FDL-LOCALIDADES",16,"LOCALIDADES"]
[3,"2022-12-31","O23061604490000002145","Movilidad segura, sostenible y accesible en Santa Fe",1261798000,0,-817248707,444549293,0,444549293,0,444549293,100,0,0,0,"0004-016","FDL-LOCALIDADES",16,"LOCALIDADES"]
[3,"2022-12-31","O23061605","Construir Bogotá Región con gobierno abierto, transparente y ciudadanía consciente",2180191000,0,-216365321,1963825679,0,1963825679,0,1957223344,100,40907785,1364208467,69.47,"0004-016","FDL-LOCALIDADES",16,"LOCALIDADES"]
[3,"2022-12-31","O2306160554","Transformación digital y gestión de TIC para un territorio inteligente",495495000,0,-21237912,474257088,0,474257088,0,474257088,100,0,0,0,"0004-016","FDL-LOCALIDADES",16,"LOCALIDADES"]
[3,"2022-12-31","O23061605540000002114","Transformación digital y gestión de TIC en Santa Fe",495495000,0,-21237912,474257088,0,474257088,0,474257088,100,0,0,0,"0004-016","FDL-LOCALIDADES",16,"LOCALIDADES"]
[3,"2022-12-31","O2306160555","Fortalecimiento de Cultura Ciudadana y su institucionalidad",969150000,0,-12863863,956286137,0,956286137,0,956286137,100,35451786,883909817,92.43,"0004-016","FDL-LOCALIDADES",16,"LOCALIDADES"]
[3,"2022-12-31","O23061605550000002156","Participación y cultura ciudadana en Santa Fe",969150000,0,-12863863,956286137,0,956286137,0,956286137,100,35451786,883909817,92.43,"0004-016","FDL-LOCALIDADES",16,"LOCALIDADES"]
[3,"2022-12-31","O2306160557","Gestión Pública Local",715546000,0,-182263546,533282454,0,533282454,0,526680119,99,5455999,480298650,90.06,"0004-016","FDL-LOCALIDADES",16,"LOCALIDADES"]
[3,"2022-12-31","O23061605570000001822","Santa Fe abierta y transparente",15546000,0,-8368518,7177482,0,7177482,0,7177482,100,0,7177482,100,"0004-016","FDL-LOCALIDADES",16,"LOCALIDADES"]
[3,"2022-12-31","O23061605570000002105","Gestión publica local en Santa Fe",700000000,0,-173895028,526104972,0,526104972,0,519502637,99,5455999,473121168,89.93,"0004-016","FDL-LOCALIDADES",16,"LOCALIDADES"]
[3,"2022-12-31","O230690","Obligaciones por pagar Inversión vigencias anteriores",8074051000,0,-2091261379,5982789621,0,5982789621,-116410692,5464713821,91,530919199,2872715933,48.02,"0004-016","FDL-LOCALIDADES",16,"LOCALIDADES"]
[3,"2022-12-31","O4","Disponibilidad final",0,0,0,0,0,0,0,0,0,0,0,0,"0004-016","FDL-LOCALIDADES",16,"LOCALIDADES"]

{"sheet":"Proposito_programa","index":3,"n_rows":59,"n_cols":5,"rows_kept":59,"cut":false,"hidden":false,"merged":[]}
[]
[null,"PDD","No. Programa","Programa","Propósito"]
["Acuerdo 761 2020","Un Nuevo Contrato Social y Ambiental para la Bogotá del Siglo XXI",1,"Subsidios y transferencias para la equidad","Propósito 1: Hacer un nuevo contrato social para incrementar la inclusión social, productiva y política"]
["Pag. 51","Un Nuevo Contrato Social y Ambiental para la Bogotá del Siglo XXI",{"$f":"+C3+1","v":2},"Igualdad de oportunidades y desarrollo de capacidades para las mujeres","Propósito 1: Hacer un nuevo contrato social para incrementar la inclusión social, productiva y política"]
[null,"Un Nuevo Contrato Social y Ambiental para la Bogotá del Siglo XXI",{"$f":"+C4+1","v":3},"Movilidad social integral","Propósito 1: Hacer un nuevo contrato social para incrementar la inclusión social, productiva y política"]
[null,"Un Nuevo Contrato Social y Ambiental para la Bogotá del Siglo XXI",4,"Prevención de la exclusión por razones étnicas, religiosas, sociales, políticas y de orientación sexual","Propósito 1: Hacer un nuevo contrato social para incrementar la inclusión social, productiva y política"]
[null,"Un Nuevo Contrato Social y Ambiental para la Bogotá del Siglo XXI",5,"Promoción de la igualdad, el desarrollo de capacidades y el reconocimiento de las mujeres","Propósito 1: Hacer un nuevo contrato social para incrementar la inclusión social, productiva y política"]
[null,"Un Nuevo Contrato Social y Ambiental para la Bogotá del Siglo XXI",6,"Sistema Distrital de Cuidado","Propósito 1: Hacer un nuevo contrato social para incrementar la inclusión social, productiva y política"]
[null,"Un Nuevo Contrato Social y Ambiental para la Bogotá del Siglo XXI",7,"Mejora de la gestión de instituciones de salud","Propósito 1: Hacer un nuevo contrato social para incrementar la inclusión social, productiva y política"]
[null,"Un Nuevo Contrato Social y Ambiental para la Bogotá del Siglo XXI",8,"Prevención y atención de maternidad temprana","Propósito 1: Hacer un nuevo contrato social para incrementar la inclusión social, productiva y política"]
[null,"Un Nuevo Contrato Social y Ambiental para la Bogotá del Siglo XXI",9,"Prevención y cambios para mejorar la salud de la población","Propósito 1: Hacer un nuevo contrato social para incrementar la inclusión social, productiva y política"]
[null,"Un Nuevo Contrato Social y Ambiental para la Bogotá del Siglo XXI",10,"Salud para la vida y el bienestar","Propósito 1: Hacer un nuevo contrato social para incrementar la inclusión social, productiva y política"]
[null,"Un Nuevo Contrato Social y Ambiental para la Bogotá del Siglo XXI",11,"Salud y bienestar para niñas y niños","Propósito 1: Hacer un nuevo contrato social para incrementar la inclusión social, productiva y política"]
[null,"Un Nuevo Contrato Social y Ambiental para la Bogotá del Siglo XXI",12,"Educación inicial: Bases sólidas para la vida.","Propósito 1: Hacer un nuevo contrato social para incrementar la inclusión social, productiva y política"]
[null,"Un Nuevo Contrato Social y Ambiental para la Bogotá del Siglo XXI",13,"Educación para todos y todas: acceso y permanencia con equidad y énfasis en educación rural","Propósito 1: Hacer un nuevo contrato social para incrementar la inclusión social, productiva y política"]
[null,"Un Nuevo Contrato Social y Ambiental para la Bogotá del Siglo XXI",14,"Formación integral: más y mejor tiempo en los colegios","Propósito 1: Hacer un nuevo contrato social para incrementar la inclusión social, productiva y política"]
[null,"Un Nuevo Contrato Social y Ambiental para la Bogotá del Siglo XXI",15,"Plan Distrital de Lectura, Escritura y Oralidad: \"Leer para la vida\"","Propósito 1: Hacer un nuevo contrato social para incrementar la inclusión social, productiva y política"]
[null,"Un Nuevo Contrato Social y Ambiental para la Bogotá del Siglo XXI",16,"Transformación pedagógica y mejoramiento de la gestión educativa. Es con los maestros y maestras.","Propósito 1: Hacer un nuevo contrato social para incrementar la inclusión social, productiva y política"]
[null,"Un Nuevo Contrato Social y Ambiental para la Bogotá del Siglo XXI",17,"Jóvenes con capacidades: Proyecto de vida para la ciudadanía, la innovación y el trabajo del siglo XXI","Propósito 1: Hacer un nuevo contrato social para incrementar la inclusión social, productiva y política"]
[null,"Un Nuevo Contrato Social y Ambiental para la Bogotá del Siglo XXI",18,"Cierre de brechas para la inclusión productiva urbano rural","Propósito 1: Hacer un nuevo contrato social para incrementar la inclusión social, productiva y política"]
[null,"Un Nuevo Contrato Social y Ambiental para la Bogotá del Siglo XXI",19,"Vivienda y entornos dignos en el territorio urbano y rural","Propósito 1: Hacer un nuevo contrato social para incrementar la inclusión social, productiva y política"]
[null,"Un Nuevo Contrato Social y Ambiental para la Bogotá del Siglo XXI",20,"Bogotá, referente en cultura, deporte, recreación y actividad física, con parques para el desarrollo y la salud","Propósito 1: Hacer un nuevo contrato social para incrementar la inclusión social, productiva y política"]
[null,"Un Nuevo Contrato Social y Ambiental para la Bogotá del Siglo XXI",21,"Creación y vida cotidiana: Apropiación ciudadana del arte, la cultura y el patrimonio, para la democracia cultural","Propósito 1: Hacer un nuevo contrato social para incrementar la inclusión social, productiva y política"]
[null,"Un Nuevo Contrato Social y Ambiental para la Bogotá del Siglo XXI",22,"Transformación cultural para la conciencia ambiental y el cuidado de la fauna doméstica","Propósito 1: Hacer un nuevo contrato social para incrementar la inclusión social, productiva y política"]
[null,"Un Nuevo Contrato Social y Ambiental para la Bogotá del Siglo XXI",23,"Bogotá rural","Propósito 1: Hacer un nuevo contrato social para incrementar la inclusión social, productiva y política"]
[null,"Un Nuevo Contrato Social y Ambiental para la Bogotá del Siglo XXI",24,"Bogotá región emprendedora e innovadora","Propósito 1: Hacer un nuevo contrato social para incrementar la inclusión social, productiva y política"]
[null,"Un Nuevo Contrato Social y Ambiental para la Bogotá del Siglo XXI",25,"Bogotá región productiva y competitiva","Propósito 1: Hacer un nuevo contrato social para incrementar la inclusión social, productiva y política"]
[null,"Un Nuevo Contrato Social y Ambiental para la Bogotá del Siglo XXI",26,"Bogotá - región, el mejor destino para visitar","Propósito 1: Hacer un nuevo contrato social para incrementar la inclusión social, productiva y política"]
[null,"Un Nuevo Contrato Social y Ambiental para la Bogotá del Siglo XXI",27,"Cambio cultural para la gestión de la crisis climática","Propósito 2 : Cambiar Nuestros Hábitos de Vida para Reverdecer a Bogotá y Adaptarnos y Mitigar la Crisis Climática"]
[null,"Un Nuevo Contrato Social y Ambiental para la Bogotá del Siglo XXI",{"$f":"+C29+1","v":28},"Bogotá protectora de sus recursos naturales","Propósito 2 : Cambiar Nuestros Hábitos de Vida para Reverdecer a Bogotá y Adaptarnos y Mitigar la Crisis Climática"]
[null,"Un Nuevo Contrato Social y Ambiental para la Bogotá del Siglo XXI",{"$f":"+C30+1","v":29},"Asentamientos y entornos protectores","Propósito 2 : Cambiar Nuestros Hábitos de Vida para Reverdecer a Bogotá y Adaptarnos y Mitigar la Crisis Climática"]
[null,"Un Nuevo Contrato Social y Ambiental para la Bogotá del Siglo XXI",30,"Eficiencia en la atención de emergencias","Propósito 2 : Cambiar Nuestros Hábitos de Vida para Reverdecer a Bogotá y Adaptarnos y Mitigar la Crisis Climática"]
[null,"Un Nuevo Contrato Social y Ambiental para la Bogotá del Siglo XXI",31," Protección y valoración del patrimonio tangible e intangible en Bogotá y la región","Propósito 2 : Cambiar Nuestros Hábitos de Vida para Reverdecer a Bogotá y Adaptarnos y Mitigar la Crisis Climática"]
[null,"Un Nuevo Contrato Social y Ambiental para la Bogotá del Siglo XXI",32,"Revitalización urbana para la competitividad","Propósito 2 : Cambiar Nuestros Hábitos de Vida para Reverdecer a Bogotá y Adaptarnos y Mitigar la Crisis Climática"]
[null,"Un Nuevo Contrato Social y Ambiental para la Bogotá del Siglo XXI",33,"Más árboles y más y mejor espacio público","Propósito 2 : Cambiar Nuestros Hábitos de Vida para Reverdecer a Bogotá y Adaptarnos y Mitigar la Crisis Climática"]
[null,"Un Nuevo Contrato Social y Ambiental para la Bogotá del Siglo XXI",34,"Bogotá protectora de los animales","Propósito 2 : Cambiar Nuestros Hábitos de Vida para Reverdecer a Bogotá y Adaptarnos y Mitigar la Crisis Climática"]
[null,"Un Nuevo Contrato Social y Ambiental para la Bogotá del Siglo XXI",35,"Manejo y prevención de contaminación","Propósito 2 : Cambiar Nuestros Hábitos de Vida para Reverdecer a Bogotá y Adaptarnos y Mitigar la Crisis Climática"]
[null,"Un Nuevo Contrato Social y Ambiental para la Bogotá del Siglo XXI",36,"Manejo y saneamiento de los cuerpos de agua","Propósito 2 : Cambiar Nuestros Hábitos de Vida para Reverdecer a Bogotá y Adaptarnos y Mitigar la Crisis Climática"]
[null,"Un Nuevo Contrato Social y Ambiental para la Bogotá del Siglo XXI",37,"Provisión y mejoramiento de servicios públicos","Propósito 2 : Cambiar Nuestros Hábitos de Vida para Reverdecer a Bogotá y Adaptarnos y Mitigar la Crisis Climática"]
[null,"Un Nuevo Contrato Social y Ambiental para la Bogotá del Siglo XXI",38,"Ecoeficiencia, reciclaje, manejo de residuos e inclusión de la población recicladora","Propósito 2 : Cambiar Nuestros Hábitos de Vida para Reverdecer a Bogotá y Adaptarnos y Mitigar la Crisis Climática"]
[null,"Un Nuevo Contrato Social y Ambiental para la Bogotá del Siglo XXI",39,"Bogotá territorio de paz y atención integral a las víctimas del conflicto armado","Propósito 3: Inspirar confianza y legitimidad para vivir sin miedo y ser epicentro de cultura ciudadana, paz y reconciliación"]
[null,"Un Nuevo Contrato Social y Ambiental para la Bogotá del Siglo XXI",{"$f":"+C41+1","v":40},"Más mujeres viven una vida libre de violencias, se sienten seguras y acceden con confianza al sistema de justicia","Propósito 3: Inspirar confianza y legitimidad para vivir sin miedo y ser epicentro de cultura ciudadana, paz y reconciliación"]
[null,"Un Nuevo Contrato Social y Ambiental para la Bogotá del Siglo XXI",{"$f":"+C42+1","v":41},"Sin machismo ni violencias contra las mujeres, las niñas y los niños","Propósito 3: Inspirar confianza y legitimidad para vivir sin miedo y ser epicentro de cultura ciudadana, paz y reconciliación"]
[null,"Un Nuevo Contrato Social y Ambiental para la Bogotá del Siglo XXI",42,"Conciencia y cultura ciudadana para la seguridad, la convivencia y la construcción de confianza","Propósito 3: Inspirar confianza y legitimidad para vivir sin miedo y ser epicentro de cultura ciudadana, paz y reconciliación"]
[null,"Un Nuevo Contrato Social y Ambiental para la Bogotá del Siglo XXI",43,"Cultura ciudadana para la confianza, la convivencia y la participación desde la vida cotidiana","Propósito 3: Inspirar confianza y legitimidad para vivir sin miedo y ser epicentro de cultura ciudadana, paz y reconciliación"]
[null,"Un Nuevo Contrato Social y Ambiental para la Bogotá del Siglo XXI",44,"Autoconciencia, respeto y cuidado en el espacio público","Propósito 3: Inspirar confianza y legitimidad para vivir sin miedo y ser epicentro de cultura ciudadana, paz y reconciliación"]
[null,"Un Nuevo Contrato Social y Ambiental para la Bogotá del Siglo XXI",45,"Espacio público más seguro y construido colectivamente","Propósito 3: Inspirar confianza y legitimidad para vivir sin miedo y ser epicentro de cultura ciudadana, paz y reconciliación"]
[null,"Un Nuevo Contrato Social y Ambiental para la Bogotá del Siglo XXI",46,"Atención a jóvenes y adultos infractores con impacto en su proyecto de vida","Propósito 3: Inspirar confianza y legitimidad para vivir sin miedo y ser epicentro de cultura ciudadana, paz y reconciliación"]
[null,"Un Nuevo Contrato Social y Ambiental para la Bogotá del Siglo XXI",47,"Calidad de Vida y Derechos de la Población privada de la libertad","Propósito 3: Inspirar confianza y legitimidad para vivir sin miedo y ser epicentro de cultura ciudadana, paz y reconciliación"]
[null,"Un Nuevo Contrato Social y Ambiental para la Bogotá del Siglo XXI",48,"Plataforma institucional para la seguridad y justicia","Propósito 3: Inspirar confianza y legitimidad para vivir sin miedo y ser epicentro de cultura ciudadana, paz y reconciliación"]
[null,"Un Nuevo Contrato Social y Ambiental para la Bogotá del Siglo XXI",49,"Movilidad segura, sostenible y accesible","Propósito 4: Hacer de Bogotá Región un modelo de movilidad multimodal, incluyente y sostenible"]
[null,"Un Nuevo Contrato Social y Ambiental para la Bogotá del Siglo XXI",{"$f":"+C51+1","v":50},"Red de metros","Propósito 4: Hacer de Bogotá Región un modelo de movilidad multimodal, incluyente y sostenible"]
[null,"Un Nuevo Contrato Social y Ambiental para la Bogotá del Siglo XXI",51,"Gobierno Abierto","Propósito 5: Construir Bogotá - Región con gobierno abierto, transparente y ciudadanía consciente"]
[null,"Un Nuevo Contrato Social y Ambiental para la Bogotá del Siglo XXI",{"$f":"+C53+1","v":52},"Integración regional, distrital y local","Propósito 5: Construir Bogotá - Región con gobierno abierto, transparente y ciudadanía consciente"]
[null,"Un Nuevo Contrato Social y Ambiental para la Bogotá del Siglo XXI",53,"Información para la toma de decisiones","Propósito 5: Construir Bogotá - Región con gobierno abierto, transparente y ciudadanía consciente"]
[null,"Un Nuevo Contrato Social y Ambiental para la Bogotá del Siglo XXI",54,"Transformación digital y gestión de TIC para un territorio inteligente","Propósito 5: Construir Bogotá - Región con gobierno abierto, transparente y ciudadanía consciente"]
[null,"Un Nuevo Contrato Social y Ambiental para la Bogotá del Siglo XXI",55,"Fortalecimiento de cultura ciudadana y su institucionalidad","Propósito 5: Construir Bogotá - Región con gobierno abierto, transparente y ciudadanía consciente"]
[null,"Un Nuevo Contrato Social y Ambiental para la Bogotá del Siglo XXI",56,"Gestión pública efectiva","Propósito 5: Construir Bogotá - Región con gobierno abierto, transparente y ciudadanía consciente"]
[null,"Un Nuevo Contrato Social y Ambiental para la Bogotá del Siglo XXI",57,"Gestión pública local","Propósito 5: Construir Bogotá - Región con gobierno abierto, transparente y ciudadanía consciente"]

{"sheet":"Tipo","index":4,"n_rows":67,"n_cols":5,"rows_kept":67,"cut":false,"hidden":true,"merged":[]}
[null,null,"Modalidad de Selección","afectacion","Naturaleza Jurídica"]
[1,null,"Concurso de méritos","Funcionamiento","Persona Natural"]
[2,null,"Contratación directa","Inversión","Persona Jurídica"]
[3,null,"Contratación mínima cuantia","Operación","Unión Temporal"]
[4,null,"Selección abreviada",null,"Consorcio"]
[5,null,"Licitación pública",null,"Sociedad con objeto único"]
[6,null,"Otros",null,"Persona jurídica extranjera"]
[7,null,"Régimen especial",null,"Sin ánimo de lucro"]
[8,null,null,null,"Cabildo indígena"]
[9,null,null,null,"Consejo comunitario de las comunidades negras"]
[10,null,"Selección abreviada",null,"Organizaciones de segundo nivel"]
[11,null,"Subasta inversa ",null,"Formas o expresiones organizativas, afrocolombianas, raizales y palenqueras"]
[12,null,"Bolsas de productos",null,"Organizaciones de base de comunidades negras "]
[13,null,"Acuerdo marco de precios ",null,"Asociaciones de autoridades tradicionales indígenas"]
[14,null,"Selección abreviada por menor cuantía "]
[15]
[16,null,"contratacion directa"]
[17,null,"Urgencia manifiesta"]
[18,null,"Contratación de empréstitos"]
[19,null,"Contratos interadministrativos"]
[20,null,"Contratación de bienes y servicios en el sector Defensa "]
[null,"SECTOR","Contratos para el desarrollo de actividades científicas y tecnológicas"]
[1,"Gestión Pública","Contratos de encargo fiduciario que celebren las entidades territoriales cuando inician el Acuerdo de Reestructuración de Pasivos"]
[{"$f":"+A23+1","v":2},"Gobierno","Cuando no exista pluralidad de oferentes en el mercado"]
[{"$f":"+A24+1","v":3},"Hacienda","Prestación de servicios profesionales y de apoyo a la gestión, o para la ejecución de trabajos artísticos que sólo puedan encomendarse a determinadas personas naturales"]
[4,"Planeación","El arrendamiento o adquisición de inmuebles"]
[5,"Desarrollo Económico, Industria y Turismo","Contratación de bienes y servicios de la Dirección Nacional de Inteligencia (DNI)"]
[6,"Educación"]
[7,"Salud"]
[8,"Integración Social","Decreto 92 de 2017"]
[9,"Cultura, Recreación y Deporte","No aplica"]
[10,"Ambiente"]
[11,"Movilidad","SECOP I"]
[12,"Hábitat","SECOP II"]
[13,"Mujeres"]
[14,"Seguridad, Convivencia y Justicia","Bogotá Mejor para Todos"]
[15,"Gestión Juridíca","Un Nuevo Contrato Social y Ambiental para la Bogotá del Siglo XXI"]
[16,"descentralizado territorialmente"]
[]
[null,"16 - AL","Estado"]
[null,null,"Celebrado o por iniciar"]
[null,"Plan de desarrollo distrital","En ejecución"]
[null,"Un nuevo contrato social y ambiental para la Bogotá del Siglo XXI","Terminado"]
[null,null,"Liquidado"]
[]
[null,"Tipo"]
[null,"Obra pública"]
[null,"Consultoría"]
[null,"Interventoría"]
[null,"Contratos de prestación de servicios"]
[null,"Contratos de prestación de servicios profesionales y de apoyo a la gestión"]
[null,"Compraventa de bienes muebles"]
[null,"Compraventa de bienes inmuebles"]
[null,"Arrendamiento de bienes muebles"]
[null,"Arrendamiento de bienes inmuebles"]
[null,"Seguro"]
[null,"Suministro"]
[null,"Empréstitos"]
[null,"Fiducia mercantil o encargo fiduciario"]
[null,"Concesión "]
[null,"Convenios de cooperacion"]
[null,"Convenios/Contratos interadministrativos"]
[null,"Convenios de apoyo o convenios de asociación "]
[null,"Convenios solidarios"]
[null,"Asociaciones Público Privadas"]
[null,"Otros"]
[null,"Otros gastos"]